<svg class="logo-svg" width="132px" height="22px" viewBox="0 0 132 22" version="1.1" xmlns="http://www.w3.org/2000/svg" xmlns:xlink="http://www.w3.org/1999/xlink">
    <g stroke="none" stroke-width="1" fill="none" fill-rule="evenodd">
        <g fill-rule="nonzero">
            <g>
                <g fill="#0076FF">
                    <polygon id="Rectangle-path" points="0 0.047826087 6.05533597 0.047826087 6.05533597 6.15362319 0 6.15362319"></polygon>
                    <polygon id="Rectangle-path" points="7.81027668 0.047826087 13.8656126 0.047826087 13.8656126 6.15362319 7.81027668 6.15362319"></polygon>
                    <polygon id="Rectangle-path" points="15.6363636 0.047826087 21.6916996 0.047826087 21.6916996 6.15362319 15.6363636 6.15362319"></polygon>
                    <polygon id="Rectangle-path" points="0 7.95507246 6.05533597 7.95507246 6.05533597 14.0608696 0 14.0608696"></polygon>
                    <polygon id="Rectangle-path" points="7.81027668 7.95507246 13.8656126 7.95507246 13.8656126 14.0608696 7.81027668 14.0608696"></polygon>
                    <polygon id="Rectangle-path" points="15.6363636 7.95507246 21.6916996 7.95507246 21.6916996 14.0608696 15.6363636 14.0608696"></polygon>
                    <polygon id="Rectangle-path" points="0 15.8623188 6.05533597 15.8623188 6.05533597 21.9681159 0 21.9681159"></polygon>
                    <polygon id="Rectangle-path" points="7.81027668 15.8623188 13.8656126 15.8623188 13.8656126 21.9681159 7.81027668 21.9681159"></polygon>
                    <polygon id="Rectangle-path" points="15.6363636 15.8623188 21.6916996 15.8623188 21.6916996 21.9681159 15.6363636 21.9681159"></polygon>
                </g>
                <g class="svg-bg" transform="translate(31.636364, 0.000000)" fill="#163056">
                    <path d="M6.24728407,7.62142857 C9.31612537,7.62142857 12.2753652,9.71142857 12.2753652,14.7557143 C12.2753652,19.9728571 8.95600624,21.9528571 5.38612963,21.9528571 C3.38198837,21.9528571 1.5187633,21.3242857 0.140916182,20.5228571 L0.140916182,0.0628571429 L1.67533683,0.0628571429 L1.67533683,9.38142857 C2.81832364,8.36 4.41537371,7.62142857 6.24728407,7.62142857 Z M5.29218551,20.5857143 C8.11050915,20.5857143 10.7409445,18.92 10.7409445,14.7871429 C10.7252872,11.1257143 8.70548858,9.03571429 6.10636789,9.03571429 C4.35274429,9.03571429 2.75569423,9.99428571 1.67533683,11.1885714 L1.67533683,19.6742857 C2.94358247,20.3185714 4.1805134,20.5857143 5.29218551,20.5857143 Z M14.96843,0.0471428571 L16.4402212,0.0471428571 L16.4402212,21.7171429 L14.96843,21.7171429 L14.96843,0.0471428571 Z M29.5297688,17.4585714 L29.5297688,7.84142857 L31.0641895,7.84142857 L31.0641895,21.7171429 L29.5297688,21.7171429 L29.5297688,19.03 C28.3241526,20.7428571 26.3826408,21.9214286 24.2845554,21.9214286 C22.0925259,21.9214286 20.0100979,20.68 20.0100979,16.4528571 L20.0100979,7.84142857 L21.5445185,7.84142857 L21.5445185,16.2957143 C21.5445185,19.5957143 23.1572259,20.4914286 24.7699333,20.4914286 C26.5861864,20.4914286 28.2458658,19.36 29.5297688,17.4585714 Z M40.787406,7.66857143 C44.4981988,7.76285714 47.0346901,10.7485714 46.5493122,15.1328571 L35.4639058,15.1328571 C35.4482485,17.71 37.2645015,20.4442857 40.8970075,20.57 C42.5097149,20.6328571 44.0128209,20.1457143 45.2184371,19.5014286 L45.7507871,20.79 C44.5451709,21.45 42.822862,22.0628571 40.8187207,21.9842857 C36.1841441,21.8428571 33.8042264,18.1814286 33.9607999,14.2842857 C34.1173734,9.91571429 37.3427883,7.54285714 40.787406,7.66857143 Z M35.5265352,13.86 L45.124493,13.86 C45.1871224,11.44 43.5117856,9.14571429 40.6621472,9.05142857 C37.8907956,8.95714286 35.7144235,11.0314286 35.5265352,13.86 Z M56.6169905,7.63714286 C59.3883421,7.63714286 61.0167069,9.72714286 61.0010495,12.8228571 L61.0010495,21.7171429 L59.4822862,21.7171429 L59.4822862,13.1528571 C59.4822862,10.1514286 57.9478656,9.08285714 56.2881861,9.06714286 C54.2840448,9.05142857 52.4834492,10.6228571 51.5440079,12.1942857 L51.5440079,21.7171429 L50.0095873,21.7171429 L50.0095873,0.0628571429 L51.5440079,0.0628571429 L51.5440079,10.56 C52.6869948,8.83142857 54.5189051,7.63714286 56.6169905,7.63714286 Z M70.1606013,7.63714286 C73.7148206,7.63714286 76.8149766,10.2771429 76.8149766,14.7714286 C76.8149766,19.36 73.7148206,21.9371429 70.1606013,21.9371429 C66.1836335,21.9371429 63.5062261,18.7314286 63.5062261,14.7714286 C63.5062261,10.56 66.4654659,7.63714286 70.1606013,7.63714286 Z M70.1606013,20.4914286 C73.3703588,20.4914286 75.2805559,17.82 75.2805559,14.7557143 C75.2805559,11.6757143 73.3860162,9.05142857 70.1606013,9.05142857 C66.8568997,9.05142857 65.0563041,11.6757143 65.0563041,14.7557143 C65.0563041,17.82 66.8412424,20.4914286 70.1606013,20.4914286 Z M84.7219402,14.2842857 C88.0412991,15.6042857 88.7615374,17.0971429 88.7615374,18.3385714 C88.7615374,20.5228571 86.7417388,21.89 84.0486739,21.89 C82.5299107,21.89 81.0424621,21.45 79.6646149,20.6328571 L80.3222238,19.3128571 C81.4652106,20.0985714 82.764771,20.4914286 84.0017019,20.4914286 C85.4421784,20.4914286 87.2427741,19.8942857 87.2271167,18.4328571 C87.2271167,17.1914286 85.8962417,16.2171429 83.7824989,15.3842857 C81.4338959,14.4414286 79.3827826,13.5771429 79.3827826,11.3614286 C79.3827826,9.14571429 81.4495533,7.66857143 84.1739328,7.66857143 C85.598752,7.66857143 86.8983123,8.09285714 88.0099844,8.67428571 L87.4306623,9.88428571 C86.5538505,9.42857143 85.4578358,9.06714286 84.2209048,9.06714286 C81.9349312,9.06714286 80.9015459,10.1828571 80.9015459,11.3614286 C80.9015459,12.8542857 82.5925401,13.4042857 84.7219402,14.2842857 Z M99.815629,19.9571429 L100.254035,21.3085714 C99.330251,21.6542857 98.2812083,21.9371429 97.1851936,21.9214286 C94.6956744,21.9214286 92.7228478,20.3971429 92.7228478,16.83 L92.7228478,9.14571429 L90.248986,9.14571429 L90.248986,7.84142857 L92.7228478,7.84142857 L92.7228478,3.19 L94.2572685,3.19 L94.2572685,7.85714286 L98.8292157,7.85714286 L98.8292157,9.16142857 L94.2572685,9.16142857 L94.2572685,16.7357143 C94.2572685,18.9671429 95.1967097,20.4285714 97.2165083,20.4914286 C98.0776627,20.5385714 99.0014466,20.3342857 99.815629,19.9571429 Z"></path>
                </g>
            </g>
        </g>
    </g>
</svg>