<svg version="1.1" viewBox="0 0 256 256" xml:space="preserve" xmlns="http://www.w3.org/2000/svg">
  <path id="fedora-ready" d="m160 16c-44.17852 0-79.955575 35.784921-79.984375 79.927734h-0.015625v61.929686h0.01563c0.014847 10.03573 8.141683 18.14258 18.173823 18.14258h61.845707c44.17853-0.03572 79.96484-35.82147 79.96484-80s-35.82147-80-80-80zm-121.617188 0.28125a4.8 4.8 0 0 0-2.498046 2.048828l-15.769532 26.28125a28.882538 28.882538 0 0 0-4.115234 14.859375v172.529297a8 8 0 0 0 8 8h208a8 8 0 0 0 8-8v-32a8 8 0 0 0-8-8h-160a8 8 0 0 1-8-8v-124.529297a28.882538 28.882538 0 0 0-4.115234-14.859375l-15.769532-26.28125a4.8 4.8 0 0 0-5.732422-2.048828zm1.095704 15.769531a2.6666669 2.6666669 0 0 1 2.740234 1.136719l11.5625 17.34375a13.211102 13.211102 0 0 1 2.21875 7.328125v16a1.2111026 1.2111026 0 0 1-2.21875 0.671875l-11.5625-17.34375a2.6666667 2.6666667 0 0 0-4.4375 0l-11.5625 17.34375a1.2111026 1.2111026 0 0 1-2.21875-0.671875v-16a13.211102 13.211102 0 0 1 2.21875-7.328125l11.5625-17.34375a2.6666669 2.6666669 0 0 1 1.697266-1.136719zm136.736324 16.876953c13.42856 0 26.14258 10.286283 26.14258 24.464844 0 1.321432-0.0357 2.642571-0.25 4.142578-0.35714 3.749996-3.78654 6.465392-7.57226 5.929688-3.75-0.53573-6.28599-4.07227-5.60743-7.822266 0.0714-0.428565 0.10743-1.107143 0.10743-2.25 0-8.035703-6.57032-11.142578-12.82032-11.142578-6.21428 0-11.82172 5.249731-11.85742 11.142578 0.0714 4.571432 0.0709 9.106875 0.0352 13.642578 0 2.285718-0.0352 4.571714-0.0352 6.857422l11.57031-0.107422c8.99996-0.17857 9.10796 13.393664 0.0723 13.322264l-11.64258 0.10742-0.0723 19.10743c-1.39285 14.99998-14.14289 27-29.5 27-16.24999 0-29.65625-13.32174-29.65625-29.60743 0.48572-16.74998 13.87195-29.929965 30.69336-29.787106l9.39257-0.07031v13.320306l-9.39257 0.0723h-0.07226c-9.25 0.2857-17.1437 6.572-17.32227 16.46484 0 9.0357 7.32174 16.25 16.35743 16.25 9.03571 0 15.96484-6.57143 15.96484-16.25 0.35713-8.74999 0.32141-18.036 0-27.357416 0.28569-7.714262 0.24956-15.46428 0.28516-23 0-1.249992 0.0712-1.678015 0.14257-3.035156 1.53572-11.999988 12.57284-21.394532 25.03711-21.394532zm-136.736324 31.123047a2.6666669 2.6666669 0 0 1 2.740234 1.136719l11.5625 17.34375a13.211102 13.211102 0 0 1 2.21875 7.32813v16a1.2111026 1.2111026 0 0 1-2.21875 0.67187l-11.5625-17.34375a2.6666667 2.6666667 0 0 0-4.4375 0l-11.5625 17.34375a1.2111026 1.2111026 0 0 1-2.21875-0.67187v-16a13.211102 13.211102 0 0 1 2.21875-7.32813l11.5625-17.34375a2.6666669 2.6666669 0 0 1 1.697266-1.136719zm0 47.999999a2.6666669 2.6666669 0 0 1 2.740234 1.13672l11.5625 17.34375a13.211102 13.211102 0 0 1 2.21875 7.32813v16a1.2111026 1.2111026 0 0 1-2.21875 0.67187l-11.5625-17.34375a2.6666667 2.6666667 0 0 0-4.4375 0l-11.5625 17.34375a1.2111026 1.2111026 0 0 1-2.21875-0.67187v-16a13.211102 13.211102 0 0 1 2.21875-7.32813l11.5625-17.34375a2.6666669 2.6666669 0 0 1 1.697266-1.13672zm2.759765 74.94922h5.53125c5.142346 0 8.867188 3.524 8.867188 8.55859 0 2.94856-1.407784 5.37084-3.705078 6.79883l4.138671 6.65625c1.134224 1.84309 0.077951 3.98633-2.078124 3.98633-0.933786 0-1.699987-0.41684-2.222657-1.22461a1 1 0 0 1-0.0098-0.0137l-4.992153-8.01169h-2.929687v6.65234c0 1.47324-1.127955 2.59766-2.59961 2.59766-1.471654 0-2.597656-1.12601-2.597656-2.59766v-20.80468c0-1.47165 1.126002-2.59766 2.597656-2.59766zm37.421875 0h13.890625c1.449757 0 2.566406 1.04215 2.566407 2.50586 0 1.48465-1.117594 2.44336-2.566407 2.44336h-11.292969v5.46875h7.820313c1.421551 0 2.566406 1.05239 2.566406 2.47461s-1.144863 2.47461-2.566406 2.47461h-7.820313v5.68359h11.292969c1.448822 0 2.566406 0.95872 2.566407 2.44336 0 1.46372-1.116658 2.50586-2.566407 2.50586h-13.890625c-1.471654 0-2.597656-1.12601-2.597656-2.59766v-20.80468c0-1.47165 1.126002-2.59766 2.597656-2.59766zm45.687504 0c1.10608 0 2.02726 0.62025 2.4414 1.72461l8.65235 20.64453a1 1 0 0 1 4e-3 0.0117c0.71368 1.76039-0.49228 3.61914-2.37109 3.61914-1.00111 0-1.99939-0.60391-2.40234-1.61133l-1.46876-3.67383h-9.68359l-1.49805 3.67969a1 1 0 0 1-6e-3 0.0176c-0.43925 1.02508-1.42272 1.58789-2.39449 1.58789-1.91455 0-3.10211-1.9627-2.33007-3.70703 6e-4 -1e-3 1e-3 -3e-3 2e-3 -4e-3l8.62695-20.59961c0.44778-1.07472 1.33418-1.68936 2.42769-1.68936zm33.42578 0h5.5625c7.56883 0 12.89258 5.42591 12.89258 12.98438 0 7.58678-5.32369 13.01562-12.89258 13.01562h-5.5625c-1.47166 0-2.59766-1.126-2.59766-2.59766v-20.80468c0-1.47166 1.126-2.59766 2.59766-2.59766zm37.91406 0c1.1298 0 1.77627 0.59186 2.25977 1.35742l6.34765 10.06446 6.4668-10.18946c0.47041-0.7527 1.24167-1.23242 2.25781-1.23242 1.99693 0 2.96162 2.29587 1.89258 4.01562a1 1 0 0 1-0.01 0.0156l-8.10546 12.50586v6.86523c0 1.45272-1.14495 2.59766-2.59766 2.59766-1.42494 0-2.56641-1.16187-2.56641-2.59766v-6.86523l-8.04101-12.49805-2e-3 -2e-3 -4e-3 -8e-3c-1.22775-1.8795 0.09565-4.02903 2.10193-4.02903zm-35.31641 4.82812v16.34376h2.96485c4.6091 0 7.82031-3.31993 7.82031-8.1875 0-4.86758-3.20667-8.15626-7.82031-8.15626zm-116.533199 0.1211v6.85156h2.93164c2.326226 0 3.794922-1.35525 3.794922-3.24219 0-2.14992-1.509486-3.60937-3.794922-3.60937zm80.562499 3.8418-2.98633 7.28125h5.91016z" style="fill:#ffffff"/>
</svg>
