ConferenceName,TalkName,PresenterNames
BestCon,The Pandas Are Marching,Beefy D. Miracle
Fedora Nest,Why Fedora is the Best Linux,Colúr and Badger
BambooFest 2022,Bamboo Tastes Better with Fedora,Panda
AwesomeCon,The Best Talk You Ever Heard,Dr. Ver E. Awesome
