<?xml version="1.0" encoding="UTF-8" standalone="no"?>
<svg
   width="640"
   height="640"
   viewBox="0 0 640 640"
   fill="none"
   version="1.1"
   id="svg7"
   sodipodi:docname="F40 release blue icon.svg"
   inkscape:version="1.3 (0e150ed, 2023-07-21)"
   xmlns:inkscape="http://www.inkscape.org/namespaces/inkscape"
   xmlns:sodipodi="http://sodipodi.sourceforge.net/DTD/sodipodi-0.dtd"
   xmlns="http://www.w3.org/2000/svg"
   xmlns:svg="http://www.w3.org/2000/svg">
  <defs
     id="defs7" />
  <sodipodi:namedview
     id="namedview7"
     pagecolor="#ffffff"
     bordercolor="#000000"
     borderopacity="0.25"
     inkscape:showpageshadow="2"
     inkscape:pageopacity="0.0"
     inkscape:pagecheckerboard="0"
     inkscape:deskcolor="#d1d1d1"
     inkscape:zoom="0.67642371"
     inkscape:cx="292.71594"
     inkscape:cy="308.97794"
     inkscape:window-width="1512"
     inkscape:window-height="831"
     inkscape:window-x="0"
     inkscape:window-y="38"
     inkscape:window-maximized="1"
     inkscape:current-layer="svg7" />
  <rect
     width="640"
     height="640"
     fill="#ffd117"
     id="rect1"
     x="0"
     y="0"
     style="display:inline"
     inkscape:label="base" />
  <circle
     cx="320"
     cy="320"
     r="278"
     fill="#ffffff"
     id="circle1"
     style="display:inline" />
  <path
     d="M156.023 337.915H493.599V496.107C493.599 499.1 492.415 501.971 490.307 504.087C488.199 506.203 485.341 507.392 482.36 507.392H167.262C164.281 507.392 161.422 506.203 159.315 504.087C157.207 501.971 156.023 499.1 156.023 496.107V337.915Z"
     fill="white"
     stroke="#51A2DA"
     stroke-width="10"
     stroke-linecap="round"
     stroke-linejoin="round"
     id="path1"
     inkscape:label="cake bg" />
  <path
     d="M489.73 411.275H161.268V457.719H489.73V411.275Z"
     fill="#51A2DA"
     stroke="#51A2DA"
     stroke-width="10"
     stroke-linecap="round"
     stroke-linejoin="round"
     id="path2"
     inkscape:label="cream filling" />
  <path
     d="M348.037 389.372C348.037 384.889 346.257 380.59 343.087 377.42C339.917 374.25 335.617 372.469 331.134 372.469C326.651 372.469 322.352 374.25 319.182 377.42C316.012 380.59 314.231 384.889 314.231 389.372V395.007C314.231 396.486 313.94 397.952 313.374 399.319C312.807 400.686 311.977 401.928 310.931 402.975C309.884 404.021 308.642 404.851 307.275 405.418C305.908 405.984 304.442 406.275 302.963 406.275C301.483 406.275 300.018 405.984 298.65 405.418C297.283 404.851 296.041 404.021 294.995 402.975C293.948 401.928 293.118 400.686 292.552 399.319C291.985 397.952 291.694 396.486 291.694 395.007V389.372C291.694 387.878 291.1 386.445 290.044 385.388C288.987 384.332 287.554 383.738 286.06 383.738C284.565 383.738 283.132 384.332 282.076 385.388C281.019 386.445 280.425 387.878 280.425 389.372V405.068C280.533 410.561 278.709 415.917 275.27 420.202C271.831 424.486 266.997 427.427 261.611 428.511C258.375 429.05 255.062 428.88 251.899 428.012C248.735 427.145 245.799 425.6 243.292 423.485C240.785 421.37 238.767 418.736 237.378 415.764C235.99 412.793 235.264 409.555 235.25 406.275V378.104C235.25 382.587 233.469 386.886 230.299 390.056C227.129 393.226 222.83 395.007 218.347 395.007C213.864 395.007 209.565 393.226 206.395 390.056C203.225 386.886 201.444 382.587 201.444 378.104V372.469C201.593 370.893 201.411 369.303 200.91 367.802C200.408 366.3 199.599 364.92 198.534 363.749C197.468 362.578 196.17 361.642 194.722 361.002C193.274 360.362 191.708 360.032 190.125 360.032C188.542 360.032 186.976 360.362 185.528 361.002C184.08 361.642 182.782 362.578 181.716 363.749C180.651 364.92 179.842 366.3 179.34 367.802C178.839 369.303 178.657 370.893 178.806 372.469V383.738C178.799 389.771 177.182 395.693 174.122 400.893C171.062 406.093 166.671 410.382 161.4 413.318C159.68 414.198 157.763 414.621 155.832 414.546C153.902 414.471 152.023 413.901 150.376 412.891C148.729 411.881 147.37 410.464 146.428 408.777C145.487 407.09 144.995 405.189 145 403.257V338.563C145 305.36 208.084 256.261 294.511 245.898C300.668 245.196 306.9 246.206 312.521 248.816L492.92 332.526C496.767 334.317 500.034 337.153 502.346 340.711C504.659 344.269 505.925 348.406 506 352.648V433.139C505.998 433.976 505.813 434.803 505.458 435.561C505.103 436.32 504.585 436.991 503.943 437.528C503.3 438.065 502.548 438.454 501.739 438.67C500.93 438.885 500.083 438.92 499.259 438.773C491.798 437.241 485.071 433.241 480.161 427.418C475.252 421.596 472.445 414.29 472.194 406.678C472.25 402.629 470.94 398.679 468.476 395.466C466.012 392.253 462.536 389.965 458.611 388.97C456.166 388.513 453.65 388.599 451.241 389.221C448.833 389.843 446.59 390.986 444.671 392.569C442.752 394.152 441.204 396.137 440.136 398.383C439.068 400.63 438.505 403.083 438.489 405.571V412.212C438.489 416.694 436.708 420.994 433.538 424.164C430.368 427.334 426.069 429.115 421.586 429.115C417.103 429.115 412.803 427.334 409.633 424.164C406.463 420.994 404.683 416.694 404.683 412.212V400.641C404.683 399.147 404.089 397.714 403.032 396.657C401.976 395.6 400.543 395.007 399.048 395.007C397.554 395.007 396.121 395.6 395.064 396.657C394.008 397.714 393.414 399.147 393.414 400.641V416.337C393.522 421.829 391.697 427.186 388.258 431.47C384.82 435.755 379.985 438.696 374.599 439.78C371.364 440.319 368.05 440.149 364.887 439.281C361.724 438.413 358.787 436.869 356.28 434.754C353.773 432.639 351.755 430.005 350.367 427.033C348.978 424.062 348.252 420.824 348.239 417.544L348.037 389.372Z"
     fill="#51A2DA"
     id="path3"
     inkscape:label="extra cake top" />
  <path
     d="M449.557 338.562H178.807M348.037 389.372C348.037 384.889 346.257 380.59 343.087 377.42C339.917 374.25 335.617 372.469 331.134 372.469C326.651 372.469 322.352 374.25 319.182 377.42C316.012 380.59 314.231 384.889 314.231 389.372V395.007C314.231 396.486 313.94 397.952 313.374 399.319C312.807 400.686 311.977 401.928 310.931 402.975C309.884 404.021 308.642 404.851 307.275 405.418C305.908 405.984 304.442 406.275 302.963 406.275C301.483 406.275 300.018 405.984 298.65 405.418C297.283 404.851 296.041 404.021 294.995 402.975C293.948 401.928 293.118 400.686 292.552 399.319C291.985 397.952 291.694 396.486 291.694 395.007V389.372C291.694 387.878 291.1 386.445 290.044 385.388C288.987 384.332 287.554 383.738 286.06 383.738C284.565 383.738 283.132 384.332 282.076 385.388C281.019 386.445 280.425 387.878 280.425 389.372V405.068C280.533 410.561 278.709 415.917 275.27 420.202C271.831 424.486 266.997 427.427 261.611 428.511C258.375 429.05 255.062 428.88 251.899 428.012C248.735 427.145 245.799 425.6 243.292 423.485C240.785 421.37 238.767 418.736 237.378 415.764C235.99 412.793 235.264 409.555 235.25 406.275V378.104C235.25 382.587 233.469 386.886 230.299 390.056C227.129 393.226 222.83 395.007 218.347 395.007C213.864 395.007 209.565 393.226 206.395 390.056C203.225 386.886 201.444 382.587 201.444 378.104V372.469C201.593 370.893 201.411 369.303 200.91 367.802C200.408 366.3 199.599 364.92 198.534 363.749C197.468 362.578 196.17 361.642 194.722 361.002C193.274 360.362 191.708 360.032 190.125 360.032C188.542 360.032 186.976 360.362 185.528 361.002C184.08 361.642 182.782 362.578 181.717 363.749C180.651 364.92 179.842 366.3 179.341 367.802C178.839 369.303 178.657 370.893 178.806 372.469V383.738C178.799 389.771 177.182 395.693 174.122 400.893C171.062 406.093 166.671 410.382 161.4 413.318C159.68 414.198 157.763 414.621 155.832 414.546C153.902 414.471 152.023 413.901 150.376 412.891C148.729 411.881 147.37 410.464 146.428 408.777C145.487 407.09 144.995 405.189 145 403.257V338.563C145 305.36 208.084 256.261 294.511 245.898C300.669 245.196 306.9 246.206 312.521 248.816L492.92 332.526C496.767 334.317 500.034 337.153 502.346 340.711C504.659 344.269 505.925 348.406 506 352.648V433.139C505.998 433.976 505.813 434.803 505.458 435.561C505.103 436.32 504.585 436.991 503.943 437.528C503.3 438.065 502.548 438.454 501.739 438.67C500.93 438.885 500.083 438.92 499.259 438.773C491.798 437.241 485.071 433.241 480.161 427.418C475.252 421.596 472.445 414.29 472.194 406.678C472.25 402.629 470.94 398.679 468.476 395.466C466.012 392.253 462.536 389.965 458.611 388.97C456.166 388.513 453.65 388.599 451.241 389.221C448.833 389.843 446.59 390.986 444.671 392.569C442.752 394.152 441.204 396.137 440.136 398.383C439.068 400.63 438.505 403.083 438.489 405.571V412.211C438.489 416.694 436.708 420.994 433.538 424.164C430.368 427.334 426.069 429.115 421.586 429.115C417.103 429.115 412.803 427.334 409.633 424.164C406.463 420.994 404.683 416.694 404.683 412.211V400.641C404.683 399.147 404.089 397.714 403.032 396.657C401.976 395.6 400.543 395.007 399.048 395.007C397.554 395.007 396.121 395.6 395.064 396.657C394.008 397.714 393.414 399.147 393.414 400.641V416.337C393.522 421.829 391.697 427.186 388.258 431.47C384.82 435.755 379.985 438.696 374.599 439.78C371.364 440.319 368.05 440.149 364.887 439.281C361.724 438.413 358.787 436.869 356.28 434.754C353.773 432.639 351.755 430.005 350.367 427.033C348.978 424.062 348.252 420.824 348.239 417.544L348.037 389.372Z"
     stroke="white"
     stroke-width="10"
     stroke-linecap="round"
     stroke-linejoin="round"
     id="path4"
     inkscape:label="icing" />
  <path
     d="M210.725 134.34C209.084 141.251 210.255 148.531 213.982 154.578C217.708 160.626 223.685 164.945 230.596 166.586C237.507 168.227 244.787 167.056 250.834 163.329C256.882 159.603 261.201 153.626 262.842 146.715C267.47 127.196 237.689 123.977 238.393 95C231.178 99.1257 224.958 104.789 220.176 111.588C215.395 118.386 212.168 126.154 210.725 134.34Z"
     fill="#51A2DA"
     stroke="#51A2DA"
     stroke-width="10"
     stroke-linecap="round"
     stroke-linejoin="round"
     id="path5"
     inkscape:label="flame" />
  <path
     d="M217.334 200.591C217.32 200.615 217.307 200.639 217.293 200.663C214.164 206.279 212.494 212.645 212.139 219.63H210.607C207.309 219.63 204.092 220.549 201.482 222.833C198.761 225.215 197.5 228.425 197.5 231.882C197.5 235.332 198.903 238.367 201.482 240.625C204.092 242.909 207.309 243.827 210.607 243.827H212.066V298.174C212.066 301.945 213.438 305.395 216.349 307.97C218.913 310.24 222.026 311.5 225.496 311.5C229.171 311.5 232.785 310.505 235.593 307.843C238.346 305.232 239.574 301.82 239.574 298.174V243.827H250.582C253.881 243.827 257.097 242.909 259.707 240.625L256.085 236.486L259.707 240.625C262.287 238.367 263.689 235.332 263.689 231.882C263.689 228.425 262.428 225.215 259.707 222.833L256.085 226.972L259.707 222.833C257.097 220.549 253.881 219.63 250.582 219.63H239.61C239.76 216.82 240.379 214.556 241.333 212.723C242.576 210.539 244.233 208.875 246.367 207.646C248.439 206.454 250.972 205.771 254.143 205.771C257.601 205.771 260.914 204.773 263.604 202.404L263.614 202.395C266.265 200.049 267.897 196.918 267.897 193.212C267.897 189.507 266.343 186.299 263.533 183.958C260.856 181.635 257.571 180.653 254.143 180.653C246.13 180.653 238.828 182.358 232.401 185.934C226.015 189.385 220.966 194.298 217.334 200.591Z"
     fill="white"
     stroke="#51A2DA"
     stroke-width="11"
     stroke-linejoin="round"
     id="path6"
     inkscape:label="f" />
  <path
     d="M320.694 259.221H296.912L320.694 229.551V259.221ZM258.554 272.085C258.56 272.197 258.57 272.309 258.583 272.42C258.952 275.572 260.363 278.312 262.544 280.539C265.216 283.268 268.714 284.339 272.3 284.339H320.694V298.174C320.694 301.77 322.02 304.996 324.54 307.557C327.087 310.144 330.335 311.5 333.963 311.5C337.644 311.5 341.053 310.254 343.709 307.557C346.23 304.996 347.555 301.77 347.555 298.174V284.339H351.766C355.194 284.339 358.399 283.3 361.084 281.093C361.136 281.051 361.187 281.007 361.237 280.963C363.888 278.617 365.52 275.486 365.52 271.78C365.52 268.043 364.325 264.005 360.531 261.607C357.883 259.933 354.879 259.221 351.766 259.221H347.555V194.133C347.555 190.632 346.42 187.38 344.011 184.745C341.466 181.96 338.103 180.653 334.448 180.653C332.212 180.653 330.044 181.151 328.038 182.189C327.972 182.222 327.908 182.257 327.844 182.294C326.159 183.252 324.696 184.503 323.447 185.983C323.42 186.015 323.393 186.048 323.366 186.081L261.379 263.115C261.357 263.142 261.335 263.17 261.314 263.198C259.314 265.783 258.373 268.826 258.554 272.085ZM388.739 303.151C388.767 303.174 388.795 303.197 388.823 303.22C395.723 308.792 403.988 311.5 413.319 311.5C422.678 311.5 430.928 308.722 437.736 302.997L437.741 302.993C444.495 297.302 449.408 289.468 452.676 279.839L452.682 279.821C455.94 270.113 457.5 258.803 457.5 246C457.5 233.203 455.942 221.938 452.679 212.322C449.421 202.618 444.515 194.765 437.739 189.158C430.94 183.337 422.69 180.5 413.319 180.5C403.959 180.5 395.679 183.277 388.781 188.968C382.075 194.488 377.216 202.314 373.958 212.015C370.693 221.639 369.138 233.01 369.138 246C369.138 258.997 370.695 270.412 373.955 280.128L373.961 280.146C377.223 289.755 382.077 297.549 388.739 303.151ZM405.199 211.211C405.214 211.193 405.23 211.175 405.245 211.156C407.46 208.496 410.025 207.306 413.319 207.306C416.613 207.306 419.177 208.496 421.392 211.156C423.938 214.213 426.071 218.635 427.558 224.743C429.053 230.884 429.83 237.955 429.83 246C429.83 254.045 429.053 261.116 427.558 267.257C426.076 273.346 423.951 277.76 421.416 280.816C419.225 283.365 416.656 284.541 413.319 284.541C410.124 284.541 407.51 283.389 405.169 280.754C402.676 277.824 400.56 273.494 399.079 267.41C397.586 261.274 396.808 254.153 396.808 246C396.808 237.847 397.586 230.726 399.079 224.59C400.566 218.482 402.692 214.142 405.199 211.211Z"
     fill="white"
     stroke="#51A2DA"
     stroke-width="11"
     stroke-linejoin="round"
     id="path7"
     inkscape:label="40" />
</svg>
