<?xml version="1.0" encoding="UTF-8" standalone="no"?>
<!-- Created with Inkscape (http://www.inkscape.org/) -->

<svg
   width="1080"
   height="1080"
   viewBox="0 0 285.75002 285.75001"
   version="1.1"
   id="svg2209"
   inkscape:version="1.3 (0e150ed6c4, 2023-07-21)"
   sodipodi:docname="FAW_square.svg"
   inkscape:export-filename="../Design/FAWv1.png"
   inkscape:export-xdpi="150"
   inkscape:export-ydpi="150"
   xml:space="preserve"
   xmlns:inkscape="http://www.inkscape.org/namespaces/inkscape"
   xmlns:sodipodi="http://sodipodi.sourceforge.net/DTD/sodipodi-0.dtd"
   xmlns:xlink="http://www.w3.org/1999/xlink"
   xmlns="http://www.w3.org/2000/svg"
   xmlns:svg="http://www.w3.org/2000/svg"
   xmlns:rdf="http://www.w3.org/1999/02/22-rdf-syntax-ns#"
   xmlns:cc="http://creativecommons.org/ns#"
   xmlns:dc="http://purl.org/dc/elements/1.1/"><defs
     id="defs2203"><color-profile
       name="sRGB"
       xlink:href="file:///app/share/color/icc/colord/sRGB.icc"
       id="color-profile2" /><linearGradient
       id="linearGradient59"
       inkscape:collect="always"><stop
         style="stop-color:#a07cbc;stop-opacity:1;"
         offset="0"
         id="stop59" /><stop
         style="stop-color:#5aa2da;stop-opacity:1;"
         offset="1"
         id="stop60" /></linearGradient><linearGradient
       id="linearGradient55"
       inkscape:collect="always"><stop
         style="stop-color:#a07cbc;stop-opacity:1;"
         offset="0"
         id="stop56" /><stop
         style="stop-color:#51a2da;stop-opacity:1;"
         offset="1"
         id="stop57" /></linearGradient><linearGradient
       inkscape:collect="always"
       xlink:href="#linearGradient55"
       id="linearGradient57"
       x1="4.5174294"
       y1="250.77957"
       x2="28.021767"
       y2="250.28772"
       gradientUnits="userSpaceOnUse" /><linearGradient
       inkscape:collect="always"
       xlink:href="#linearGradient59"
       id="linearGradient60"
       x1="-175.9803"
       y1="178.44139"
       x2="-159.78548"
       y2="195.01216"
       gradientUnits="userSpaceOnUse" /></defs><sodipodi:namedview
     id="base"
     pagecolor="#ffffff"
     bordercolor="#666666"
     borderopacity="1.0"
     inkscape:pageopacity="0.0"
     inkscape:pageshadow="2"
     inkscape:zoom="0.48264845"
     inkscape:cx="941.67919"
     inkscape:cy="625.71422"
     inkscape:document-units="mm"
     inkscape:current-layer="layer1"
     showgrid="false"
     inkscape:window-width="1853"
     inkscape:window-height="827"
     inkscape:window-x="50"
     inkscape:window-y="95"
     inkscape:window-maximized="0"
     units="px"
     showguides="true"
     inkscape:guide-bbox="true"
     inkscape:showpageshadow="2"
     inkscape:pagecheckerboard="0"
     inkscape:deskcolor="#d1d1d1"><sodipodi:guide
       position="-337.15526,248.07236"
       orientation="0,-1"
       id="guide1"
       inkscape:locked="false" /><sodipodi:guide
       position="-357.69356,219.86356"
       orientation="0,-1"
       id="guide2"
       inkscape:locked="false" /><sodipodi:guide
       position="-265.20617,229.10062"
       orientation="0,-1"
       id="guide3"
       inkscape:locked="false" /><sodipodi:guide
       position="-339.1931,269.91346"
       orientation="1,0"
       id="guide5"
       inkscape:locked="false" /><sodipodi:guide
       position="-323.09038,272.10928"
       orientation="0,-1"
       id="guide6"
       inkscape:locked="false" /><sodipodi:guide
       position="-302.92872,237.70803"
       orientation="0,-1"
       id="guide15"
       inkscape:locked="false" /><sodipodi:guide
       position="-340.9578,259.87173"
       orientation="0,-1"
       id="guide16"
       inkscape:locked="false" /><sodipodi:guide
       position="-340.18192,259.00153"
       orientation="1,0"
       id="guide18"
       inkscape:locked="false" /><sodipodi:guide
       position="-329.6425,258.06051"
       orientation="1,0"
       id="guide19"
       inkscape:locked="false" /><sodipodi:guide
       position="-334.91976,265.78688"
       orientation="1,0"
       id="guide20"
       inkscape:locked="false" /><sodipodi:guide
       position="-318.10869,258.2216"
       orientation="0,-1"
       id="guide21"
       inkscape:locked="false" /><sodipodi:guide
       position="-331.38338,249.61485"
       orientation="0,-1"
       id="guide22"
       inkscape:locked="false" /><sodipodi:guide
       position="-345.79275,248.95614"
       orientation="0,-1"
       id="guide23"
       inkscape:locked="false" /><sodipodi:guide
       position="44.321669,265.22285"
       orientation="0,-1"
       id="guide24"
       inkscape:locked="false" /><sodipodi:guide
       position="-296.58918,266.69436"
       orientation="0,-1"
       id="guide25"
       inkscape:locked="false" /><sodipodi:guide
       position="-305.85822,267.72949"
       orientation="0,-1"
       id="guide26"
       inkscape:locked="false" /><sodipodi:guide
       position="-301.20017,235.0761"
       orientation="0,-1"
       id="guide27"
       inkscape:locked="false" /><inkscape:page
       x="0"
       y="0"
       width="285.75003"
       height="285.75"
       id="page39"
       margin="0"
       bleed="0"
       inkscape:export-filename="../Design/FAWCommBlog.png"
       inkscape:export-xdpi="96"
       inkscape:export-ydpi="96" /><sodipodi:guide
       position="183.0862,30.459584"
       orientation="1,0"
       id="guide49"
       inkscape:locked="false" /><sodipodi:guide
       position="-119.22023,201.82827"
       orientation="0,-1"
       id="guide69"
       inkscape:locked="false" /><sodipodi:guide
       position="228.55803,150.77424"
       orientation="0,-1"
       id="guide78"
       inkscape:locked="false" /><sodipodi:guide
       position="172.45735,94.095584"
       orientation="0,-1"
       id="guide79"
       inkscape:locked="false" /><sodipodi:guide
       position="186.54748,57.287724"
       orientation="0,-1"
       id="guide80"
       inkscape:locked="false" /><sodipodi:guide
       position="191.76129,48.051294"
       orientation="1,0"
       id="guide156"
       inkscape:locked="false" /><sodipodi:guide
       position="268.85512,54.276534"
       orientation="1,0"
       id="guide157"
       inkscape:locked="false" /><sodipodi:guide
       position="254.78643,68.567474"
       orientation="1,0"
       id="guide158"
       inkscape:locked="false" /><sodipodi:guide
       position="103.86044,14.021884"
       orientation="1,0"
       id="guide190"
       inkscape:locked="false" /><sodipodi:guide
       position="659.93699,189.06178"
       orientation="0,-1"
       id="guide261"
       inkscape:locked="false" /><sodipodi:guide
       position="121.10994,174.50041"
       orientation="1,0"
       id="guide272"
       inkscape:locked="false" /><sodipodi:guide
       position="112.5821,0.84248395"
       orientation="1,0"
       id="guide273"
       inkscape:locked="false" /><sodipodi:guide
       position="88.063359,54.884814"
       orientation="1,0"
       id="guide304"
       inkscape:locked="false" /><sodipodi:guide
       position="197.35528,8.948184"
       orientation="1,0"
       id="guide305"
       inkscape:locked="false" /></sodipodi:namedview><metadata
     id="metadata2206"><rdf:RDF><cc:Work
         rdf:about=""><dc:format>image/svg+xml</dc:format><dc:type
           rdf:resource="http://purl.org/dc/dcmitype/StillImage" /></cc:Work></rdf:RDF></metadata><g
     inkscape:label="Layer 1"
     inkscape:groupmode="layer"
     id="layer1"
     transform="translate(-377.1875,-236.14581)"><rect
       style="mix-blend-mode:normal;fill:#ffffff;fill-opacity:1;stroke:none;stroke-width:1;stroke-linecap:round;stroke-linejoin:bevel;stroke-dasharray:none;paint-order:markers fill stroke"
       id="rect191"
       width="312.31781"
       height="332.95807"
       x="365.36716"
       y="214.95564" /><rect
       style="fill:#3c6eb4;fill-opacity:1;stroke:none;stroke-width:2.3489;stroke-linecap:round;stroke-linejoin:round;stroke-dasharray:none;stroke-opacity:1;paint-order:stroke fill markers"
       id="rect299"
       width="3.4036191"
       height="10.129014"
       x="501.47372"
       y="365.79745"
       transform="matrix(0.04768113,0.99886261,0.99886261,-0.04768113,0,0)" /><g
       id="g48"
       transform="matrix(11.964409,12.422531,-12.422531,11.964409,3444.2348,-2824.1927)"
       inkscape:export-filename="/home/thlavack/Pictures/fedora-design/ #615 Fedora Appreciation Week/pngs/f.png"
       inkscape:export-xdpi="95.5"
       inkscape:export-ydpi="95.5"
       style="fill:url(#linearGradient57);stroke:none"><rect
         style="fill:url(#linearGradient60);stroke:none;stroke-width:0.0579804;stroke-linecap:round;stroke-linejoin:bevel;stroke-dasharray:none;paint-order:markers fill stroke"
         id="rect49"
         width="18.117592"
         height="18.122772"
         x="-178.3461"
         y="176.42265"
         transform="rotate(-46.076207)" /></g><path
       sodipodi:type="star"
       style="fill:#82ceff;fill-opacity:1;stroke:none;stroke-width:3.54576;stroke-linecap:round;stroke-linejoin:round;stroke-dasharray:none;stroke-opacity:1;paint-order:stroke fill markers"
       id="path304"
       inkscape:flatsided="true"
       sodipodi:sides="4"
       sodipodi:cx="-51.034725"
       sodipodi:cy="-62.770813"
       sodipodi:r1="21.390997"
       sodipodi:r2="9.2603378"
       sodipodi:arg1="0.58684597"
       sodipodi:arg2="1.3722441"
       inkscape:rounded="-0.12"
       inkscape:randomized="0"
       d="m -33.222628,-50.925817 c 2.010163,-3.022813 -32.679906,3.956939 -29.657093,5.967102 3.022813,2.010162 -3.956939,-32.679907 -5.967102,-29.657094 -2.010162,3.022813 32.679907,-3.956939 29.657094,-5.967102 -3.022813,-2.010162 3.956939,32.679907 5.967101,29.657094 z"
       transform="matrix(0.10705309,0.13878367,-0.13878367,0.10705309,466.55505,395.29315)"
       inkscape:transform-center-x="23.561818"
       inkscape:transform-center-y="-28.902455" /><path
       sodipodi:type="star"
       style="fill:#82ceff;fill-opacity:1;stroke:none;stroke-width:3.54576;stroke-linecap:round;stroke-linejoin:round;stroke-dasharray:none;stroke-opacity:1;paint-order:stroke fill markers"
       id="path303"
       inkscape:flatsided="true"
       sodipodi:sides="4"
       sodipodi:cx="-51.034725"
       sodipodi:cy="-62.770813"
       sodipodi:r1="21.390997"
       sodipodi:r2="9.2603378"
       sodipodi:arg1="0.58684597"
       sodipodi:arg2="1.3722441"
       inkscape:rounded="-0.12"
       inkscape:randomized="0"
       d="m -33.222628,-50.925817 c 2.010163,-3.022813 -32.679906,3.956939 -29.657093,5.967102 3.022813,2.010162 -3.956939,-32.679907 -5.967102,-29.657094 -2.010162,3.022813 32.679907,-3.956939 29.657094,-5.967102 -3.022813,-2.010162 3.956939,32.679907 5.967101,29.657094 z"
       transform="matrix(0.10705309,0.13878367,-0.13878367,0.10705309,644.29492,488.10156)"
       inkscape:transform-center-x="23.561818"
       inkscape:transform-center-y="-28.902455" /><path
       style="fill:#82ceff;fill-opacity:1;stroke:none;stroke-width:0.591886px;stroke-linecap:butt;stroke-linejoin:miter;stroke-opacity:1"
       d="m 627.23193,486.09668 5.56078,-6.94759 -1.7287,-1.92188 c -1.92365,1.9917 -3.81921,4.12891 -7.22294,5.85572 z"
       id="path302"
       sodipodi:nodetypes="ccccc" /><path
       sodipodi:type="star"
       style="fill:#ffffff;fill-opacity:1;stroke:none;stroke-width:3.54576;stroke-linecap:round;stroke-linejoin:round;stroke-dasharray:none;stroke-opacity:1;paint-order:stroke fill markers"
       id="path172396-7-1-2"
       inkscape:flatsided="true"
       sodipodi:sides="4"
       sodipodi:cx="-51.034725"
       sodipodi:cy="-62.770813"
       sodipodi:r1="21.390997"
       sodipodi:r2="9.2603378"
       sodipodi:arg1="0.58684597"
       sodipodi:arg2="1.3722441"
       inkscape:rounded="-0.12"
       inkscape:randomized="0"
       d="m -33.222628,-50.925817 c 2.010163,-3.022813 -32.679906,3.956939 -29.657093,5.967102 3.022813,2.010162 -3.956939,-32.679907 -5.967102,-29.657094 -2.010162,3.022813 32.679907,-3.956939 29.657094,-5.967102 -3.022813,-2.010162 3.956939,32.679907 5.967101,29.657094 z"
       transform="matrix(0.10705309,0.13878367,-0.13878367,0.10705309,560.05767,461.11245)"
       inkscape:transform-center-x="23.561807"
       inkscape:transform-center-y="-28.902457" /><path
       style="fill:#ffffff;fill-opacity:1;stroke:none;stroke-width:0.591886px;stroke-linecap:butt;stroke-linejoin:miter;stroke-opacity:1"
       d="m 493.28878,419.28778 -5.09845,7.86592 -2.49527,-1.08984 c 1.35218,-2.58436 2.85913,-5.18894 3.45499,-9.16492 z"
       id="path169765-5-5-2"
       sodipodi:nodetypes="ccccc" /><path
       style="fill:#82ceff;fill-opacity:1;stroke:none;stroke-width:0.591886px;stroke-linecap:butt;stroke-linejoin:miter;stroke-opacity:1"
       d="m 398.72065,401.23878 -6.3301,-6.25469 1.49377,-2.10967 c 2.14193,1.75481 4.27293,3.65738 7.85418,4.97717 z"
       id="path169765-5-0-4-6-1-2"
       sodipodi:nodetypes="ccccc" /><path
       style="fill:#82ceff;fill-opacity:1;stroke:none;stroke-width:0.591886px;stroke-linecap:butt;stroke-linejoin:miter;stroke-opacity:1"
       d="m 608.4475,295.26951 8.66424,-5.61585 -1.20047,-2.74851 c -2.8466,1.4894 -5.71556,3.1493 -10.09504,3.80563 z"
       id="path169765-5-0-4-0-7-61"
       sodipodi:nodetypes="ccccc" /><path
       style="fill:#3c6eb4;fill-opacity:1;stroke:none;stroke-width:0.591886px;stroke-linecap:butt;stroke-linejoin:miter;stroke-opacity:1"
       d="m 473.8917,412.2246 -7.25967,1.99254 -1.02871,-3.51039 7.3577,-4.58499 z"
       id="path169767-2-1-0"
       sodipodi:nodetypes="ccccc" /><circle
       style="fill:#ffffff;fill-opacity:1;stroke:none;stroke-width:2.3489;stroke-linecap:round;stroke-linejoin:round;stroke-dasharray:none;stroke-opacity:1;paint-order:stroke fill markers"
       id="path171067-9-6"
       cx="564.1073"
       cy="272.99219"
       r="1.9340422" /><circle
       style="fill:#ffffff;fill-opacity:1;stroke:none;stroke-width:2.3489;stroke-linecap:round;stroke-linejoin:round;stroke-dasharray:none;stroke-opacity:1;paint-order:stroke fill markers"
       id="path171067-9-8-1"
       cx="642.14032"
       cy="381.39526"
       r="1.9340422" /><path
       sodipodi:type="star"
       style="fill:#ffffff;fill-opacity:1;stroke:none;stroke-width:2.60557;stroke-linecap:round;stroke-linejoin:round;stroke-dasharray:none;stroke-opacity:1;paint-order:stroke fill markers"
       id="path172396-9"
       inkscape:flatsided="true"
       sodipodi:sides="4"
       sodipodi:cx="-51.034725"
       sodipodi:cy="-62.770813"
       sodipodi:r1="21.390997"
       sodipodi:r2="9.2603378"
       sodipodi:arg1="0.58684597"
       sodipodi:arg2="1.3722441"
       inkscape:rounded="-0.12"
       inkscape:randomized="0"
       d="m -33.222628,-50.925817 c 2.010163,-3.022813 -32.679906,3.956939 -29.657093,5.967102 3.022813,2.010162 -3.956939,-32.679907 -5.967102,-29.657094 -2.010162,3.022813 32.679907,-3.956939 29.657094,-5.967102 -3.022813,-2.010162 3.956939,32.679907 5.967101,29.657094 z"
       transform="matrix(0.1456816,0.18886168,-0.18886168,0.1456816,398.96188,268.35953)"
       inkscape:transform-center-x="32.063743"
       inkscape:transform-center-y="-39.331481" /><path
       sodipodi:type="star"
       style="fill:#ffffff;fill-opacity:1;stroke:none;stroke-width:3.54576;stroke-linecap:round;stroke-linejoin:round;stroke-dasharray:none;stroke-opacity:1;paint-order:stroke fill markers"
       id="path172396-7-0"
       inkscape:flatsided="true"
       sodipodi:sides="4"
       sodipodi:cx="-51.034725"
       sodipodi:cy="-62.770813"
       sodipodi:r1="21.390997"
       sodipodi:r2="9.2603378"
       sodipodi:arg1="0.58684597"
       sodipodi:arg2="1.3722441"
       inkscape:rounded="-0.12"
       inkscape:randomized="0"
       d="m -33.222628,-50.925817 c 2.010163,-3.022813 -32.679906,3.956939 -29.657093,5.967102 3.022813,2.010162 -3.956939,-32.679907 -5.967102,-29.657094 -2.010162,3.022813 32.679907,-3.956939 29.657094,-5.967102 -3.022813,-2.010162 3.956939,32.679907 5.967101,29.657094 z"
       transform="matrix(0.10705309,0.13878367,-0.13878367,0.10705309,441.56545,493.87772)"
       inkscape:transform-center-x="23.561824"
       inkscape:transform-center-y="-28.902462" /><path
       sodipodi:type="star"
       style="fill:#3c6eb4;fill-opacity:1;stroke:none;stroke-width:3.54576;stroke-linecap:round;stroke-linejoin:round;stroke-dasharray:none;stroke-opacity:1;paint-order:stroke fill markers"
       id="path172396-7-1-4-1"
       inkscape:flatsided="true"
       sodipodi:sides="4"
       sodipodi:cx="-51.034725"
       sodipodi:cy="-62.770813"
       sodipodi:r1="21.390997"
       sodipodi:r2="9.2603378"
       sodipodi:arg1="0.58684597"
       sodipodi:arg2="1.3722441"
       inkscape:rounded="-0.12"
       inkscape:randomized="0"
       d="m -33.222628,-50.925817 c 2.010163,-3.022813 -32.679906,3.956939 -29.657093,5.967102 3.022813,2.010162 -3.956939,-32.679907 -5.967102,-29.657094 -2.010162,3.022813 32.679907,-3.956939 29.657094,-5.967102 -3.022813,-2.010162 3.956939,32.679907 5.967101,29.657094 z"
       transform="matrix(0.10705309,0.13878367,-0.13878367,0.10705309,481.83842,415.67524)"
       inkscape:transform-center-x="23.56182"
       inkscape:transform-center-y="-28.902446" /><path
       style="fill:#ffffff;fill-opacity:1;stroke:none;stroke-width:0.591886px;stroke-linecap:butt;stroke-linejoin:miter;stroke-opacity:1"
       d="m 636.24324,360.43908 -5.09845,-7.86595 -2.49528,1.08987 c 1.35221,2.58434 2.85911,5.18894 3.455,9.16492 z"
       id="path169765-5-5-4-7"
       sodipodi:nodetypes="ccccc" /><path
       style="fill:#3c6eb4;fill-opacity:1;stroke:none;stroke-width:0.591886px;stroke-linecap:butt;stroke-linejoin:miter;stroke-opacity:1"
       d="m 608.16953,367.06562 -7.25967,-1.99256 -1.02871,3.51038 7.3577,4.585 z"
       id="path169767-2-1-4-15"
       sodipodi:nodetypes="ccccc" /><path
       sodipodi:type="star"
       style="fill:#ffffff;fill-opacity:1;stroke:none;stroke-width:3.54576;stroke-linecap:round;stroke-linejoin:round;stroke-dasharray:none;stroke-opacity:1;paint-order:stroke fill markers"
       id="path172396-7-1-9-6"
       inkscape:flatsided="true"
       sodipodi:sides="4"
       sodipodi:cx="-51.034725"
       sodipodi:cy="-62.770813"
       sodipodi:r1="21.390997"
       sodipodi:r2="9.2603378"
       sodipodi:arg1="0.58684597"
       sodipodi:arg2="1.3722441"
       inkscape:rounded="-0.12"
       inkscape:randomized="0"
       d="m -33.222628,-50.925817 c 2.010163,-3.022813 -32.679906,3.956939 -29.657093,5.967102 3.022813,2.010162 -3.956939,-32.679907 -5.967102,-29.657094 -2.010162,3.022813 32.679907,-3.956939 29.657094,-5.967102 -3.022813,-2.010162 3.956939,32.679907 5.967101,29.657094 z"
       transform="matrix(0.10705309,0.13878367,-0.13878367,0.10705309,446.65745,362.84728)"
       inkscape:transform-center-x="23.561818"
       inkscape:transform-center-y="-28.90246" /><path
       sodipodi:type="star"
       style="fill:#82ceff;fill-opacity:1;stroke:none;stroke-width:3.54576;stroke-linecap:round;stroke-linejoin:round;stroke-dasharray:none;stroke-opacity:1;paint-order:stroke fill markers"
       id="path172396-7-1-6-7"
       inkscape:flatsided="true"
       sodipodi:sides="4"
       sodipodi:cx="-51.034725"
       sodipodi:cy="-62.770813"
       sodipodi:r1="21.390997"
       sodipodi:r2="9.2603378"
       sodipodi:arg1="0.58684597"
       sodipodi:arg2="1.3722441"
       inkscape:rounded="-0.12"
       inkscape:randomized="0"
       d="m -33.222628,-50.925817 c 2.010163,-3.022813 -32.679906,3.956939 -29.657093,5.967102 3.022813,2.010162 -3.956939,-32.679907 -5.967102,-29.657094 -2.010162,3.022813 32.679907,-3.956939 29.657094,-5.967102 -3.022813,-2.010162 3.956939,32.679907 5.967101,29.657094 z"
       transform="matrix(0.10705309,0.13878367,-0.13878367,0.10705309,645.99062,347.03676)"
       inkscape:transform-center-x="23.561818"
       inkscape:transform-center-y="-28.902455" /><path
       sodipodi:type="star"
       style="fill:#ffffff;fill-opacity:1;stroke:none;stroke-width:5.66729;stroke-linecap:round;stroke-linejoin:round;stroke-dasharray:none;stroke-opacity:1;paint-order:stroke fill markers"
       id="path173968-8-6"
       inkscape:flatsided="false"
       sodipodi:sides="5"
       sodipodi:cx="-28.497557"
       sodipodi:cy="95.920502"
       sodipodi:r1="42.927052"
       sodipodi:r2="26.185501"
       sodipodi:arg1="0.82753514"
       sodipodi:arg2="1.4558536"
       inkscape:rounded="0.17"
       inkscape:randomized="0"
       d="m 0.55086168,127.52622 c -3.33427038,3.06448 -21.54646668,-6.11239 -26.04520868,-5.59301 -4.498742,0.51939 -20.140728,13.60478 -24.085575,11.38068 -3.944846,-2.2241 -0.844998,-22.38074 -2.729151,-26.4988 -1.884154,-4.11805 -19.162742,-14.950858 -18.26652,-19.389916 0.896221,-4.439057 21.024229,-7.71967 24.3585,-10.784156 3.334271,-3.064487 8.297502,-22.844921 12.796245,-23.364308 4.498741,-0.519387 13.838686,17.609722 17.783532,19.833823 3.944847,2.224102 24.2908801,0.831925 26.175034,4.949984 1.884154,4.118058 -12.4714508,18.603076 -13.3676723,23.042133 -0.8962217,4.43906 6.7150868,23.35908 3.38081598,26.42357 z"
       transform="matrix(0.1096611,0,0,0.1096611,641.99289,302.378)" /><path
       sodipodi:type="star"
       style="fill:#ffffff;fill-opacity:1;stroke:none;stroke-width:5.66729;stroke-linecap:round;stroke-linejoin:round;stroke-dasharray:none;stroke-opacity:1;paint-order:stroke fill markers"
       id="path173968-8-0-5"
       inkscape:flatsided="false"
       sodipodi:sides="5"
       sodipodi:cx="-28.497557"
       sodipodi:cy="95.920502"
       sodipodi:r1="42.927052"
       sodipodi:r2="26.185501"
       sodipodi:arg1="0.82753514"
       sodipodi:arg2="1.4558536"
       inkscape:rounded="0.17"
       inkscape:randomized="0"
       d="m 0.55086168,127.52622 c -3.33427038,3.06448 -21.54646668,-6.11239 -26.04520868,-5.59301 -4.498742,0.51939 -20.140728,13.60478 -24.085575,11.38068 -3.944846,-2.2241 -0.844998,-22.38074 -2.729151,-26.4988 -1.884154,-4.11805 -19.162742,-14.950858 -18.26652,-19.389916 0.896221,-4.439057 21.024229,-7.71967 24.3585,-10.784156 3.334271,-3.064487 8.297502,-22.844921 12.796245,-23.364308 4.498741,-0.519387 13.838686,17.609722 17.783532,19.833823 3.944847,2.224102 24.2908801,0.831925 26.175034,4.949984 1.884154,4.118058 -12.4714508,18.603076 -13.3676723,23.042133 -0.8962217,4.43906 6.7150868,23.35908 3.38081598,26.42357 z"
       transform="matrix(0.1096611,0,0,0.1096611,602.35015,381.66167)" /><path
       sodipodi:type="star"
       style="fill:#3c6eb4;fill-opacity:1;stroke:none;stroke-width:5.66729;stroke-linecap:round;stroke-linejoin:round;stroke-dasharray:none;stroke-opacity:1;paint-order:stroke fill markers"
       id="path173968-8-0-9-6"
       inkscape:flatsided="false"
       sodipodi:sides="5"
       sodipodi:cx="-28.497557"
       sodipodi:cy="95.920502"
       sodipodi:r1="42.927052"
       sodipodi:r2="26.185501"
       sodipodi:arg1="0.82753514"
       sodipodi:arg2="1.4558536"
       inkscape:rounded="0.17"
       inkscape:randomized="0"
       d="m 0.55086168,127.52622 c -3.33427038,3.06448 -21.54646668,-6.11239 -26.04520868,-5.59301 -4.498742,0.51939 -20.140728,13.60478 -24.085575,11.38068 -3.944846,-2.2241 -0.844998,-22.38074 -2.729151,-26.4988 -1.884154,-4.11805 -19.162742,-14.950858 -18.26652,-19.389916 0.896221,-4.439057 21.024229,-7.71967 24.3585,-10.784156 3.334271,-3.064487 8.297502,-22.844921 12.796245,-23.364308 4.498741,-0.519387 13.838686,17.609722 17.783532,19.833823 3.944847,2.224102 24.2908801,0.831925 26.175034,4.949984 1.884154,4.118058 -12.4714508,18.603076 -13.3676723,23.042133 -0.8962217,4.43906 6.7150868,23.35908 3.38081598,26.42357 z"
       transform="matrix(0.1096611,0,0,0.1096611,454.37031,363.68509)" /><path
       sodipodi:type="star"
       style="fill:#3c6eb4;fill-opacity:1;stroke:none;stroke-width:5.66729;stroke-linecap:round;stroke-linejoin:round;stroke-dasharray:none;stroke-opacity:1;paint-order:stroke fill markers"
       id="path173968-8-0-9-3-3-8"
       inkscape:flatsided="false"
       sodipodi:sides="5"
       sodipodi:cx="-28.497557"
       sodipodi:cy="95.920502"
       sodipodi:r1="42.927052"
       sodipodi:r2="26.185501"
       sodipodi:arg1="0.82753514"
       sodipodi:arg2="1.4558536"
       inkscape:rounded="0.17"
       inkscape:randomized="0"
       d="m 0.55086168,127.52622 c -3.33427038,3.06448 -21.54646668,-6.11239 -26.04520868,-5.59301 -4.498742,0.51939 -20.140728,13.60478 -24.085575,11.38068 -3.944846,-2.2241 -0.844998,-22.38074 -2.729151,-26.4988 -1.884154,-4.11805 -19.162742,-14.950858 -18.26652,-19.389916 0.896221,-4.439057 21.024229,-7.71967 24.3585,-10.784156 3.334271,-3.064487 8.297502,-22.844921 12.796245,-23.364308 4.498741,-0.519387 13.838686,17.609722 17.783532,19.833823 3.944847,2.224102 24.2908801,0.831925 26.175034,4.949984 1.884154,4.118058 -12.4714508,18.603076 -13.3676723,23.042133 -0.8962217,4.43906 6.7150868,23.35908 3.38081598,26.42357 z"
       transform="matrix(0.1096611,0,0,0.1096611,603.88155,258.76228)" /><path
       style="fill:#ffffff;fill-opacity:1;stroke:none;stroke-width:0.591886px;stroke-linecap:butt;stroke-linejoin:miter;stroke-opacity:1"
       d="m 620.01654,503.96421 1.23272,6.85849 -1.90753,0.67718 c -0.58016,-2.08923 -1.0867,-4.26809 -2.78451,-6.72771 z"
       id="path169765-5-5-6-7-48"
       sodipodi:nodetypes="ccccc" /><path
       style="fill:#ffffff;fill-opacity:1;stroke:none;stroke-width:0.591886px;stroke-linecap:butt;stroke-linejoin:miter;stroke-opacity:1"
       d="m 654.34097,275.80669 -6.8585,1.2327 -0.67718,-1.90753 c 2.08921,-0.58018 4.26806,-1.0867 6.72768,-2.78453 z"
       id="path169765-5-5-6-7-9-1"
       sodipodi:nodetypes="ccccc" /><path
       sodipodi:type="star"
       style="fill:#3c6eb4;fill-opacity:1;stroke:none;stroke-width:5.66729;stroke-linecap:round;stroke-linejoin:round;stroke-dasharray:none;stroke-opacity:1;paint-order:stroke fill markers"
       id="path173968-8-0-9-3-2-8"
       inkscape:flatsided="false"
       sodipodi:sides="5"
       sodipodi:cx="-28.497557"
       sodipodi:cy="95.920502"
       sodipodi:r1="42.927052"
       sodipodi:r2="26.185501"
       sodipodi:arg1="0.82753514"
       sodipodi:arg2="1.4558536"
       inkscape:rounded="0.17"
       inkscape:randomized="0"
       d="m 0.55086168,127.52622 c -3.33427038,3.06448 -21.54646668,-6.11239 -26.04520868,-5.59301 -4.498742,0.51939 -20.140728,13.60478 -24.085575,11.38068 -3.944846,-2.2241 -0.844998,-22.38074 -2.729151,-26.4988 -1.884154,-4.11805 -19.162742,-14.950858 -18.26652,-19.389916 0.896221,-4.439057 21.024229,-7.71967 24.3585,-10.784156 3.334271,-3.064487 8.297502,-22.844921 12.796245,-23.364308 4.498741,-0.519387 13.838686,17.609722 17.783532,19.833823 3.944847,2.224102 24.2908801,0.831925 26.175034,4.949984 1.884154,4.118058 -12.4714508,18.603076 -13.3676723,23.042133 -0.8962217,4.43906 6.7150868,23.35908 3.38081598,26.42357 z"
       transform="matrix(-0.10891889,0.0127372,0.0127372,0.10891889,623.58862,393.9591)" /><path
       style="fill:#ffffff;fill-opacity:1;stroke:none;stroke-width:0.591886px;stroke-linecap:butt;stroke-linejoin:miter;stroke-opacity:1"
       d="m 603.90175,415.90111 5.97756,7.22054 2.35182,-1.37232 c -1.64323,-2.40978 -3.44249,-4.82175 -4.49612,-8.70158 z"
       id="path169765-5-5-6-6-5"
       sodipodi:nodetypes="ccccc" /><path
       style="fill:#82ceff;fill-opacity:1;stroke:none;stroke-width:0.591886px;stroke-linecap:butt;stroke-linejoin:miter;stroke-opacity:1"
       d="m 645.36455,416.78935 5.56078,-6.94759 -1.7287,-1.92188 c -1.92365,1.9917 -3.81921,4.12891 -7.22294,5.85572 z"
       id="path169765-5-0-4-6-1-3-7-0"
       sodipodi:nodetypes="ccccc" /><path
       sodipodi:type="star"
       style="fill:#82ceff;fill-opacity:1;stroke:none;stroke-width:5.66729;stroke-linecap:round;stroke-linejoin:round;stroke-dasharray:none;stroke-opacity:1;paint-order:stroke fill markers"
       id="path173968-8-0-0-5"
       inkscape:flatsided="false"
       sodipodi:sides="5"
       sodipodi:cx="-28.497557"
       sodipodi:cy="95.920502"
       sodipodi:r1="42.927052"
       sodipodi:r2="26.185501"
       sodipodi:arg1="0.82753514"
       sodipodi:arg2="1.4558536"
       inkscape:rounded="0.17"
       inkscape:randomized="0"
       d="m 0.55086168,127.52622 c -3.33427038,3.06448 -21.54646668,-6.11239 -26.04520868,-5.59301 -4.498742,0.51939 -20.140728,13.60478 -24.085575,11.38068 -3.944846,-2.2241 -0.844998,-22.38074 -2.729151,-26.4988 -1.884154,-4.11805 -19.162742,-14.950858 -18.26652,-19.389916 0.896221,-4.439057 21.024229,-7.71967 24.3585,-10.784156 3.334271,-3.064487 8.297502,-22.844921 12.796245,-23.364308 4.498741,-0.519387 13.838686,17.609722 17.783532,19.833823 3.944847,2.224102 24.2908801,0.831925 26.175034,4.949984 1.884154,4.118058 -12.4714508,18.603076 -13.3676723,23.042133 -0.8962217,4.43906 6.7150868,23.35908 3.38081598,26.42357 z"
       transform="matrix(0.1096611,0,0,0.1096611,425.31005,426.59758)" /><path
       sodipodi:type="star"
       style="fill:#ffffff;fill-opacity:1;stroke:none;stroke-width:3.3766;stroke-linecap:round;stroke-linejoin:round;stroke-dasharray:none;stroke-opacity:1;paint-order:stroke fill markers"
       id="path174594-6-3"
       inkscape:flatsided="false"
       sodipodi:sides="4"
       sodipodi:cx="-83.895691"
       sodipodi:cy="-93.977196"
       sodipodi:r1="10.353173"
       sodipodi:r2="31.373253"
       sodipodi:arg1="1.277949"
       sodipodi:arg2="2.0633472"
       inkscape:rounded="0.1"
       inkscape:randomized="0"
       d="m -80.906942,-84.064801 c -2.40715,0.725795 -15.609052,18.920401 -17.824378,17.731503 -2.21533,-1.188897 5.649029,-22.248 4.923234,-24.655149 -0.725795,-2.407149 -18.920404,-15.609053 -17.731504,-17.824383 1.1889,-2.21532 22.248001,5.64903 24.65515,4.92324 2.40715,-0.7258 15.609052,-18.9204 17.824378,-17.7315 2.215326,1.18889 -5.649029,22.247996 -4.923234,24.655145 0.725795,2.40715 18.9204,15.609052 17.731503,17.824379 -1.188897,2.215326 -22.248,-5.649029 -24.655149,-4.923235 z"
       transform="matrix(0.15686533,-0.09627976,0.09627976,0.15686533,644.8504,265.63176)"
       inkscape:transform-center-x="-0.43650027"
       inkscape:transform-center-y="-0.22524333" /><path
       sodipodi:type="star"
       style="fill:#ffffff;fill-opacity:1;stroke:none;stroke-width:3.3766;stroke-linecap:round;stroke-linejoin:round;stroke-dasharray:none;stroke-opacity:1;paint-order:stroke fill markers"
       id="path174594-3-1"
       inkscape:flatsided="false"
       sodipodi:sides="4"
       sodipodi:cx="-83.895691"
       sodipodi:cy="-93.977196"
       sodipodi:r1="10.353173"
       sodipodi:r2="31.373253"
       sodipodi:arg1="1.277949"
       sodipodi:arg2="2.0633472"
       inkscape:rounded="0.1"
       inkscape:randomized="0"
       d="m -80.906942,-84.064801 c -2.40715,0.725795 -15.609052,18.920401 -17.824378,17.731503 -2.21533,-1.188897 5.649029,-22.248 4.923234,-24.655149 -0.725795,-2.407149 -18.920404,-15.609053 -17.731504,-17.824383 1.1889,-2.21532 22.248001,5.64903 24.65515,4.92324 2.40715,-0.7258 15.609052,-18.9204 17.824378,-17.7315 2.215326,1.18889 -5.649029,22.247996 -4.923234,24.655145 0.725795,2.40715 18.9204,15.609052 17.731503,17.824379 -1.188897,2.215326 -22.248,-5.649029 -24.655149,-4.923235 z"
       transform="matrix(0.15686533,-0.09627976,0.09627976,0.15686533,417.83676,302.30461)"
       inkscape:transform-center-x="-0.43649807"
       inkscape:transform-center-y="-0.22526058" /><rect
       style="fill:#3c6eb4;fill-opacity:1;stroke:none;stroke-width:2.3489;stroke-linecap:round;stroke-linejoin:round;stroke-dasharray:none;stroke-opacity:1;paint-order:stroke fill markers"
       id="rect175045-5"
       width="3.4036191"
       height="10.129014"
       x="131.26884"
       y="665.41345"
       transform="matrix(-0.48407415,0.87502698,0.87502698,0.48407415,0,0)" /><rect
       style="fill:#ffffff;fill-opacity:1;stroke:none;stroke-width:2.3489;stroke-linecap:round;stroke-linejoin:round;stroke-dasharray:none;stroke-opacity:1;paint-order:stroke fill markers"
       id="rect175045-7-9"
       width="3.4036191"
       height="10.129013"
       x="145.56483"
       y="623.43225"
       transform="matrix(-0.22764207,0.97374488,0.97374488,0.22764207,0,0)" /><rect
       style="fill:#ffffff;fill-opacity:1;stroke:none;stroke-width:2.3489;stroke-linecap:round;stroke-linejoin:round;stroke-dasharray:none;stroke-opacity:1;paint-order:stroke fill markers"
       id="rect175045-7-3-84"
       width="3.4036191"
       height="10.129013"
       x="238.17166"
       y="477.46002"
       transform="matrix(-0.22764207,0.97374488,0.97374488,0.22764207,0,0)" /><rect
       style="fill:#ffffff;fill-opacity:1;stroke:none;stroke-width:2.3489;stroke-linecap:round;stroke-linejoin:round;stroke-dasharray:none;stroke-opacity:1;paint-order:stroke fill markers"
       id="rect175045-7-3-4-8"
       width="3.4036191"
       height="10.129013"
       x="-451.96457"
       y="513.10535"
       transform="rotate(-103.15829)" /><rect
       style="fill:#3c6eb4;fill-opacity:1;stroke:none;stroke-width:2.3489;stroke-linecap:round;stroke-linejoin:round;stroke-dasharray:none;stroke-opacity:1;paint-order:stroke fill markers"
       id="rect175045-7-3-5-0-2"
       width="3.4036191"
       height="10.129014"
       x="-502.98383"
       y="468.88876"
       transform="matrix(-0.92576101,0.37810918,0.37810918,0.92576101,0,0)" /><path
       style="fill:#ffffff;fill-opacity:1;stroke:none;stroke-width:0.591886px;stroke-linecap:butt;stroke-linejoin:miter;stroke-opacity:1"
       d="m 443.11558,397.81632 5.09844,7.86593 2.49528,-1.08985 c -1.35219,-2.58433 -2.85913,-5.18893 -3.45499,-9.16492 z"
       id="path169765-5-5-2-5"
       sodipodi:nodetypes="ccccc" /><path
       style="fill:#3c6eb4;fill-opacity:1;stroke:none;stroke-width:0.591886px;stroke-linecap:butt;stroke-linejoin:miter;stroke-opacity:1"
       d="m 440.93598,428.72415 7.25966,1.99255 1.02871,-3.51039 -7.35769,-4.585 z"
       id="path169767-2-1-0-5"
       sodipodi:nodetypes="ccccc" /><rect
       style="fill:#ffffff;fill-opacity:1;stroke:none;stroke-width:2.3489;stroke-linecap:round;stroke-linejoin:round;stroke-dasharray:none;stroke-opacity:1;paint-order:stroke fill markers"
       id="rect175045-7-3-84-2"
       width="3.4036191"
       height="10.129013"
       x="457.66708"
       y="-334.224"
       transform="rotate(76.84171)" /><rect
       style="fill:#3c6eb4;fill-opacity:1;stroke:none;stroke-width:2.3489;stroke-linecap:round;stroke-linejoin:round;stroke-dasharray:none;stroke-opacity:1;paint-order:stroke fill markers"
       id="rect175045-7-3-5-6-9"
       width="3.4036191"
       height="10.129014"
       x="8.0839176"
       y="576.85059"
       transform="rotate(-45.35909)" /><path
       sodipodi:type="star"
       style="fill:#82ceff;fill-opacity:1;stroke:none;stroke-width:3.54576;stroke-linecap:round;stroke-linejoin:round;stroke-dasharray:none;stroke-opacity:1;paint-order:stroke fill markers"
       id="path69"
       inkscape:flatsided="true"
       sodipodi:sides="4"
       sodipodi:cx="-51.034725"
       sodipodi:cy="-62.770813"
       sodipodi:r1="21.390997"
       sodipodi:r2="9.2603378"
       sodipodi:arg1="0.58684597"
       sodipodi:arg2="1.3722441"
       inkscape:rounded="-0.12"
       inkscape:randomized="0"
       d="m -33.222628,-50.925817 c 2.010163,-3.022813 -32.679906,3.956939 -29.657093,5.967102 3.022813,2.010162 -3.956939,-32.679907 -5.967102,-29.657094 -2.010162,3.022813 32.679907,-3.956939 29.657094,-5.967102 -3.022813,-2.010162 3.956939,32.679907 5.967101,29.657094 z"
       transform="matrix(0.10705309,0.13878367,-0.13878367,0.10705309,385.09257,518.89629)"
       inkscape:transform-center-x="23.561818"
       inkscape:transform-center-y="-28.902455" /><rect
       style="fill:#3c6eb4;fill-opacity:1;stroke:none;stroke-width:2.3489;stroke-linecap:round;stroke-linejoin:round;stroke-dasharray:none;stroke-opacity:1;paint-order:stroke fill markers"
       id="rect69"
       width="3.4036191"
       height="10.129014"
       x="-232.50034"
       y="464.35724"
       transform="matrix(-0.92576101,0.37810918,0.37810918,0.92576101,0,0)" /><rect
       style="fill:#3c6eb4;fill-opacity:1;stroke:none;stroke-width:2.3489;stroke-linecap:round;stroke-linejoin:round;stroke-dasharray:none;stroke-opacity:1;paint-order:stroke fill markers"
       id="rect78"
       width="3.4036191"
       height="10.129014"
       x="-676.7652"
       y="-205.07303"
       transform="matrix(-0.70266127,-0.71152452,-0.71152452,0.70266127,0,0)" /><path
       sodipodi:type="star"
       style="fill:#82ceff;fill-opacity:1;stroke:none;stroke-width:3.54576;stroke-linecap:round;stroke-linejoin:round;stroke-dasharray:none;stroke-opacity:1;paint-order:stroke fill markers"
       id="path80"
       inkscape:flatsided="true"
       sodipodi:sides="4"
       sodipodi:cx="-51.034725"
       sodipodi:cy="-62.770813"
       sodipodi:r1="21.390997"
       sodipodi:r2="9.2603378"
       sodipodi:arg1="0.58684597"
       sodipodi:arg2="1.3722441"
       inkscape:rounded="-0.12"
       inkscape:randomized="0"
       d="m -33.222628,-50.925817 c 2.010163,-3.022813 -32.679906,3.956939 -29.657093,5.967102 3.022813,2.010162 -3.956939,-32.679907 -5.967102,-29.657094 -2.010162,3.022813 32.679907,-3.956939 29.657094,-5.967102 -3.022813,-2.010162 3.956939,32.679907 5.967101,29.657094 z"
       transform="matrix(0.10705309,0.13878367,-0.13878367,0.10705309,631.35324,302.5214)"
       inkscape:transform-center-x="23.561818"
       inkscape:transform-center-y="-28.902455" /><circle
       style="fill:#ffffff;fill-opacity:1;stroke:none;stroke-width:2.3489;stroke-linecap:round;stroke-linejoin:round;stroke-dasharray:none;stroke-opacity:1;paint-order:stroke fill markers"
       id="circle82"
       cx="-675.50024"
       cy="110.25394"
       r="1.9340422"
       transform="rotate(-138.09205)" /><path
       style="fill:#ffffff;fill-opacity:1;stroke:none;stroke-width:0.591886px;stroke-linecap:butt;stroke-linejoin:miter;stroke-opacity:1"
       d="m 555.91226,382.15961 -1.45959,9.25943 2.585,0.85558 c 0.71983,-2.8265 1.33807,-5.77141 3.5503,-9.12842 z"
       id="path82"
       sodipodi:nodetypes="ccccc" /><path
       style="fill:#3c6eb4;fill-opacity:1;stroke:none;stroke-width:0.591886px;stroke-linecap:butt;stroke-linejoin:miter;stroke-opacity:1"
       d="m 575.58588,397.85612 4.07188,6.33189 3.1103,-1.92537 -2.41326,-8.32672 z"
       id="path83"
       sodipodi:nodetypes="ccccc" /><path
       sodipodi:type="star"
       style="fill:#82ceff;fill-opacity:1;stroke:none;stroke-width:3.54576;stroke-linecap:round;stroke-linejoin:round;stroke-dasharray:none;stroke-opacity:1;paint-order:stroke fill markers"
       id="path84"
       inkscape:flatsided="true"
       sodipodi:sides="4"
       sodipodi:cx="-51.034725"
       sodipodi:cy="-62.770813"
       sodipodi:r1="21.390997"
       sodipodi:r2="9.2603378"
       sodipodi:arg1="0.58684597"
       sodipodi:arg2="1.3722441"
       inkscape:rounded="-0.12"
       inkscape:randomized="0"
       d="m -33.222628,-50.925817 c 2.010163,-3.022813 -32.679906,3.956939 -29.657093,5.967102 3.022813,2.010162 -3.956939,-32.679907 -5.967102,-29.657094 -2.010162,3.022813 32.679907,-3.956939 29.657094,-5.967102 -3.022813,-2.010162 3.956939,32.679907 5.967101,29.657094 z"
       transform="matrix(0.01302764,-0.17479002,0.17479002,0.01302764,550.75851,398.43276)"
       inkscape:transform-center-x="1.7698352"
       inkscape:transform-center-y="37.247536" /><path
       style="fill:#ffffff;fill-opacity:1;stroke:none;stroke-width:0.591886px;stroke-linecap:butt;stroke-linejoin:miter;stroke-opacity:1"
       d="m 567.33238,512.6733 3.66361,-5.9276 1.87194,0.77014 c -0.96371,1.94235 -2.04207,3.90224 -2.4214,6.86676 z"
       id="path85"
       sodipodi:nodetypes="ccccc" /><path
       style="fill:#ffffff;fill-opacity:1;stroke:none;stroke-width:0.591886px;stroke-linecap:butt;stroke-linejoin:miter;stroke-opacity:1"
       d="m 625.46285,445.53139 0.37424,-9.36629 -2.66689,-0.54955 c -0.38666,2.89097 -0.65865,5.8878 -2.466,9.479 z"
       id="path87"
       sodipodi:nodetypes="ccccc" /><path
       style="fill:#82ceff;fill-opacity:1;stroke:none;stroke-width:0.591886px;stroke-linecap:butt;stroke-linejoin:miter;stroke-opacity:1"
       d="m 592.76997,348.51992 -8.77899,1.45629 0.003,2.58496 c 2.76195,-0.19739 5.60018,-0.52183 9.2867,0.46652 z"
       id="path88"
       sodipodi:nodetypes="ccccc" /><rect
       style="fill:#3c6eb4;fill-opacity:1;stroke:none;stroke-width:2.3489;stroke-linecap:round;stroke-linejoin:round;stroke-dasharray:none;stroke-opacity:1;paint-order:stroke fill markers"
       id="rect88"
       width="3.4036191"
       height="10.129014"
       x="490.71753"
       y="589.05365"
       transform="matrix(0.04768113,0.99886261,0.99886261,-0.04768113,0,0)" /><path
       sodipodi:type="star"
       style="fill:#ffffff;fill-opacity:1;stroke:none;stroke-width:3.3766;stroke-linecap:round;stroke-linejoin:round;stroke-dasharray:none;stroke-opacity:1;paint-order:stroke fill markers"
       id="path90"
       inkscape:flatsided="false"
       sodipodi:sides="4"
       sodipodi:cx="-83.895691"
       sodipodi:cy="-93.977196"
       sodipodi:r1="10.353173"
       sodipodi:r2="31.373253"
       sodipodi:arg1="1.277949"
       sodipodi:arg2="2.0633472"
       inkscape:rounded="0.1"
       inkscape:randomized="0"
       d="m -80.906942,-84.064801 c -2.40715,0.725795 -15.609052,18.920401 -17.824378,17.731503 -2.21533,-1.188897 5.649029,-22.248 4.923234,-24.655149 -0.725795,-2.407149 -18.920404,-15.609053 -17.731504,-17.824383 1.1889,-2.21532 22.248001,5.64903 24.65515,4.92324 2.40715,-0.7258 15.609052,-18.9204 17.824378,-17.7315 2.215326,1.18889 -5.649029,22.247996 -4.923234,24.655145 0.725795,2.40715 18.9204,15.609052 17.731503,17.824379 -1.188897,2.215326 -22.248,-5.649029 -24.655149,-4.923235 z"
       transform="matrix(0.15686533,-0.09627976,0.09627976,0.15686533,668.16308,459.19865)"
       inkscape:transform-center-x="-0.43649807"
       inkscape:transform-center-y="-0.22526058" /><path
       sodipodi:type="star"
       style="fill:#3c6eb4;fill-opacity:1;stroke:none;stroke-width:5.66729;stroke-linecap:round;stroke-linejoin:round;stroke-dasharray:none;stroke-opacity:1;paint-order:stroke fill markers"
       id="path144"
       inkscape:flatsided="false"
       sodipodi:sides="5"
       sodipodi:cx="-28.497557"
       sodipodi:cy="95.920502"
       sodipodi:r1="42.927052"
       sodipodi:r2="26.185501"
       sodipodi:arg1="0.82753514"
       sodipodi:arg2="1.4558536"
       inkscape:rounded="0.17"
       inkscape:randomized="0"
       d="m 0.55086168,127.52622 c -3.33427038,3.06448 -21.54646668,-6.11239 -26.04520868,-5.59301 -4.498742,0.51939 -20.140728,13.60478 -24.085575,11.38068 -3.944846,-2.2241 -0.844998,-22.38074 -2.729151,-26.4988 -1.884154,-4.11805 -19.162742,-14.950858 -18.26652,-19.389916 0.896221,-4.439057 21.024229,-7.71967 24.3585,-10.784156 3.334271,-3.064487 8.297502,-22.844921 12.796245,-23.364308 4.498741,-0.519387 13.838686,17.609722 17.783532,19.833823 3.944847,2.224102 24.2908801,0.831925 26.175034,4.949984 1.884154,4.118058 -12.4714508,18.603076 -13.3676723,23.042133 -0.8962217,4.43906 6.7150868,23.35908 3.38081598,26.42357 z"
       transform="matrix(0.08106538,0.07385097,0.07385097,-0.08106538,642.29535,511.12821)" /><path
       sodipodi:type="star"
       style="fill:#3c6eb4;fill-opacity:1;stroke:none;stroke-width:5.66729;stroke-linecap:round;stroke-linejoin:round;stroke-dasharray:none;stroke-opacity:1;paint-order:stroke fill markers"
       id="path148"
       inkscape:flatsided="false"
       sodipodi:sides="5"
       sodipodi:cx="-28.497557"
       sodipodi:cy="95.920502"
       sodipodi:r1="42.927052"
       sodipodi:r2="26.185501"
       sodipodi:arg1="0.82753514"
       sodipodi:arg2="1.4558536"
       inkscape:rounded="0.17"
       inkscape:randomized="0"
       d="m 0.55086168,127.52622 c -3.33427038,3.06448 -21.54646668,-6.11239 -26.04520868,-5.59301 -4.498742,0.51939 -20.140728,13.60478 -24.085575,11.38068 -3.944846,-2.2241 -0.844998,-22.38074 -2.729151,-26.4988 -1.884154,-4.11805 -19.162742,-14.950858 -18.26652,-19.389916 0.896221,-4.439057 21.024229,-7.71967 24.3585,-10.784156 3.334271,-3.064487 8.297502,-22.844921 12.796245,-23.364308 4.498741,-0.519387 13.838686,17.609722 17.783532,19.833823 3.944847,2.224102 24.2908801,0.831925 26.175034,4.949984 1.884154,4.118058 -12.4714508,18.603076 -13.3676723,23.042133 -0.8962217,4.43906 6.7150868,23.35908 3.38081598,26.42357 z"
       transform="matrix(-0.01100268,-0.10910775,-0.10910775,0.01100268,604.02668,437.3059)" /><path
       style="fill:#82ceff;fill-opacity:1;stroke:none;stroke-width:0.591886px;stroke-linecap:butt;stroke-linejoin:miter;stroke-opacity:1"
       d="m 417.03966,485.77426 6.85825,5.67061 1.94904,-1.69802 c -1.96085,-1.9551 -4.06763,-3.88442 -5.74007,-7.3152 z"
       id="path150"
       sodipodi:nodetypes="ccccc" /><path
       style="fill:#82ceff;fill-opacity:1;stroke:none;stroke-width:0.591886px;stroke-linecap:butt;stroke-linejoin:miter;stroke-opacity:1"
       d="m 597.95209,466.03666 -9.92241,-2.85529 -1.28692,2.70911 c 2.99153,1.17141 6.12641,2.24785 9.49476,5.12271 z"
       id="path151"
       sodipodi:nodetypes="ccccc" /><path
       sodipodi:type="star"
       style="fill:#ffffff;fill-opacity:1;stroke:none;stroke-width:3.3766;stroke-linecap:round;stroke-linejoin:round;stroke-dasharray:none;stroke-opacity:1;paint-order:stroke fill markers"
       id="path152"
       inkscape:flatsided="false"
       sodipodi:sides="4"
       sodipodi:cx="-83.895691"
       sodipodi:cy="-93.977196"
       sodipodi:r1="10.353173"
       sodipodi:r2="31.373253"
       sodipodi:arg1="1.277949"
       sodipodi:arg2="2.0633472"
       inkscape:rounded="0.1"
       inkscape:randomized="0"
       d="m -80.906942,-84.064801 c -2.40715,0.725795 -15.609052,18.920401 -17.824378,17.731503 -2.21533,-1.188897 5.649029,-22.248 4.923234,-24.655149 -0.725795,-2.407149 -18.920404,-15.609053 -17.731504,-17.824383 1.1889,-2.21532 22.248001,5.64903 24.65515,4.92324 2.40715,-0.7258 15.609052,-18.9204 17.824378,-17.7315 2.215326,1.18889 -5.649029,22.247996 -4.923234,24.655145 0.725795,2.40715 18.9204,15.609052 17.731503,17.824379 -1.188897,2.215326 -22.248,-5.649029 -24.655149,-4.923235 z"
       transform="matrix(-0.17557264,-0.05523381,0.05523381,-0.17557264,559.99135,398.48496)"
       inkscape:transform-center-x="-0.43649807"
       inkscape:transform-center-y="-0.22526058" /><path
       sodipodi:type="star"
       style="fill:#ffffff;fill-opacity:1;stroke:none;stroke-width:5.66729;stroke-linecap:round;stroke-linejoin:round;stroke-dasharray:none;stroke-opacity:1;paint-order:stroke fill markers"
       id="path153"
       inkscape:flatsided="false"
       sodipodi:sides="5"
       sodipodi:cx="-28.497557"
       sodipodi:cy="95.920502"
       sodipodi:r1="42.927052"
       sodipodi:r2="26.185501"
       sodipodi:arg1="0.82753514"
       sodipodi:arg2="1.4558536"
       inkscape:rounded="0.17"
       inkscape:randomized="0"
       d="m 0.55086168,127.52622 c -3.33427038,3.06448 -21.54646668,-6.11239 -26.04520868,-5.59301 -4.498742,0.51939 -20.140728,13.60478 -24.085575,11.38068 -3.944846,-2.2241 -0.844998,-22.38074 -2.729151,-26.4988 -1.884154,-4.11805 -19.162742,-14.950858 -18.26652,-19.389916 0.896221,-4.439057 21.024229,-7.71967 24.3585,-10.784156 3.334271,-3.064487 8.297502,-22.844921 12.796245,-23.364308 4.498741,-0.519387 13.838686,17.609722 17.783532,19.833823 3.944847,2.224102 24.2908801,0.831925 26.175034,4.949984 1.884154,4.118058 -12.4714508,18.603076 -13.3676723,23.042133 -0.8962217,4.43906 6.7150868,23.35908 3.38081598,26.42357 z"
       transform="matrix(-0.07193885,-0.08276689,0.08276689,-0.07193885,385.6171,434.16939)" /><path
       style="fill:#ffffff;fill-opacity:1;stroke:none;stroke-width:0.591886px;stroke-linecap:butt;stroke-linejoin:miter;stroke-opacity:1"
       d="m 462.62534,439.27966 4.36777,-5.42964 1.76247,0.99547 c -1.19626,1.80844 -2.50846,3.6201 -3.25108,6.51507 z"
       id="path154"
       sodipodi:nodetypes="ccccc" /><rect
       style="fill:#ffffff;fill-opacity:1;stroke:none;stroke-width:2.3489;stroke-linecap:round;stroke-linejoin:round;stroke-dasharray:none;stroke-opacity:1;paint-order:stroke fill markers"
       id="rect154"
       width="3.4036191"
       height="10.129013"
       x="131.71686"
       y="-590.63043"
       transform="rotate(125.84538)" /><rect
       style="fill:#3c6eb4;fill-opacity:1;stroke:none;stroke-width:2.3489;stroke-linecap:round;stroke-linejoin:round;stroke-dasharray:none;stroke-opacity:1;paint-order:stroke fill markers"
       id="rect155"
       width="3.4036191"
       height="10.129014"
       x="425.9371"
       y="457.58505"
       transform="matrix(-0.07607097,0.99710241,0.99710241,0.07607097,0,0)" /><path
       style="fill:#82ceff;fill-opacity:1;stroke:none;stroke-width:0.591886px;stroke-linecap:butt;stroke-linejoin:miter;stroke-opacity:1"
       d="m 464.29311,455.33336 -9.9224,-2.85529 -1.28692,2.70911 c 2.99152,1.17141 6.1264,2.24785 9.49476,5.12271 z"
       id="path155"
       sodipodi:nodetypes="ccccc" /><path
       sodipodi:type="star"
       style="fill:#ffffff;fill-opacity:1;stroke:none;stroke-width:3.3766;stroke-linecap:round;stroke-linejoin:round;stroke-dasharray:none;stroke-opacity:1;paint-order:stroke fill markers"
       id="path156"
       inkscape:flatsided="false"
       sodipodi:sides="4"
       sodipodi:cx="-83.895691"
       sodipodi:cy="-93.977196"
       sodipodi:r1="10.353173"
       sodipodi:r2="31.373253"
       sodipodi:arg1="1.277949"
       sodipodi:arg2="2.0633472"
       inkscape:rounded="0.1"
       inkscape:randomized="0"
       d="m -80.906942,-84.064801 c -2.40715,0.725795 -15.609052,18.920401 -17.824378,17.731503 -2.21533,-1.188897 5.649029,-22.248 4.923234,-24.655149 -0.725795,-2.407149 -18.920404,-15.609053 -17.731504,-17.824383 1.1889,-2.21532 22.248001,5.64903 24.65515,4.92324 2.40715,-0.7258 15.609052,-18.9204 17.824378,-17.7315 2.215326,1.18889 -5.649029,22.247996 -4.923234,24.655145 0.725795,2.40715 18.9204,15.609052 17.731503,17.824379 -1.188897,2.215326 -22.248,-5.649029 -24.655149,-4.923235 z"
       transform="matrix(-0.17557264,-0.05523381,0.05523381,-0.17557264,442.81719,484.79823)"
       inkscape:transform-center-x="-0.43649807"
       inkscape:transform-center-y="-0.22526058" /><path
       style="fill:#82ceff;fill-opacity:1;stroke:none;stroke-width:0.591886px;stroke-linecap:butt;stroke-linejoin:miter;stroke-opacity:1"
       d="m 398.35005,271.8207 -5.94401,-8.44248 -2.70045,1.305 c 1.59748,2.78738 3.36619,5.59057 4.19,9.94166 z"
       id="path158"
       sodipodi:nodetypes="ccccc" /><circle
       style="fill:#ffffff;fill-opacity:1;stroke:none;stroke-width:2.3489;stroke-linecap:round;stroke-linejoin:round;stroke-dasharray:none;stroke-opacity:1;paint-order:stroke fill markers"
       id="circle158"
       cx="-337.59943"
       cy="420.25696"
       r="1.9340422"
       transform="rotate(-92.197948)" /><circle
       style="fill:#ffffff;fill-opacity:1;stroke:none;stroke-width:2.3489;stroke-linecap:round;stroke-linejoin:round;stroke-dasharray:none;stroke-opacity:1;paint-order:stroke fill markers"
       id="circle159"
       cx="-273.59601"
       cy="512.3866"
       r="1.9340422"
       transform="rotate(-92.197948)" /><path
       style="fill:#ffffff;fill-opacity:1;stroke:none;stroke-width:0.591886px;stroke-linecap:butt;stroke-linejoin:miter;stroke-opacity:1"
       d="m 503.6853,244.97781 -7.66462,5.39637 1.18476,2.45165 c 2.53058,-1.45033 5.07547,-3.05602 9.02567,-3.80396 z"
       id="path160"
       sodipodi:nodetypes="ccccc" /><path
       style="fill:#3c6eb4;fill-opacity:1;stroke:none;stroke-width:0.591886px;stroke-linecap:butt;stroke-linejoin:miter;stroke-opacity:1"
       d="m 396.80354,367.1493 -1.71267,7.33075 3.54725,0.89332 4.29944,-7.52813 z"
       id="path161"
       sodipodi:nodetypes="ccccc" /><path
       sodipodi:type="star"
       style="fill:#82ceff;fill-opacity:1;stroke:none;stroke-width:3.54576;stroke-linecap:round;stroke-linejoin:round;stroke-dasharray:none;stroke-opacity:1;paint-order:stroke fill markers"
       id="path162"
       inkscape:flatsided="true"
       sodipodi:sides="4"
       sodipodi:cx="-51.034725"
       sodipodi:cy="-62.770813"
       sodipodi:r1="21.390997"
       sodipodi:r2="9.2603378"
       sodipodi:arg1="0.58684597"
       sodipodi:arg2="1.3722441"
       inkscape:rounded="-0.12"
       inkscape:randomized="0"
       d="m -33.222628,-50.925817 c 2.010163,-3.022813 -32.679906,3.956939 -29.657093,5.967102 3.022813,2.010162 -3.956939,-32.679907 -5.967102,-29.657094 -2.010162,3.022813 32.679907,-3.956939 29.657094,-5.967102 -3.022813,-2.010162 3.956939,32.679907 5.967101,29.657094 z"
       transform="matrix(0.13457586,-0.11229696,0.11229696,0.13457586,491.61467,247.46971)"
       inkscape:transform-center-x="23.561818"
       inkscape:transform-center-y="-28.902455" /><path
       sodipodi:type="star"
       style="fill:#ffffff;fill-opacity:1;stroke:none;stroke-width:5.66729;stroke-linecap:round;stroke-linejoin:round;stroke-dasharray:none;stroke-opacity:1;paint-order:stroke fill markers"
       id="path163"
       inkscape:flatsided="false"
       sodipodi:sides="5"
       sodipodi:cx="-28.497557"
       sodipodi:cy="95.920502"
       sodipodi:r1="42.927052"
       sodipodi:r2="26.185501"
       sodipodi:arg1="0.82753514"
       sodipodi:arg2="1.4558536"
       inkscape:rounded="0.17"
       inkscape:randomized="0"
       d="m 0.55086168,127.52622 c -3.33427038,3.06448 -21.54646668,-6.11239 -26.04520868,-5.59301 -4.498742,0.51939 -20.140728,13.60478 -24.085575,11.38068 -3.944846,-2.2241 -0.844998,-22.38074 -2.729151,-26.4988 -1.884154,-4.11805 -19.162742,-14.950858 -18.26652,-19.389916 0.896221,-4.439057 21.024229,-7.71967 24.3585,-10.784156 3.334271,-3.064487 8.297502,-22.844921 12.796245,-23.364308 4.498741,-0.519387 13.838686,17.609722 17.783532,19.833823 3.944847,2.224102 24.2908801,0.831925 26.175034,4.949984 1.884154,4.118058 -12.4714508,18.603076 -13.3676723,23.042133 -0.8962217,4.43906 6.7150868,23.35908 3.38081598,26.42357 z"
       transform="matrix(-0.00420572,-0.10958042,0.10958042,-0.00420572,440.43565,251.53437)" /><path
       style="fill:#ffffff;fill-opacity:1;stroke:none;stroke-width:0.591886px;stroke-linecap:butt;stroke-linejoin:miter;stroke-opacity:1"
       d="m 427.47989,507.99325 1.49483,6.80618 -1.88016,0.74984 c -0.65988,-2.06542 -1.24959,-4.22324 -3.0405,-6.61594 z"
       id="path167"
       sodipodi:nodetypes="ccccc" /><path
       sodipodi:type="star"
       style="fill:#3c6eb4;fill-opacity:1;stroke:none;stroke-width:5.66729;stroke-linecap:round;stroke-linejoin:round;stroke-dasharray:none;stroke-opacity:1;paint-order:stroke fill markers"
       id="path168"
       inkscape:flatsided="false"
       sodipodi:sides="5"
       sodipodi:cx="-28.497557"
       sodipodi:cy="95.920502"
       sodipodi:r1="42.927052"
       sodipodi:r2="26.185501"
       sodipodi:arg1="0.82753514"
       sodipodi:arg2="1.4558536"
       inkscape:rounded="0.17"
       inkscape:randomized="0"
       d="m 0.55086168,127.52622 c -3.33427038,3.06448 -21.54646668,-6.11239 -26.04520868,-5.59301 -4.498742,0.51939 -20.140728,13.60478 -24.085575,11.38068 -3.944846,-2.2241 -0.844998,-22.38074 -2.729151,-26.4988 -1.884154,-4.11805 -19.162742,-14.950858 -18.26652,-19.389916 0.896221,-4.439057 21.024229,-7.71967 24.3585,-10.784156 3.334271,-3.064487 8.297502,-22.844921 12.796245,-23.364308 4.498741,-0.519387 13.838686,17.609722 17.783532,19.833823 3.944847,2.224102 24.2908801,0.831925 26.175034,4.949984 1.884154,4.118058 -12.4714508,18.603076 -13.3676723,23.042133 -0.8962217,4.43906 6.7150868,23.35908 3.38081598,26.42357 z"
       transform="matrix(0.01690509,0.10835026,0.10835026,-0.01690509,423.86499,295.36958)" /><path
       style="fill:#82ceff;fill-opacity:1;stroke:none;stroke-width:0.591886px;stroke-linecap:butt;stroke-linejoin:miter;stroke-opacity:1"
       d="m 547.05553,249.33733 -7.15575,-5.29023 -1.85416,1.80113 c 2.06401,1.84585 4.27234,3.65805 6.12842,6.99305 z"
       id="path170"
       sodipodi:nodetypes="ccccc" /><rect
       style="fill:#ffffff;fill-opacity:1;stroke:none;stroke-width:2.3489;stroke-linecap:round;stroke-linejoin:round;stroke-dasharray:none;stroke-opacity:1;paint-order:stroke fill markers"
       id="rect172"
       width="3.4036191"
       height="10.129013"
       x="-321.3577"
       y="-415.66986"
       transform="rotate(164.64376)" /><rect
       style="fill:#3c6eb4;fill-opacity:1;stroke:none;stroke-width:2.3489;stroke-linecap:round;stroke-linejoin:round;stroke-dasharray:none;stroke-opacity:1;paint-order:stroke fill markers"
       id="rect173"
       width="3.4036191"
       height="10.129014"
       x="498.4014"
       y="8.6409788"
       transform="matrix(0.82544061,0.56448897,0.56448897,-0.82544061,0,0)" /><rect
       style="fill:#3c6eb4;fill-opacity:1;stroke:none;stroke-width:2.3489;stroke-linecap:round;stroke-linejoin:round;stroke-dasharray:none;stroke-opacity:1;paint-order:stroke fill markers"
       id="rect174"
       width="3.4036191"
       height="10.129014"
       x="-38.426605"
       y="502.17816"
       transform="matrix(-0.68405256,0.72943272,0.72943272,0.68405256,0,0)" /><path
       sodipodi:type="star"
       style="fill:#82ceff;fill-opacity:1;stroke:none;stroke-width:3.54576;stroke-linecap:round;stroke-linejoin:round;stroke-dasharray:none;stroke-opacity:1;paint-order:stroke fill markers"
       id="path174"
       inkscape:flatsided="true"
       sodipodi:sides="4"
       sodipodi:cx="-51.034725"
       sodipodi:cy="-62.770813"
       sodipodi:r1="21.390997"
       sodipodi:r2="9.2603378"
       sodipodi:arg1="0.58684597"
       sodipodi:arg2="1.3722441"
       inkscape:rounded="-0.12"
       inkscape:randomized="0"
       d="m -33.222628,-50.925817 c 2.010163,-3.022813 -32.679906,3.956939 -29.657093,5.967102 3.022813,2.010162 -3.956939,-32.679907 -5.967102,-29.657094 -2.010162,3.022813 32.679907,-3.956939 29.657094,-5.967102 -3.022813,-2.010162 3.956939,32.679907 5.967101,29.657094 z"
       transform="matrix(0.13457586,-0.11229696,0.11229696,0.13457586,442.08169,254.77544)"
       inkscape:transform-center-x="23.561818"
       inkscape:transform-center-y="-28.902455" /><path
       style="fill:#ffffff;fill-opacity:1;stroke:none;stroke-width:0.591886px;stroke-linecap:butt;stroke-linejoin:miter;stroke-opacity:1"
       d="m 584.68092,245.25744 -9.37375,-0.0148 -0.44686,2.68601 c 2.90367,0.2755 5.90873,0.43235 9.5666,2.10064 z"
       id="path177"
       sodipodi:nodetypes="ccccc" /><path
       sodipodi:type="star"
       style="fill:#ffffff;fill-opacity:1;stroke:none;stroke-width:3.3766;stroke-linecap:round;stroke-linejoin:round;stroke-dasharray:none;stroke-opacity:1;paint-order:stroke fill markers"
       id="path179"
       inkscape:flatsided="false"
       sodipodi:sides="4"
       sodipodi:cx="-83.895691"
       sodipodi:cy="-93.977196"
       sodipodi:r1="10.353173"
       sodipodi:r2="31.373253"
       sodipodi:arg1="1.277949"
       sodipodi:arg2="2.0633472"
       inkscape:rounded="0.1"
       inkscape:randomized="0"
       d="m -80.906942,-84.064801 c -2.40715,0.725795 -15.609052,18.920401 -17.824378,17.731503 -2.21533,-1.188897 5.649029,-22.248 4.923234,-24.655149 -0.725795,-2.407149 -18.920404,-15.609053 -17.731504,-17.824383 1.1889,-2.21532 22.248001,5.64903 24.65515,4.92324 2.40715,-0.7258 15.609052,-18.9204 17.824378,-17.7315 2.215326,1.18889 -5.649029,22.247996 -4.923234,24.655145 0.725795,2.40715 18.9204,15.609052 17.731503,17.824379 -1.188897,2.215326 -22.248,-5.649029 -24.655149,-4.923235 z"
       transform="matrix(-0.10357409,-0.15214774,0.15214774,-0.10357409,601.05543,472.67296)"
       inkscape:transform-center-x="4.8816156"
       inkscape:transform-center-y="3.1764579" /><path
       sodipodi:type="star"
       style="fill:#ffffff;fill-opacity:1;stroke:none;stroke-width:3.3766;stroke-linecap:round;stroke-linejoin:round;stroke-dasharray:none;stroke-opacity:1;paint-order:stroke fill markers"
       id="path300"
       inkscape:flatsided="false"
       sodipodi:sides="4"
       sodipodi:cx="-83.895691"
       sodipodi:cy="-93.977196"
       sodipodi:r1="10.353173"
       sodipodi:r2="31.373253"
       sodipodi:arg1="1.277949"
       sodipodi:arg2="2.0633472"
       inkscape:rounded="0.1"
       inkscape:randomized="0"
       d="m -80.906942,-84.064801 c -2.40715,0.725795 -15.609052,18.920401 -17.824378,17.731503 -2.21533,-1.188897 5.649029,-22.248 4.923234,-24.655149 -0.725795,-2.407149 -18.920404,-15.609053 -17.731504,-17.824383 1.1889,-2.21532 22.248001,5.64903 24.65515,4.92324 2.40715,-0.7258 15.609052,-18.9204 17.824378,-17.7315 2.215326,1.18889 -5.649029,22.247996 -4.923234,24.655145 0.725795,2.40715 18.9204,15.609052 17.731503,17.824379 -1.188897,2.215326 -22.248,-5.649029 -24.655149,-4.923235 z"
       transform="matrix(0.15686533,-0.09627976,0.09627976,0.15686533,417.16067,489.0298)"
       inkscape:transform-center-x="-0.43649807"
       inkscape:transform-center-y="-0.22526058" /><path
       sodipodi:type="star"
       style="fill:#3c6eb4;fill-opacity:1;stroke:none;stroke-width:5.66729;stroke-linecap:round;stroke-linejoin:round;stroke-dasharray:none;stroke-opacity:1;paint-order:stroke fill markers"
       id="path301"
       inkscape:flatsided="false"
       sodipodi:sides="5"
       sodipodi:cx="-28.497557"
       sodipodi:cy="95.920502"
       sodipodi:r1="42.927052"
       sodipodi:r2="26.185501"
       sodipodi:arg1="0.82753514"
       sodipodi:arg2="1.4558536"
       inkscape:rounded="0.17"
       inkscape:randomized="0"
       d="m 0.55086168,127.52622 c -3.33427038,3.06448 -21.54646668,-6.11239 -26.04520868,-5.59301 -4.498742,0.51939 -20.140728,13.60478 -24.085575,11.38068 -3.944846,-2.2241 -0.844998,-22.38074 -2.729151,-26.4988 -1.884154,-4.11805 -19.162742,-14.950858 -18.26652,-19.389916 0.896221,-4.439057 21.024229,-7.71967 24.3585,-10.784156 3.334271,-3.064487 8.297502,-22.844921 12.796245,-23.364308 4.498741,-0.519387 13.838686,17.609722 17.783532,19.833823 3.944847,2.224102 24.2908801,0.831925 26.175034,4.949984 1.884154,4.118058 -12.4714508,18.603076 -13.3676723,23.042133 -0.8962217,4.43906 6.7150868,23.35908 3.38081598,26.42357 z"
       transform="matrix(0.08106538,0.07385097,0.07385097,-0.08106538,400.88738,519.84396)" /><g
       id="g180"
       transform="matrix(11.964409,12.422531,-12.422531,11.964409,3441.769,-2820.134)"
       inkscape:export-filename="/home/thlavack/Pictures/fedora-design/ #615 Fedora Appreciation Week/pngs/f.png"
       inkscape:export-xdpi="95.5"
       inkscape:export-ydpi="95.5"
       style="opacity:0.716112;mix-blend-mode:lighten;fill:#db3279;stroke:none"><rect
         style="fill:#db3279;stroke:none;stroke-width:0.0579804;stroke-linecap:round;stroke-linejoin:bevel;stroke-dasharray:none;paint-order:markers fill stroke"
         id="rect179"
         width="18.117592"
         height="18.122772"
         x="-178.3461"
         y="176.42265"
         transform="rotate(-46.076207)" /></g><rect
       style="fill:#a07cbc;fill-opacity:0.5;stroke:none;stroke-width:1;stroke-linecap:round;stroke-linejoin:bevel;stroke-dasharray:none;paint-order:markers fill stroke"
       id="rect190"
       width="325.03384"
       height="320.10333"
       x="357.41309"
       y="215.54999" /><g
       id="g283"
       transform="translate(-68.658888,13.831818)"><g
         id="g282"
         transform="matrix(1.1434802,0,0,1.1434802,-86.693188,174.26122)"
         style="mix-blend-mode:normal;fill:#ffffff"><g
           id="g281"
           transform="matrix(1.1692152,0,0,1.1692152,-107.92803,-51.425699)"
           style="fill:#ffffff"><g
             id="g280"
             transform="matrix(0.57928696,0,0,0.57928696,297.03648,-118.00003)"
             style="fill:#ffffff;fill-opacity:1"><g
               id="g276"
               transform="matrix(0.68945,0,0,0.60473167,421.95324,488.53103)"
               style="fill:#ffffff;fill-opacity:1"
               inkscape:export-filename="/home/thlavack/Pictures/fedora-design/ #615 Fedora Appreciation Week/pngs/f.png"
               inkscape:export-xdpi="95.5"
               inkscape:export-ydpi="95.5" /><g
               id="g279"
               transform="matrix(1.1150486,0,0,1.1150486,476.18545,303.65207)"
               style="fill:#ffffff;fill-opacity:1"><g
                 id="g278"
                 transform="translate(16.185201,-4.7334797)"
                 inkscape:export-filename="/home/thlavack/Pictures/fedora-design/ #615 Fedora Appreciation Week/pngs/f.png"
                 inkscape:export-xdpi="95.5"
                 inkscape:export-ydpi="95.5"
                 style="fill:#ffffff;fill-opacity:1"><g
                   id="g277"
                   style="fill:#ffffff;fill-opacity:1" /></g></g><path
               id="path279"
               style="color:#000000;font-style:normal;font-variant:normal;font-weight:normal;font-stretch:normal;font-size:medium;line-height:normal;font-family:sans-serif;font-variant-ligatures:normal;font-variant-position:normal;font-variant-caps:normal;font-variant-numeric:normal;font-variant-alternates:normal;font-feature-settings:normal;text-indent:0;text-align:start;text-decoration:none;text-decoration-line:none;text-decoration-style:solid;text-decoration-color:#000000;letter-spacing:normal;word-spacing:normal;text-transform:none;writing-mode:lr-tb;direction:ltr;text-orientation:mixed;dominant-baseline:auto;baseline-shift:baseline;text-anchor:start;white-space:normal;shape-padding:0;clip-rule:nonzero;display:inline;overflow:visible;visibility:visible;isolation:auto;mix-blend-mode:normal;color-interpolation:sRGB;color-interpolation-filters:linearRGB;solid-color:#000000;solid-opacity:1;vector-effect:none;fill:#ffffff;fill-opacity:1;fill-rule:nonzero;stroke:none;stroke-width:1.34691;stroke-linecap:round;stroke-linejoin:round;stroke-miterlimit:4;stroke-dasharray:none;stroke-dashoffset:0;stroke-opacity:1;paint-order:markers stroke fill;color-rendering:auto;image-rendering:auto;shape-rendering:auto;text-rendering:auto;enable-background:accumulate"
               d="m 504.80404,607.37872 c -0.37131,0.006 -0.66775,0.31131 -0.66268,0.68264 0,2.00903 -1.59478,3.63437 -3.60345,3.67221 -2.00867,0.0379 -3.66355,-1.52567 -3.73919,-3.53328 -0.033,-0.89793 -1.37974,-0.84833 -1.34676,0.0496 0.1027,2.72605 2.3841,4.88185 5.1116,4.83047 1.8165,-0.0342 3.3965,-1.03968 4.2501,-2.51284 0.88702,1.53073 2.55702,2.54833 4.44072,2.51284 1.83543,-0.0345 3.43002,-1.06083 4.27754,-2.55916 0.88042,1.55629 2.5646,2.595 4.46707,2.55916 1.81945,-0.0342 3.40176,-1.04289 4.25438,-2.51998 0.88597,1.53465 2.55804,2.55554 4.44464,2.51998 1.82017,-0.0342 3.40374,-1.04368 4.25651,-2.52175 0.88571,1.53556 2.55773,2.55731 4.44498,2.52175 2.7275,-0.0514 4.92598,-2.29096 4.92598,-5.01894 0.005,-0.3797 -0.30437,-0.68862 -0.68406,-0.68264 -0.37174,0.005 -0.66883,0.3109 -0.66376,0.68264 0,2.00903 -1.59479,3.63437 -3.60345,3.67219 -2.00868,0.0379 -3.6639,-1.52565 -3.73955,-3.53326 -2e-4,-0.0397 -0.004,-0.0793 -0.0111,-0.11835 2e-5,-0.007 2.9e-4,-0.0132 2.9e-4,-0.0208 0.005,-0.3797 -0.30437,-0.68862 -0.68406,-0.68264 -0.37187,0.005 -0.66918,0.31076 -0.66411,0.68264 0,2.00903 -1.59478,3.63438 -3.60345,3.67221 -2.00867,0.0379 -3.66354,-1.52567 -3.73919,-3.53326 -2.3e-4,-0.0376 -0.004,-0.0752 -0.0101,-0.11224 5e-5,-0.008 5.9e-4,-0.0178 5.9e-4,-0.0268 0.005,-0.3797 -0.30438,-0.68862 -0.68407,-0.68264 -0.37117,0.006 -0.6674,0.31145 -0.66232,0.68264 0,2.00903 -1.59478,3.63438 -3.60345,3.67222 -2.00867,0.0379 -3.66389,-1.52568 -3.73955,-3.53328 -0.003,-0.091 -0.0252,-0.18027 -0.0641,-0.26256 -0.0563,-0.32679 -0.34217,-0.56395 -0.67374,-0.55902 -0.37131,0.006 -0.66775,0.31131 -0.66268,0.68264 0,2.00903 -1.59478,3.63438 -3.60345,3.67222 -2.00867,0.0379 -3.6639,-1.52568 -3.73955,-3.53328 -6e-4,-0.0182 -0.002,-0.0364 -0.004,-0.0545 5.2e-4,-0.0283 0.002,-0.056 0.002,-0.0845 0.005,-0.3797 -0.30438,-0.68862 -0.68407,-0.68264 z m -8.77781,-3.47637 v 3.76518 c 0,0.15059 0.1392,0.27172 0.31228,0.27172 h 43.09998 c 0.17309,0 0.31228,-0.12116 0.31228,-0.27172 v -3.76518 z m 0.13019,3.25339 c -0.0111,0.12145 -0.0171,0.24331 -0.0179,0.36525 1.3e-4,2.42858 2.00531,4.39724 4.47871,4.39712 2.01962,-4.8e-4 3.78903,-1.32815 4.31992,-3.24144 0.53049,1.91185 2.29775,3.23916 4.31585,3.24144 2.01932,-5.4e-4 3.78851,-1.32788 4.31961,-3.24081 0.53073,1.9116 2.29793,3.23861 4.31585,3.24081 2.01962,-4.8e-4 3.78903,-1.32815 4.31992,-3.24144 0.53049,1.91185 2.29775,3.23916 4.31585,3.24144 2.01962,-4.7e-4 3.78904,-1.32815 4.31993,-3.24144 0.53049,1.91185 2.29774,3.23916 4.31584,3.24144 2.47327,-6e-5 4.47826,-1.96866 4.47839,-4.39712 -10e-4,-0.12195 -0.007,-0.2438 -0.0185,-0.36525 z m 1.47639,-4.43699 c -1.26989,0 -2.31836,1.04847 -2.31836,2.31836 v 22.80859 c 0,1.26989 1.04847,2.31836 2.31836,2.31836 h 40.51172 c 1.26989,0 2.31641,-1.04847 2.31641,-2.31836 v -22.80859 c 0,-1.26989 -1.04652,-2.31836 -2.31641,-2.31836 z m 0,1.6543 h 40.51172 c 0.38272,0 0.66406,0.28134 0.66406,0.66406 v 22.80859 c 0,0.38272 -0.28134,0.66407 -0.66406,0.66407 h -40.51172 c -0.38272,0 -0.66406,-0.28135 -0.66406,-0.66407 v -22.80859 c 0,-0.38272 0.28134,-0.66406 0.66406,-0.66406 z m 14.75867,-34.43679 c -2.2695,2.1e-4 -4.12523,1.85313 -4.12481,4.12262 0,6.7e-4 0,10e-4 0,0.002 7e-5,0.0227 0.008,0.0448 0.009,0.0675 -2.14484,0.13974 -3.86763,1.8938 -3.86783,4.07255 4.3e-4,2.22739 1.79097,4.05542 4.01374,4.11609 0.003,3.9e-4 0.003,0.002 0.007,0.002 0.008,2.1e-4 0.0155,0.004 0.024,0.004 0.004,3e-5 0.007,3e-5 0.0109,0 0.007,2.4e-4 0.006,0.002 0.0131,0.002 h 6.79264 c 0.67897,0 1.24572,-0.56817 1.24572,-1.24572 v -6.79265 c 0,-0.16429 -0.005,-0.0975 -0.007,-0.0567 0.003,-0.0552 0.006,-0.11028 0.007,-0.16551 0,-10e-4 0,-0.003 0,-0.004 4.1e-4,-2.26949 -1.85313,-4.12459 -4.12263,-4.12481 z m 12.73993,-0.0998 c -3.44447,0 -6.23601,2.79057 -6.23825,6.23427 h -6.9e-4 v 4.82894 h 6.9e-4 c 6.8e-4,0.78178 0.6351,1.41461 1.41731,1.41461 h 0.007 6.8e-4 4.81564 c 3.44486,-0.001 6.2356,-2.79367 6.2356,-6.23825 0,-3.44602 -2.79222,-6.23957 -6.23826,-6.23957 z m 1.2644,2.56735 c 1.04769,0 2.03689,0.80278 2.03689,1.90923 0,0.10259 -3.9e-4,0.20537 -0.0173,0.32176 -0.0289,0.29438 -0.2974,0.50551 -0.59033,0.46402 -0.29291,-0.042 -0.4916,-0.3193 -0.43741,-0.61026 0.005,-0.0332 0.007,-0.0859 0.007,-0.17547 0,-0.62735 -0.51302,-0.86954 -0.99849,-0.86954 -0.48517,0 -0.92288,0.40798 -0.92404,0.86954 0.008,0.5339 0,1.06396 0,1.59679 l 0.90011,-0.007 c 0.70301,-0.0142 0.71089,1.04507 0.008,1.03969 l -0.90809,0.007 c -0.003,0.42941 0.003,0.35143 6.9e-4,0.5677 0,0 0.008,0.52453 -0.008,0.92272 -0.10868,1.16942 -1.10402,2.10466 -2.30012,2.10466 -1.26777,0 -2.31342,-1.03721 -2.31342,-2.30811 0.0381,-1.30739 1.08165,-2.33491 2.39452,-2.32271 l 0.73125,-0.006 v 1.03838 l -0.73125,0.007 h -0.006 c -0.72157,0.0214 -1.339,0.5103 -1.35081,1.28302 0,0.70408 0.56899,1.2684 1.27503,1.2684 0.70487,0 1.26839,-0.51338 1.26839,-1.26707 0.008,-1.24991 -0.005,-2.63061 -6.8e-4,-3.92882 3.9e-4,-0.073 0.004,-0.13103 0.012,-0.21139 0.11904,-0.96117 0.9788,-1.69386 1.95179,-1.69386 z m -22.85898,12.22347 c -1.14144,0 -2.08571,0.94436 -2.08576,2.08576 v 13.03501 c -8.5e-4,0.45688 0.36915,0.82777 0.82603,0.82803 0.45714,1.1e-4 0.82755,-0.37089 0.8267,-0.82803 v -6.61359 c 0.52029,0.27487 1.09861,0.42487 1.83355,0.41102 1.81649,-0.0342 3.39599,-1.0396 4.24959,-2.51279 0.887,1.53075 2.55737,2.5483 4.44108,2.51279 1.83543,-0.0345 3.43009,-1.06048 4.27761,-2.55883 0.88042,1.55629 2.56464,2.59467 4.46711,2.55883 1.81945,-0.0342 3.40165,-1.04239 4.25426,-2.51946 0.88597,1.53465 2.55783,2.55502 4.44442,2.51946 0.5605,-0.0106 1.09768,-0.11467 1.59868,-0.29559 l -0.004,6.36338 c 2.6e-4,0.45532 0.36871,0.82467 0.82403,0.82603 0.45688,8.5e-4 0.82777,-0.36915 0.82803,-0.82603 l 0.008,-12.89823 c 7.4e-4,-1.14208 -0.94433,-2.08776 -2.08577,-2.08776 z m 0,1.65406 h 28.70357 c 0.25427,0 0.43386,0.17805 0.4337,0.4317 l -0.003,5.06628 c -0.48718,0.25412 -1.03587,0.40859 -1.62471,0.41969 -2.00866,0.0379 -3.6635,-1.5254 -3.73915,-3.53299 -2e-4,-0.0375 -0.004,-0.0757 -0.01,-0.11276 3e-5,-0.008 0,-0.0178 0,-0.0267 0.005,-0.37969 -0.30423,-0.68856 -0.68391,-0.68257 -0.37118,0.007 -0.66697,0.31139 -0.6619,0.68257 0,2.00903 -1.59504,3.63461 -3.60371,3.67244 -2.00866,0.0379 -3.66416,-1.52605 -3.73982,-3.53365 -0.003,-0.0909 -0.0252,-0.17992 -0.0641,-0.26223 -0.0563,-0.32679 -0.34167,-0.56408 -0.67323,-0.55913 -0.37132,0.005 -0.6683,0.31126 -0.66323,0.68257 0,2.00903 -1.59435,3.63461 -3.60304,3.67244 -2.00865,0.0379 -3.66418,-1.52605 -3.73983,-3.53365 -7.5e-4,-0.0182 -0.002,-0.0359 -0.004,-0.054 5.4e-4,-0.0283 0.002,-0.0562 0.002,-0.0847 0.005,-0.37954 -0.30436,-0.68833 -0.68391,-0.68257 h -10e-4 c -0.37118,0.005 -0.66698,0.31137 -0.6619,0.68257 0,2.00901 -1.59504,3.6346 -3.60371,3.67244 -0.72815,0.0137 -1.32555,-0.18342 -1.80752,-0.53579 v -4.9503 c 1e-5,-0.25434 0.17875,-0.4317 0.43303,-0.4317 z m -1.17284,-1.06411 v 4.04849 H 533.413 v -4.04849 z m 0,3.72848 v 3.27098 c 0.80558,0.58402 1.82434,0.90489 2.87734,0.90626 2.01963,-4.1e-4 3.78906,-1.16496 4.31994,-2.84316 0.53046,1.67688 2.29762,2.84108 4.31566,2.84316 2.01929,-4.8e-4 3.78846,-1.1647 4.31957,-2.84254 0.53077,1.67674 2.29804,2.84068 4.31601,2.84254 2.01963,-4.1e-4 3.78906,-1.16496 4.31994,-2.84316 0.53049,1.67699 2.29784,2.84122 4.31601,2.84316 0.79663,-0.002 1.57835,-0.18617 2.26454,-0.53469 v -3.64255 z"
               sodipodi:nodetypes="ccsccscscscscscccscccccscccccsscccsscccccssssccccccccccccccccsssssssssssssssssscssccccscsssscsccccccccscccscccscccsscccccccscccccccscccccscccccscscscscccccsscsccscccccsccccssccsscsccccccccccccccccccccc" /></g><text
             xml:space="preserve"
             style="font-style:normal;font-weight:normal;font-size:10.6896px;line-height:1.17;font-family:sans-serif;letter-spacing:0px;word-spacing:0px;fill:#ffffff;fill-opacity:1;stroke:none;stroke-width:0.281615"
             x="597.47302"
             y="268.22989"
             id="text281"><tspan
               sodipodi:role="line"
               id="tspan280"
               x="597.47302"
               y="268.22989"
               style="font-style:normal;font-variant:normal;font-weight:600;font-stretch:normal;font-size:10.6896px;font-family:Montserrat;-inkscape-font-specification:'Montserrat Semi-Bold';text-align:center;letter-spacing:-0.196355px;text-anchor:middle;fill:#ffffff;fill-opacity:1;stroke-width:0.281615">APPRECIATION</tspan><tspan
               sodipodi:role="line"
               x="597.37482"
               y="281.10367"
               style="font-style:normal;font-variant:normal;font-weight:600;font-stretch:normal;font-size:10.6896px;font-family:Montserrat;-inkscape-font-specification:'Montserrat Semi-Bold';text-align:center;letter-spacing:-0.196355px;text-anchor:middle;fill:#ffffff;fill-opacity:1;stroke-width:0.281615"
               id="tspan281">WEEK</tspan></text></g></g><text
         xml:space="preserve"
         style="font-style:normal;font-variant:normal;font-weight:normal;font-stretch:normal;font-size:9.19397px;line-height:1.17;font-family:'Open Sans';-inkscape-font-specification:'Open Sans';text-align:start;text-decoration-color:#000000;text-anchor:start;fill:#ffffff;stroke:none;stroke-width:0.974801;stroke-linecap:round;stroke-linejoin:bevel;stroke-dasharray:none;paint-order:markers fill stroke"
         x="550.9704"
         y="458.22198"
         id="text282"><tspan
           sodipodi:role="line"
           style="font-style:normal;font-variant:normal;font-weight:normal;font-stretch:normal;font-size:9.19397px;font-family:Montserrat;-inkscape-font-specification:Montserrat;fill:#ffffff;stroke-width:0.974801"
           x="550.9704"
           y="458.22198"
           id="tspan282">November 6 - 12</tspan></text></g><g
       id="g274"
       transform="matrix(0.8417638,0,0,0.8417638,114.73997,20.870836)"><path
         fill="#d13852"
         d="m 567.14421,326.07218 c -0.66725,-10.44252 -2.90763,-18.92401 -10.17671,-27.66048 -14.56257,-17.46476 -48.03558,-20.37242 -63.00772,-3.55858 -2.61198,2.47364 -5.07754,5.45179 -7.5539,9.01038 l -5.60368,8.05295 -5.6064,-8.05295 c -2.48451,-3.55859 -4.95546,-6.53946 -7.56744,-9.01038 -14.98299,-16.81384 -48.45333,-13.90891 -63.00776,3.55858 -7.27993,8.73647 -9.51761,17.21796 -10.18486,27.66048 -0.94931,31.04548 21.57943,55.90411 24.35957,59.54678 15.28948,17.93673 31.96767,34.89699 48.90358,50.52281 3.06494,2.68251 5.71218,4.91476 8.35939,7.12804 1.59217,1.29922 3.16262,2.61471 4.74392,3.90579 1.57859,-1.29381 3.14361,-2.60657 4.72761,-3.90579 2.6581,-2.21328 5.30536,-4.44553 8.35944,-7.12804 16.944,-15.62582 33.6249,-32.57522 48.93066,-50.52281 2.78018,-3.64267 25.31161,-28.5013 24.35415,-59.54678"
         id="path1"
         style="mix-blend-mode:normal;fill:#db578f;fill-opacity:1;stroke-width:2.71233" /><path
         fill="#f1a5b1"
         d="m 557.78392,320.5336 a 27.443489,27.443489 0 0 0 -1.23955,-7.89023 24.600952,24.600952 0 0 0 -3.17073,-6.56386 c -8.06379,-11.85023 -25.63433,-16.11947 -40.31356,-13.1196 -5.72575,1.37784 -11.45962,3.53147 -14.09606,8.99953 -0.89774,2.3462 0.99002,3.47451 3.90581,3.33076 10.56186,-1.17987 22.24663,-0.1168 31.58522,4.42112 2.32721,1.13919 4.50522,2.48995 6.49605,4.07667 6.69952,5.1887 9.59358,13.2552 10.90363,21.25663 3.25753,-0.65638 5.02868,-4.56487 5.45182,-8.0421 a 28.506728,28.506728 0 0 0 0.48007,-6.46892"
         id="path2"
         style="mix-blend-mode:normal;stroke-width:2.71233" /><text
         xml:space="preserve"
         style="font-weight:600;font-size:24.2496px;line-height:1.17;font-family:Montserrat;-inkscape-font-specification:'Montserrat Semi-Bold';text-align:start;text-decoration-color:#000000;text-anchor:start;fill:#ffffff;stroke:none;stroke-width:2.14809;stroke-linecap:round;stroke-linejoin:bevel;stroke-dasharray:none;paint-order:markers fill stroke"
         x="411.33014"
         y="363.34509"
         id="text78"><tspan
           sodipodi:role="line"
           id="tspan78"
           style="font-style:normal;font-variant:normal;font-weight:bold;font-stretch:normal;font-family:Montserrat;-inkscape-font-specification:'Montserrat Bold';stroke:none;stroke-width:2.14809"
           x="411.33014"
           y="363.34509">Thank you!</tspan></text></g></g></svg>
