Day,TrackName,RoomName,FileName,,photo
Day 1,Tivoli,Fedora,Tivoli-day1,,fedora.png
Day 1,Harbour 6,Colúr,Harbour6-day1,,colur.png
Day 1,Harbour 7,Rocky,Harbour7-day1,,rocky.png
Day 1,Harbour 8,CentOS,Harbour8-day1,,centos.png
Day 2,Tivoli,Fedora,Tivoli-day2,,fedora.png
Day 2,Harbour 6,Colúr,Harbour6-day2,,colur.png
Day 2,Harbour 7,Rocky,Harbour7-day2,,rocky.png
Day 2,Harbour 8,CentOS,Harbour8-day2,,centos.png
Day 3,Tivoli,Fedora,Tivoli-day3,,fedora.png
Day 3,Harbour 6,Colúr,Harbour6-day3,,colur.png
Day 3,Harbour 7,Rocky,Harbour7-day3,,rocky.png
Day 3,Harbour 8,CentOS,Harbour8-day3,,centos.png
