<?xml version="1.0" encoding="UTF-8" standalone="no"?>
<!-- Created with Inkscape (http://www.inkscape.org/) -->

<svg
   width="1979.9999"
   height="800"
   viewBox="0 0 523.875 211.66667"
   version="1.1"
   id="svg2209"
   inkscape:version="1.3 (0e150ed6c4, 2023-07-21)"
   sodipodi:docname="FAW_hori.svg"
   inkscape:export-filename="../Design/FAWv1.png"
   inkscape:export-xdpi="150"
   inkscape:export-ydpi="150"
   xml:space="preserve"
   xmlns:inkscape="http://www.inkscape.org/namespaces/inkscape"
   xmlns:sodipodi="http://sodipodi.sourceforge.net/DTD/sodipodi-0.dtd"
   xmlns:xlink="http://www.w3.org/1999/xlink"
   xmlns="http://www.w3.org/2000/svg"
   xmlns:svg="http://www.w3.org/2000/svg"
   xmlns:rdf="http://www.w3.org/1999/02/22-rdf-syntax-ns#"
   xmlns:cc="http://creativecommons.org/ns#"
   xmlns:dc="http://purl.org/dc/elements/1.1/"><defs
     id="defs2203"><color-profile
       name="sRGB"
       xlink:href="file:///app/share/color/icc/colord/sRGB.icc"
       id="color-profile2" /><linearGradient
       id="linearGradient59"
       inkscape:collect="always"><stop
         style="stop-color:#a07cbc;stop-opacity:1;"
         offset="0"
         id="stop59" /><stop
         style="stop-color:#5aa2da;stop-opacity:1;"
         offset="1"
         id="stop60" /></linearGradient><linearGradient
       id="linearGradient55"
       inkscape:collect="always"><stop
         style="stop-color:#a07cbc;stop-opacity:1;"
         offset="0"
         id="stop56" /><stop
         style="stop-color:#51a2da;stop-opacity:1;"
         offset="1"
         id="stop57" /></linearGradient><linearGradient
       inkscape:collect="always"
       xlink:href="#linearGradient59"
       id="linearGradient260"
       gradientUnits="userSpaceOnUse"
       x1="-175.9803"
       y1="178.44139"
       x2="-159.78548"
       y2="195.01216" /><linearGradient
       inkscape:collect="always"
       xlink:href="#linearGradient55"
       id="linearGradient261"
       gradientUnits="userSpaceOnUse"
       x1="4.5174294"
       y1="250.77957"
       x2="28.021767"
       y2="250.28772" /></defs><sodipodi:namedview
     id="base"
     pagecolor="#ffffff"
     bordercolor="#666666"
     borderopacity="1.0"
     inkscape:pageopacity="0.0"
     inkscape:pageshadow="2"
     inkscape:zoom="0.48264845"
     inkscape:cx="1177.8759"
     inkscape:cy="443.3869"
     inkscape:document-units="mm"
     inkscape:current-layer="layer1"
     showgrid="false"
     inkscape:window-width="1853"
     inkscape:window-height="827"
     inkscape:window-x="50"
     inkscape:window-y="95"
     inkscape:window-maximized="0"
     units="px"
     showguides="true"
     inkscape:guide-bbox="true"
     inkscape:showpageshadow="2"
     inkscape:pagecheckerboard="0"
     inkscape:deskcolor="#d1d1d1"><sodipodi:guide
       position="-745.48933,242.07529"
       orientation="0,-1"
       id="guide1"
       inkscape:locked="false" /><sodipodi:guide
       position="-766.02763,213.86648"
       orientation="0,-1"
       id="guide2"
       inkscape:locked="false" /><sodipodi:guide
       position="-673.54024,223.10355"
       orientation="0,-1"
       id="guide3"
       inkscape:locked="false" /><sodipodi:guide
       position="-747.52717,263.91639"
       orientation="1,0"
       id="guide5"
       inkscape:locked="false" /><sodipodi:guide
       position="-731.42445,266.11221"
       orientation="0,-1"
       id="guide6"
       inkscape:locked="false" /><sodipodi:guide
       position="-711.26279,231.71095"
       orientation="0,-1"
       id="guide15"
       inkscape:locked="false" /><sodipodi:guide
       position="-749.29187,253.87465"
       orientation="0,-1"
       id="guide16"
       inkscape:locked="false" /><sodipodi:guide
       position="-748.51599,253.00445"
       orientation="1,0"
       id="guide18"
       inkscape:locked="false" /><sodipodi:guide
       position="-737.97657,252.06343"
       orientation="1,0"
       id="guide19"
       inkscape:locked="false" /><sodipodi:guide
       position="-743.25383,259.78981"
       orientation="1,0"
       id="guide20"
       inkscape:locked="false" /><sodipodi:guide
       position="-726.44276,252.22453"
       orientation="0,-1"
       id="guide21"
       inkscape:locked="false" /><sodipodi:guide
       position="-739.71745,243.61778"
       orientation="0,-1"
       id="guide22"
       inkscape:locked="false" /><sodipodi:guide
       position="-754.12682,242.95907"
       orientation="0,-1"
       id="guide23"
       inkscape:locked="false" /><sodipodi:guide
       position="-364.0124,259.22577"
       orientation="0,-1"
       id="guide24"
       inkscape:locked="false" /><sodipodi:guide
       position="-704.92325,260.69729"
       orientation="0,-1"
       id="guide25"
       inkscape:locked="false" /><sodipodi:guide
       position="-714.19229,261.73241"
       orientation="0,-1"
       id="guide26"
       inkscape:locked="false" /><sodipodi:guide
       position="-709.53424,229.07903"
       orientation="0,-1"
       id="guide27"
       inkscape:locked="false" /><sodipodi:guide
       position="-225.24787,24.462511"
       orientation="1,0"
       id="guide49"
       inkscape:locked="false" /><sodipodi:guide
       position="-527.5543,195.8312"
       orientation="0,-1"
       id="guide69"
       inkscape:locked="false" /><sodipodi:guide
       position="-179.77604,144.77716"
       orientation="0,-1"
       id="guide78"
       inkscape:locked="false" /><sodipodi:guide
       position="-235.87672,88.098512"
       orientation="0,-1"
       id="guide79"
       inkscape:locked="false" /><sodipodi:guide
       position="-221.78659,51.290651"
       orientation="0,-1"
       id="guide80"
       inkscape:locked="false" /><sodipodi:guide
       position="-216.57278,42.054221"
       orientation="1,0"
       id="guide156"
       inkscape:locked="false" /><sodipodi:guide
       position="-139.47895,48.279461"
       orientation="1,0"
       id="guide157"
       inkscape:locked="false" /><sodipodi:guide
       position="-153.54764,62.570402"
       orientation="1,0"
       id="guide158"
       inkscape:locked="false" /><sodipodi:guide
       position="-304.47363,8.0248112"
       orientation="1,0"
       id="guide190"
       inkscape:locked="false" /><inkscape:page
       x="3.4053321e-06"
       y="-1.1542922e-07"
       width="523.875"
       height="211.66667"
       id="page191"
       margin="0"
       bleed="0"
       inkscape:export-filename="../Design/FAW_square.svg"
       inkscape:export-xdpi="150"
       inkscape:export-ydpi="150" /><sodipodi:guide
       position="251.60291,183.06471"
       orientation="0,-1"
       id="guide261"
       inkscape:locked="false" /><sodipodi:guide
       position="-287.22413,168.50333"
       orientation="1,0"
       id="guide272"
       inkscape:locked="false" /><sodipodi:guide
       position="-295.75197,-5.1545889"
       orientation="1,0"
       id="guide273"
       inkscape:locked="false" /><sodipodi:guide
       position="-320.27071,48.887741"
       orientation="1,0"
       id="guide304"
       inkscape:locked="false" /><sodipodi:guide
       position="-210.97879,2.9511112"
       orientation="1,0"
       id="guide305"
       inkscape:locked="false" /></sodipodi:namedview><metadata
     id="metadata2206"><rdf:RDF><cc:Work
         rdf:about=""><dc:format>image/svg+xml</dc:format><dc:type
           rdf:resource="http://purl.org/dc/dcmitype/StillImage" /></cc:Work></rdf:RDF></metadata><g
     inkscape:label="Layer 1"
     inkscape:groupmode="layer"
     id="layer1"
     transform="translate(-785.52155,-230.14874)"><g
       id="g192"
       transform="matrix(20.63777,9.0959221,-21.427998,8.7604798,6080.7466,-2007.4846)"
       inkscape:export-filename="/home/thlavack/Pictures/fedora-design/ #615 Fedora Appreciation Week/pngs/f.png"
       inkscape:export-xdpi="95.5"
       inkscape:export-ydpi="95.5"
       style="fill:url(#linearGradient261);stroke:none"><rect
         style="fill:url(#linearGradient260);stroke:none;stroke-width:0.0579804;stroke-linecap:round;stroke-linejoin:bevel;stroke-dasharray:none;paint-order:markers fill stroke"
         id="rect192"
         width="18.117592"
         height="18.122772"
         x="-178.3461"
         y="176.42265"
         transform="rotate(-46.076207)" /></g><g
       id="g262"
       transform="translate(62.954288,145.86885)"><circle
         style="fill:#3c6eb4;fill-opacity:1;stroke:none;stroke-width:2.3489;stroke-linecap:round;stroke-linejoin:round;stroke-dasharray:none;stroke-opacity:1;paint-order:stroke fill markers"
         id="path171067-9-0-9-9"
         cx="1011.9547"
         cy="102.08373"
         r="1.9340422" /><circle
         style="fill:#82ceff;fill-opacity:1;stroke:none;stroke-width:2.3489;stroke-linecap:round;stroke-linejoin:round;stroke-dasharray:none;stroke-opacity:1;paint-order:stroke fill markers"
         id="path171067-9-0-9-6-4"
         cx="709.73639"
         cy="216.45027"
         r="1.9340422" /><path
         sodipodi:type="star"
         style="fill:#ffffff;fill-opacity:1;stroke:none;stroke-width:3.54576;stroke-linecap:round;stroke-linejoin:round;stroke-dasharray:none;stroke-opacity:1;paint-order:stroke fill markers"
         id="path172396-7-2-9"
         inkscape:flatsided="true"
         sodipodi:sides="4"
         sodipodi:cx="-51.034725"
         sodipodi:cy="-62.770813"
         sodipodi:r1="21.390997"
         sodipodi:r2="9.2603378"
         sodipodi:arg1="0.58684597"
         sodipodi:arg2="1.3722441"
         inkscape:rounded="-0.12"
         inkscape:randomized="0"
         d="m -33.222628,-50.925817 c 2.010163,-3.022813 -32.679906,3.956939 -29.657093,5.967102 3.022813,2.010162 -3.956939,-32.679907 -5.967102,-29.657094 -2.010162,3.022813 32.679907,-3.956939 29.657094,-5.967102 -3.022813,-2.010162 3.956939,32.679907 5.967101,29.657094 z"
         transform="matrix(0.10705309,0.13878367,-0.13878367,0.10705309,848.04347,290.14416)"
         inkscape:transform-center-x="23.56183"
         inkscape:transform-center-y="-28.90246" /><path
         sodipodi:type="star"
         style="fill:#ffffff;fill-opacity:1;stroke:none;stroke-width:4.47641;stroke-linecap:round;stroke-linejoin:round;stroke-dasharray:none;stroke-opacity:1;paint-order:stroke fill markers"
         id="path174594-1-1"
         inkscape:flatsided="false"
         sodipodi:sides="4"
         sodipodi:cx="-83.895691"
         sodipodi:cy="-93.977196"
         sodipodi:r1="10.353173"
         sodipodi:r2="31.373253"
         sodipodi:arg1="1.277949"
         sodipodi:arg2="2.0633472"
         inkscape:rounded="0.1"
         inkscape:randomized="0"
         d="m -80.906942,-84.064801 c -2.40715,0.725795 -15.609052,18.920401 -17.824378,17.731503 -2.21533,-1.188897 5.649029,-22.248 4.923234,-24.655149 -0.725795,-2.407149 -18.920404,-15.609053 -17.731504,-17.824383 1.1889,-2.21532 22.248001,5.64903 24.65515,4.92324 2.40715,-0.7258 15.609052,-18.9204 17.824378,-17.7315 2.215326,1.18889 -5.649029,22.247996 -4.923234,24.655145 0.725795,2.40715 18.9204,15.609052 17.731503,17.824379 -1.188897,2.215326 -22.248,-5.649029 -24.655149,-4.923235 z"
         transform="matrix(0.11832514,-0.07262479,0.07262479,0.11832514,781.66282,120.65358)"
         inkscape:transform-center-x="-0.32926416"
         inkscape:transform-center-y="-0.16991352" /><path
         sodipodi:type="star"
         style="fill:#ffffff;fill-opacity:1;stroke:none;stroke-width:3.54576;stroke-linecap:round;stroke-linejoin:round;stroke-dasharray:none;stroke-opacity:1;paint-order:stroke fill markers"
         id="path192"
         inkscape:flatsided="true"
         sodipodi:sides="4"
         sodipodi:cx="-51.034725"
         sodipodi:cy="-62.770813"
         sodipodi:r1="21.390997"
         sodipodi:r2="9.2603378"
         sodipodi:arg1="0.58684597"
         sodipodi:arg2="1.3722441"
         inkscape:rounded="-0.12"
         inkscape:randomized="0"
         d="m -33.222628,-50.925817 c 2.010163,-3.022813 -32.679906,3.956939 -29.657093,5.967102 3.022813,2.010162 -3.956939,-32.679907 -5.967102,-29.657094 -2.010162,3.022813 32.679907,-3.956939 29.657094,-5.967102 -3.022813,-2.010162 3.956939,32.679907 5.967101,29.657094 z"
         transform="matrix(0.10705309,0.13878367,-0.13878367,0.10705309,821.38959,270.91009)"
         inkscape:transform-center-x="23.561807"
         inkscape:transform-center-y="-28.902457" /><path
         style="fill:#ffffff;fill-opacity:1;stroke:none;stroke-width:0.591886px;stroke-linecap:butt;stroke-linejoin:miter;stroke-opacity:1"
         d="m 805.35073,274.18103 -5.0984,7.86592 -2.4953,-1.08984 c 1.3522,-2.58436 2.8591,-5.18894 3.455,-9.16492 z"
         id="path193"
         sodipodi:nodetypes="ccccc" /><path
         style="fill:#82ceff;fill-opacity:1;stroke:none;stroke-width:0.591886px;stroke-linecap:butt;stroke-linejoin:miter;stroke-opacity:1"
         d="m 902.27394,212.91122 -6.3301,-6.25469 1.4938,-2.10967 c 2.1419,1.75481 4.2729,3.65738 7.8542,4.97717 z"
         id="path194"
         sodipodi:nodetypes="ccccc" /><path
         style="fill:#82ceff;fill-opacity:1;stroke:none;stroke-width:0.591886px;stroke-linecap:butt;stroke-linejoin:miter;stroke-opacity:1"
         d="m 1129.898,243.99816 6.4785,8.03956 2.6103,-1.47729 c -1.7748,-2.678 -3.7214,-5.36064 -4.8254,-9.64922 z"
         id="path195"
         sodipodi:nodetypes="ccccc" /><path
         style="fill:#3c6eb4;fill-opacity:1;stroke:none;stroke-width:0.591886px;stroke-linecap:butt;stroke-linejoin:miter;stroke-opacity:1"
         d="m 792.85484,254.85529 -7.2597,1.99254 -1.0287,-3.51039 7.3577,-4.58499 z"
         id="path196"
         sodipodi:nodetypes="ccccc" /><circle
         style="fill:#ffffff;fill-opacity:1;stroke:none;stroke-width:2.3489;stroke-linecap:round;stroke-linejoin:round;stroke-dasharray:none;stroke-opacity:1;paint-order:stroke fill markers"
         id="circle196"
         cx="1165.1362"
         cy="146.07516"
         r="1.9340422" /><circle
         style="fill:#ffffff;fill-opacity:1;stroke:none;stroke-width:2.3489;stroke-linecap:round;stroke-linejoin:round;stroke-dasharray:none;stroke-opacity:1;paint-order:stroke fill markers"
         id="circle197"
         cx="1027.2455"
         cy="156.95543"
         r="1.9340422" /><path
         sodipodi:type="star"
         style="fill:#ffffff;fill-opacity:1;stroke:none;stroke-width:2.60557;stroke-linecap:round;stroke-linejoin:round;stroke-dasharray:none;stroke-opacity:1;paint-order:stroke fill markers"
         id="path197"
         inkscape:flatsided="true"
         sodipodi:sides="4"
         sodipodi:cx="-51.034725"
         sodipodi:cy="-62.770813"
         sodipodi:r1="21.390997"
         sodipodi:r2="9.2603378"
         sodipodi:arg1="0.58684597"
         sodipodi:arg2="1.3722441"
         inkscape:rounded="-0.12"
         inkscape:randomized="0"
         d="m -33.222628,-50.925817 c 2.010163,-3.022813 -32.679906,3.956939 -29.657093,5.967102 3.022813,2.010162 -3.956939,-32.679907 -5.967102,-29.657094 -2.010162,3.022813 32.679907,-3.956939 29.657094,-5.967102 -3.022813,-2.010162 3.956939,32.679907 5.967101,29.657094 z"
         transform="matrix(0.1456816,0.18886168,-0.18886168,0.1456816,1031.5526,125.1307)"
         inkscape:transform-center-x="32.063743"
         inkscape:transform-center-y="-39.331481" /><path
         sodipodi:type="star"
         style="fill:#ffffff;fill-opacity:1;stroke:none;stroke-width:3.54576;stroke-linecap:round;stroke-linejoin:round;stroke-dasharray:none;stroke-opacity:1;paint-order:stroke fill markers"
         id="path198"
         inkscape:flatsided="true"
         sodipodi:sides="4"
         sodipodi:cx="-51.034725"
         sodipodi:cy="-62.770813"
         sodipodi:r1="21.390997"
         sodipodi:r2="9.2603378"
         sodipodi:arg1="0.58684597"
         sodipodi:arg2="1.3722441"
         inkscape:rounded="-0.12"
         inkscape:randomized="0"
         d="m -33.222628,-50.925817 c 2.010163,-3.022813 -32.679906,3.956939 -29.657093,5.967102 3.022813,2.010162 -3.956939,-32.679907 -5.967102,-29.657094 -2.010162,3.022813 32.679907,-3.956939 29.657094,-5.967102 -3.022813,-2.010162 3.956939,32.679907 5.967101,29.657094 z"
         transform="matrix(0.10705309,0.13878367,-0.13878367,0.10705309,1178.1418,180.19526)"
         inkscape:transform-center-x="23.561824"
         inkscape:transform-center-y="-28.902462" /><path
         sodipodi:type="star"
         style="fill:#3c6eb4;fill-opacity:1;stroke:none;stroke-width:3.54576;stroke-linecap:round;stroke-linejoin:round;stroke-dasharray:none;stroke-opacity:1;paint-order:stroke fill markers"
         id="path199"
         inkscape:flatsided="true"
         sodipodi:sides="4"
         sodipodi:cx="-51.034725"
         sodipodi:cy="-62.770813"
         sodipodi:r1="21.390997"
         sodipodi:r2="9.2603378"
         sodipodi:arg1="0.58684597"
         sodipodi:arg2="1.3722441"
         inkscape:rounded="-0.12"
         inkscape:randomized="0"
         d="m -33.222628,-50.925817 c 2.010163,-3.022813 -32.679906,3.956939 -29.657093,5.967102 3.022813,2.010162 -3.956939,-32.679907 -5.967102,-29.657094 -2.010162,3.022813 32.679907,-3.956939 29.657094,-5.967102 -3.022813,-2.010162 3.956939,32.679907 5.967101,29.657094 z"
         transform="matrix(0.10705309,0.13878367,-0.13878367,0.10705309,800.94514,246.16892)"
         inkscape:transform-center-x="23.56182"
         inkscape:transform-center-y="-28.902446" /><path
         style="fill:#ffffff;fill-opacity:1;stroke:none;stroke-width:0.591886px;stroke-linecap:butt;stroke-linejoin:miter;stroke-opacity:1"
         d="m 1074.3884,258.39121 -5.0984,-7.86595 -2.4953,1.08987 c 1.3522,2.58434 2.8591,5.18894 3.455,9.16492 z"
         id="path200"
         sodipodi:nodetypes="ccccc" /><path
         style="fill:#3c6eb4;fill-opacity:1;stroke:none;stroke-width:0.591886px;stroke-linecap:butt;stroke-linejoin:miter;stroke-opacity:1"
         d="m 970.5273,133.80497 -7.2597,-1.99256 -1.0287,3.51038 7.3577,4.585 z"
         id="path201"
         sodipodi:nodetypes="ccccc" /><path
         sodipodi:type="star"
         style="fill:#ffffff;fill-opacity:1;stroke:none;stroke-width:3.54576;stroke-linecap:round;stroke-linejoin:round;stroke-dasharray:none;stroke-opacity:1;paint-order:stroke fill markers"
         id="path202"
         inkscape:flatsided="true"
         sodipodi:sides="4"
         sodipodi:cx="-51.034725"
         sodipodi:cy="-62.770813"
         sodipodi:r1="21.390997"
         sodipodi:r2="9.2603378"
         sodipodi:arg1="0.58684597"
         sodipodi:arg2="1.3722441"
         inkscape:rounded="-0.12"
         inkscape:randomized="0"
         d="m -33.222628,-50.925817 c 2.010163,-3.022813 -32.679906,3.956939 -29.657093,5.967102 3.022813,2.010162 -3.956939,-32.679907 -5.967102,-29.657094 -2.010162,3.022813 32.679907,-3.956939 29.657094,-5.967102 -3.022813,-2.010162 3.956939,32.679907 5.967101,29.657094 z"
         transform="matrix(0.10705309,0.13878367,-0.13878367,0.10705309,758.14359,193.88891)"
         inkscape:transform-center-x="23.561818"
         inkscape:transform-center-y="-28.90246" /><path
         sodipodi:type="star"
         style="fill:#82ceff;fill-opacity:1;stroke:none;stroke-width:3.54576;stroke-linecap:round;stroke-linejoin:round;stroke-dasharray:none;stroke-opacity:1;paint-order:stroke fill markers"
         id="path203"
         inkscape:flatsided="true"
         sodipodi:sides="4"
         sodipodi:cx="-51.034725"
         sodipodi:cy="-62.770813"
         sodipodi:r1="21.390997"
         sodipodi:r2="9.2603378"
         sodipodi:arg1="0.58684597"
         sodipodi:arg2="1.3722441"
         inkscape:rounded="-0.12"
         inkscape:randomized="0"
         d="m -33.222628,-50.925817 c 2.010163,-3.022813 -32.679906,3.956939 -29.657093,5.967102 3.022813,2.010162 -3.956939,-32.679907 -5.967102,-29.657094 -2.010162,3.022813 32.679907,-3.956939 29.657094,-5.967102 -3.022813,-2.010162 3.956939,32.679907 5.967101,29.657094 z"
         transform="matrix(-0.12701637,0.12078126,-0.12078126,-0.12701637,1029.1032,279.96035)"
         inkscape:transform-center-x="-26.321301"
         inkscape:transform-center-y="-26.414037" /><path
         sodipodi:type="star"
         style="fill:#ffffff;fill-opacity:1;stroke:none;stroke-width:5.66729;stroke-linecap:round;stroke-linejoin:round;stroke-dasharray:none;stroke-opacity:1;paint-order:stroke fill markers"
         id="path204"
         inkscape:flatsided="false"
         sodipodi:sides="5"
         sodipodi:cx="-28.497557"
         sodipodi:cy="95.920502"
         sodipodi:r1="42.927052"
         sodipodi:r2="26.185501"
         sodipodi:arg1="0.82753514"
         sodipodi:arg2="1.4558536"
         inkscape:rounded="0.17"
         inkscape:randomized="0"
         d="m 0.55086168,127.52622 c -3.33427038,3.06448 -21.54646668,-6.11239 -26.04520868,-5.59301 -4.498742,0.51939 -20.140728,13.60478 -24.085575,11.38068 -3.944846,-2.2241 -0.844998,-22.38074 -2.729151,-26.4988 -1.884154,-4.11805 -19.162742,-14.950858 -18.26652,-19.389916 0.896221,-4.439057 21.024229,-7.71967 24.3585,-10.784156 3.334271,-3.064487 8.297502,-22.844921 12.796245,-23.364308 4.498741,-0.519387 13.838686,17.609722 17.783532,19.833823 3.944847,2.224102 24.2908801,0.831925 26.175034,4.949984 1.884154,4.118058 -12.4714508,18.603076 -13.3676723,23.042133 -0.8962217,4.43906 6.7150868,23.35908 3.38081598,26.42357 z"
         transform="matrix(0.01129753,0.1090776,-0.1090776,0.01129753,921.54138,257.08033)" /><path
         sodipodi:type="star"
         style="fill:#ffffff;fill-opacity:1;stroke:none;stroke-width:5.66729;stroke-linecap:round;stroke-linejoin:round;stroke-dasharray:none;stroke-opacity:1;paint-order:stroke fill markers"
         id="path205"
         inkscape:flatsided="false"
         sodipodi:sides="5"
         sodipodi:cx="-28.497557"
         sodipodi:cy="95.920502"
         sodipodi:r1="42.927052"
         sodipodi:r2="26.185501"
         sodipodi:arg1="0.82753514"
         sodipodi:arg2="1.4558536"
         inkscape:rounded="0.17"
         inkscape:randomized="0"
         d="m 0.55086168,127.52622 c -3.33427038,3.06448 -21.54646668,-6.11239 -26.04520868,-5.59301 -4.498742,0.51939 -20.140728,13.60478 -24.085575,11.38068 -3.944846,-2.2241 -0.844998,-22.38074 -2.729151,-26.4988 -1.884154,-4.11805 -19.162742,-14.950858 -18.26652,-19.389916 0.896221,-4.439057 21.024229,-7.71967 24.3585,-10.784156 3.334271,-3.064487 8.297502,-22.844921 12.796245,-23.364308 4.498741,-0.519387 13.838686,17.609722 17.783532,19.833823 3.944847,2.224102 24.2908801,0.831925 26.175034,4.949984 1.884154,4.118058 -12.4714508,18.603076 -13.3676723,23.042133 -0.8962217,4.43906 6.7150868,23.35908 3.38081598,26.42357 z"
         transform="matrix(0.1096611,0,0,0.1096611,888.67676,333.77576)" /><path
         sodipodi:type="star"
         style="fill:#3c6eb4;fill-opacity:1;stroke:none;stroke-width:5.66729;stroke-linecap:round;stroke-linejoin:round;stroke-dasharray:none;stroke-opacity:1;paint-order:stroke fill markers"
         id="path206"
         inkscape:flatsided="false"
         sodipodi:sides="5"
         sodipodi:cx="-28.497557"
         sodipodi:cy="95.920502"
         sodipodi:r1="42.927052"
         sodipodi:r2="26.185501"
         sodipodi:arg1="0.82753514"
         sodipodi:arg2="1.4558536"
         inkscape:rounded="0.17"
         inkscape:randomized="0"
         d="m 0.55086168,127.52622 c -3.33427038,3.06448 -21.54646668,-6.11239 -26.04520868,-5.59301 -4.498742,0.51939 -20.140728,13.60478 -24.085575,11.38068 -3.944846,-2.2241 -0.844998,-22.38074 -2.729151,-26.4988 -1.884154,-4.11805 -19.162742,-14.950858 -18.26652,-19.389916 0.896221,-4.439057 21.024229,-7.71967 24.3585,-10.784156 3.334271,-3.064487 8.297502,-22.844921 12.796245,-23.364308 4.498741,-0.519387 13.838686,17.609722 17.783532,19.833823 3.944847,2.224102 24.2908801,0.831925 26.175034,4.949984 1.884154,4.118058 -12.4714508,18.603076 -13.3676723,23.042133 -0.8962217,4.43906 6.7150868,23.35908 3.38081598,26.42357 z"
         transform="matrix(0.1096611,0,0,0.1096611,775.14343,191.84682)" /><path
         sodipodi:type="star"
         style="fill:#3c6eb4;fill-opacity:1;stroke:none;stroke-width:5.66729;stroke-linecap:round;stroke-linejoin:round;stroke-dasharray:none;stroke-opacity:1;paint-order:stroke fill markers"
         id="path207"
         inkscape:flatsided="false"
         sodipodi:sides="5"
         sodipodi:cx="-28.497557"
         sodipodi:cy="95.920502"
         sodipodi:r1="42.927052"
         sodipodi:r2="26.185501"
         sodipodi:arg1="0.82753514"
         sodipodi:arg2="1.4558536"
         inkscape:rounded="0.17"
         inkscape:randomized="0"
         d="m 0.55086168,127.52622 c -3.33427038,3.06448 -21.54646668,-6.11239 -26.04520868,-5.59301 -4.498742,0.51939 -20.140728,13.60478 -24.085575,11.38068 -3.944846,-2.2241 -0.844998,-22.38074 -2.729151,-26.4988 -1.884154,-4.11805 -19.162742,-14.950858 -18.26652,-19.389916 0.896221,-4.439057 21.024229,-7.71967 24.3585,-10.784156 3.334271,-3.064487 8.297502,-22.844921 12.796245,-23.364308 4.498741,-0.519387 13.838686,17.609722 17.783532,19.833823 3.944847,2.224102 24.2908801,0.831925 26.175034,4.949984 1.884154,4.118058 -12.4714508,18.603076 -13.3676723,23.042133 -0.8962217,4.43906 6.7150868,23.35908 3.38081598,26.42357 z"
         transform="matrix(0.1096611,0,0,0.1096611,1187.0223,120.04959)" /><path
         style="fill:#ffffff;fill-opacity:1;stroke:none;stroke-width:0.591886px;stroke-linecap:butt;stroke-linejoin:miter;stroke-opacity:1"
         d="m 1198.0356,217.13001 1.2328,6.85849 -1.9076,0.67718 c -0.5801,-2.08923 -1.0867,-4.26809 -2.7845,-6.72771 z"
         id="path208"
         sodipodi:nodetypes="ccccc" /><path
         style="fill:#ffffff;fill-opacity:1;stroke:none;stroke-width:0.591886px;stroke-linecap:butt;stroke-linejoin:miter;stroke-opacity:1"
         d="m 1144.2101,286.03447 -1.9327,-6.69502 1.8276,-0.87001 c 0.7923,2.01832 1.5207,4.13333 3.4629,6.40493 z"
         id="path209"
         sodipodi:nodetypes="ccccc" /><path
         sodipodi:type="star"
         style="fill:#3c6eb4;fill-opacity:1;stroke:none;stroke-width:5.66729;stroke-linecap:round;stroke-linejoin:round;stroke-dasharray:none;stroke-opacity:1;paint-order:stroke fill markers"
         id="path210"
         inkscape:flatsided="false"
         sodipodi:sides="5"
         sodipodi:cx="-28.497557"
         sodipodi:cy="95.920502"
         sodipodi:r1="42.927052"
         sodipodi:r2="26.185501"
         sodipodi:arg1="0.82753514"
         sodipodi:arg2="1.4558536"
         inkscape:rounded="0.17"
         inkscape:randomized="0"
         d="m 0.55086168,127.52622 c -3.33427038,3.06448 -21.54646668,-6.11239 -26.04520868,-5.59301 -4.498742,0.51939 -20.140728,13.60478 -24.085575,11.38068 -3.944846,-2.2241 -0.844998,-22.38074 -2.729151,-26.4988 -1.884154,-4.11805 -19.162742,-14.950858 -18.26652,-19.389916 0.896221,-4.439057 21.024229,-7.71967 24.3585,-10.784156 3.334271,-3.064487 8.297502,-22.844921 12.796245,-23.364308 4.498741,-0.519387 13.838686,17.609722 17.783532,19.833823 3.944847,2.224102 24.2908801,0.831925 26.175034,4.949984 1.884154,4.118058 -12.4714508,18.603076 -13.3676723,23.042133 -0.8962217,4.43906 6.7150868,23.35908 3.38081598,26.42357 z"
         transform="matrix(-0.10891889,0.0127372,0.0127372,0.10891889,1074.8749,272.62847)" /><path
         style="fill:#ffffff;fill-opacity:1;stroke:none;stroke-width:0.591886px;stroke-linecap:butt;stroke-linejoin:miter;stroke-opacity:1"
         d="m 951.65894,207.1052 5.9775,7.22054 2.3518,-1.37232 c -1.6432,-2.40978 -3.4424,-4.82175 -4.4961,-8.70158 z"
         id="path211"
         sodipodi:nodetypes="ccccc" /><path
         style="fill:#82ceff;fill-opacity:1;stroke:none;stroke-width:0.591886px;stroke-linecap:butt;stroke-linejoin:miter;stroke-opacity:1"
         d="m 1046.3823,161.90722 5.5607,-6.94759 -1.7287,-1.92188 c -1.9237,1.9917 -3.8192,4.12891 -7.2229,5.85572 z"
         id="path212"
         sodipodi:nodetypes="ccccc" /><path
         sodipodi:type="star"
         style="fill:#82ceff;fill-opacity:1;stroke:none;stroke-width:5.66729;stroke-linecap:round;stroke-linejoin:round;stroke-dasharray:none;stroke-opacity:1;paint-order:stroke fill markers"
         id="path213"
         inkscape:flatsided="false"
         sodipodi:sides="5"
         sodipodi:cx="-28.497557"
         sodipodi:cy="95.920502"
         sodipodi:r1="42.927052"
         sodipodi:r2="26.185501"
         sodipodi:arg1="0.82753514"
         sodipodi:arg2="1.4558536"
         inkscape:rounded="0.17"
         inkscape:randomized="0"
         d="m 0.55086168,127.52622 c -3.33427038,3.06448 -21.54646668,-6.11239 -26.04520868,-5.59301 -4.498742,0.51939 -20.140728,13.60478 -24.085575,11.38068 -3.944846,-2.2241 -0.844998,-22.38074 -2.729151,-26.4988 -1.884154,-4.11805 -19.162742,-14.950858 -18.26652,-19.389916 0.896221,-4.439057 21.024229,-7.71967 24.3585,-10.784156 3.334271,-3.064487 8.297502,-22.844921 12.796245,-23.364308 4.498741,-0.519387 13.838686,17.609722 17.783532,19.833823 3.944847,2.224102 24.2908801,0.831925 26.175034,4.949984 1.884154,4.118058 -12.4714508,18.603076 -13.3676723,23.042133 -0.8962217,4.43906 6.7150868,23.35908 3.38081598,26.42357 z"
         transform="matrix(0.1096611,0,0,0.1096611,768.5943,243.66604)" /><path
         sodipodi:type="star"
         style="fill:#ffffff;fill-opacity:1;stroke:none;stroke-width:3.3766;stroke-linecap:round;stroke-linejoin:round;stroke-dasharray:none;stroke-opacity:1;paint-order:stroke fill markers"
         id="path214"
         inkscape:flatsided="false"
         sodipodi:sides="4"
         sodipodi:cx="-83.895691"
         sodipodi:cy="-93.977196"
         sodipodi:r1="10.353173"
         sodipodi:r2="31.373253"
         sodipodi:arg1="1.277949"
         sodipodi:arg2="2.0633472"
         inkscape:rounded="0.1"
         inkscape:randomized="0"
         d="m -80.906942,-84.064801 c -2.40715,0.725795 -15.609052,18.920401 -17.824378,17.731503 -2.21533,-1.188897 5.649029,-22.248 4.923234,-24.655149 -0.725795,-2.407149 -18.920404,-15.609053 -17.731504,-17.824383 1.1889,-2.21532 22.248001,5.64903 24.65515,4.92324 2.40715,-0.7258 15.609052,-18.9204 17.824378,-17.7315 2.215326,1.18889 -5.649029,22.247996 -4.923234,24.655145 0.725795,2.40715 18.9204,15.609052 17.731503,17.824379 -1.188897,2.215326 -22.248,-5.649029 -24.655149,-4.923235 z"
         transform="matrix(0.11192806,0.14611171,-0.14611171,0.11192806,1150.6612,255.63947)"
         inkscape:transform-center-x="-0.26909566"
         inkscape:transform-center-y="0.41096759" /><path
         sodipodi:type="star"
         style="fill:#ffffff;fill-opacity:1;stroke:none;stroke-width:3.3766;stroke-linecap:round;stroke-linejoin:round;stroke-dasharray:none;stroke-opacity:1;paint-order:stroke fill markers"
         id="path215"
         inkscape:flatsided="false"
         sodipodi:sides="4"
         sodipodi:cx="-83.895691"
         sodipodi:cy="-93.977196"
         sodipodi:r1="10.353173"
         sodipodi:r2="31.373253"
         sodipodi:arg1="1.277949"
         sodipodi:arg2="2.0633472"
         inkscape:rounded="0.1"
         inkscape:randomized="0"
         d="m -80.906942,-84.064801 c -2.40715,0.725795 -15.609052,18.920401 -17.824378,17.731503 -2.21533,-1.188897 5.649029,-22.248 4.923234,-24.655149 -0.725795,-2.407149 -18.920404,-15.609053 -17.731504,-17.824383 1.1889,-2.21532 22.248001,5.64903 24.65515,4.92324 2.40715,-0.7258 15.609052,-18.9204 17.824378,-17.7315 2.215326,1.18889 -5.649029,22.247996 -4.923234,24.655145 0.725795,2.40715 18.9204,15.609052 17.731503,17.824379 -1.188897,2.215326 -22.248,-5.649029 -24.655149,-4.923235 z"
         transform="matrix(0.1561111,-0.09749795,0.09749795,0.1561111,1006.0447,167.04913)"
         inkscape:transform-center-x="-0.43469264"
         inkscape:transform-center-y="-0.22864927" /><rect
         style="fill:#3c6eb4;fill-opacity:1;stroke:none;stroke-width:2.3489;stroke-linecap:round;stroke-linejoin:round;stroke-dasharray:none;stroke-opacity:1;paint-order:stroke fill markers"
         id="rect215"
         width="3.4036191"
         height="10.129014"
         x="-234.46638"
         y="871.49463"
         transform="matrix(-0.48407415,0.87502698,0.87502698,0.48407415,0,0)" /><rect
         style="fill:#ffffff;fill-opacity:1;stroke:none;stroke-width:2.3489;stroke-linecap:round;stroke-linejoin:round;stroke-dasharray:none;stroke-opacity:1;paint-order:stroke fill markers"
         id="rect216"
         width="3.4036191"
         height="10.129013"
         x="-127.83889"
         y="1201.5538"
         transform="matrix(-0.22764207,0.97374488,0.97374488,0.22764207,0,0)" /><rect
         style="fill:#ffffff;fill-opacity:1;stroke:none;stroke-width:2.3489;stroke-linecap:round;stroke-linejoin:round;stroke-dasharray:none;stroke-opacity:1;paint-order:stroke fill markers"
         id="rect217"
         width="3.4036191"
         height="10.129013"
         x="-7.5451922"
         y="753.89105"
         transform="matrix(-0.22764207,0.97374488,0.97374488,0.22764207,0,0)" /><rect
         style="fill:#ffffff;fill-opacity:1;stroke:none;stroke-width:2.3489;stroke-linecap:round;stroke-linejoin:round;stroke-dasharray:none;stroke-opacity:1;paint-order:stroke fill markers"
         id="rect218"
         width="3.4036191"
         height="10.129013"
         x="964.27118"
         y="597.73712"
         transform="rotate(-19.071517)" /><rect
         style="fill:#3c6eb4;fill-opacity:1;stroke:none;stroke-width:2.3489;stroke-linecap:round;stroke-linejoin:round;stroke-dasharray:none;stroke-opacity:1;paint-order:stroke fill markers"
         id="rect219"
         width="3.4036191"
         height="10.129014"
         x="-780.77869"
         y="-905.44769"
         transform="matrix(-0.47147119,-0.88188147,-0.88188147,0.47147119,0,0)" /><path
         style="fill:#ffffff;fill-opacity:1;stroke:none;stroke-width:0.591886px;stroke-linecap:butt;stroke-linejoin:miter;stroke-opacity:1"
         d="m 751.87939,224.98781 5.0985,7.86593 2.4952,-1.08985 c -1.3521,-2.58433 -2.8591,-5.18893 -3.4549,-9.16492 z"
         id="path219"
         sodipodi:nodetypes="ccccc" /><path
         style="fill:#3c6eb4;fill-opacity:1;stroke:none;stroke-width:0.591886px;stroke-linecap:butt;stroke-linejoin:miter;stroke-opacity:1"
         d="m 775.21953,228.47804 7.2597,1.99255 1.0287,-3.51039 -7.3577,-4.585 z"
         id="path220"
         sodipodi:nodetypes="ccccc" /><rect
         style="fill:#ffffff;fill-opacity:1;stroke:none;stroke-width:2.3489;stroke-linecap:round;stroke-linejoin:round;stroke-dasharray:none;stroke-opacity:1;paint-order:stroke fill markers"
         id="rect220"
         width="3.4036191"
         height="10.129013"
         x="304.07269"
         y="-835.81439"
         transform="rotate(76.84171)" /><rect
         style="fill:#3c6eb4;fill-opacity:1;stroke:none;stroke-width:2.3489;stroke-linecap:round;stroke-linejoin:round;stroke-dasharray:none;stroke-opacity:1;paint-order:stroke fill markers"
         id="rect221"
         width="3.4036191"
         height="10.129014"
         x="472.19568"
         y="850.51379"
         transform="rotate(-45.35909)" /><path
         sodipodi:type="star"
         style="fill:#82ceff;fill-opacity:1;stroke:none;stroke-width:3.54576;stroke-linecap:round;stroke-linejoin:round;stroke-dasharray:none;stroke-opacity:1;paint-order:stroke fill markers"
         id="path221"
         inkscape:flatsided="true"
         sodipodi:sides="4"
         sodipodi:cx="-51.034725"
         sodipodi:cy="-62.770813"
         sodipodi:r1="21.390997"
         sodipodi:r2="9.2603378"
         sodipodi:arg1="0.58684597"
         sodipodi:arg2="1.3722441"
         inkscape:rounded="-0.12"
         inkscape:randomized="0"
         d="m -33.222628,-50.925817 c 2.010163,-3.022813 -32.679906,3.956939 -29.657093,5.967102 3.022813,2.010162 -3.956939,-32.679907 -5.967102,-29.657094 -2.010162,3.022813 32.679907,-3.956939 29.657094,-5.967102 -3.022813,-2.010162 3.956939,32.679907 5.967101,29.657094 z"
         transform="matrix(0.10705309,0.13878367,-0.13878367,0.10705309,738.21487,148.54626)"
         inkscape:transform-center-x="23.561818"
         inkscape:transform-center-y="-28.902455" /><rect
         style="fill:#3c6eb4;fill-opacity:1;stroke:none;stroke-width:2.3489;stroke-linecap:round;stroke-linejoin:round;stroke-dasharray:none;stroke-opacity:1;paint-order:stroke fill markers"
         id="rect222"
         width="3.4036191"
         height="10.129014"
         x="-812.77588"
         y="572.93604"
         transform="matrix(-0.92576101,0.37810918,0.37810918,0.92576101,0,0)" /><rect
         style="fill:#3c6eb4;fill-opacity:1;stroke:none;stroke-width:2.3489;stroke-linecap:round;stroke-linejoin:round;stroke-dasharray:none;stroke-opacity:1;paint-order:stroke fill markers"
         id="rect223"
         width="3.4036191"
         height="10.129014"
         x="462.7157"
         y="-971.59729"
         transform="matrix(0.63534886,-0.77222524,-0.77222524,-0.63534886,0,0)" /><path
         sodipodi:type="star"
         style="fill:#82ceff;fill-opacity:1;stroke:none;stroke-width:3.54576;stroke-linecap:round;stroke-linejoin:round;stroke-dasharray:none;stroke-opacity:1;paint-order:stroke fill markers"
         id="path223"
         inkscape:flatsided="true"
         sodipodi:sides="4"
         sodipodi:cx="-51.034725"
         sodipodi:cy="-62.770813"
         sodipodi:r1="21.390997"
         sodipodi:r2="9.2603378"
         sodipodi:arg1="0.58684597"
         sodipodi:arg2="1.3722441"
         inkscape:rounded="-0.12"
         inkscape:randomized="0"
         d="m -33.222628,-50.925817 c 2.010163,-3.022813 -32.679906,3.956939 -29.657093,5.967102 3.022813,2.010162 -3.956939,-32.679907 -5.967102,-29.657094 -2.010162,3.022813 32.679907,-3.956939 29.657094,-5.967102 -3.022813,-2.010162 3.956939,32.679907 5.967101,29.657094 z"
         transform="matrix(-0.12701637,0.12078126,-0.12078126,-0.12701637,1084.9337,269.12949)"
         inkscape:transform-center-x="-26.32123"
         inkscape:transform-center-y="-26.414036" /><circle
         style="fill:#ffffff;fill-opacity:1;stroke:none;stroke-width:2.3489;stroke-linecap:round;stroke-linejoin:round;stroke-dasharray:none;stroke-opacity:1;paint-order:stroke fill markers"
         id="circle223"
         cx="-791.61035"
         cy="511.07101"
         r="1.9340422"
         transform="rotate(-138.09205)" /><path
         style="fill:#ffffff;fill-opacity:1;stroke:none;stroke-width:0.591886px;stroke-linecap:butt;stroke-linejoin:miter;stroke-opacity:1"
         d="m 913.28174,161.88995 -1.4596,9.25943 2.585,0.85558 c 0.7199,-2.8265 1.3381,-5.77141 3.5504,-9.12842 z"
         id="path224"
         sodipodi:nodetypes="ccccc" /><path
         style="fill:#3c6eb4;fill-opacity:1;stroke:none;stroke-width:0.591886px;stroke-linecap:butt;stroke-linejoin:miter;stroke-opacity:1"
         d="m 929.01784,178.58417 4.0718,6.33189 3.1103,-1.92537 -2.4132,-8.32672 z"
         id="path225"
         sodipodi:nodetypes="ccccc" /><path
         sodipodi:type="star"
         style="fill:#82ceff;fill-opacity:1;stroke:none;stroke-width:3.54576;stroke-linecap:round;stroke-linejoin:round;stroke-dasharray:none;stroke-opacity:1;paint-order:stroke fill markers"
         id="path226"
         inkscape:flatsided="true"
         sodipodi:sides="4"
         sodipodi:cx="-51.034725"
         sodipodi:cy="-62.770813"
         sodipodi:r1="21.390997"
         sodipodi:r2="9.2603378"
         sodipodi:arg1="0.58684597"
         sodipodi:arg2="1.3722441"
         inkscape:rounded="-0.12"
         inkscape:randomized="0"
         d="m -33.222628,-50.925817 c 2.010163,-3.022813 -32.679906,3.956939 -29.657093,5.967102 3.022813,2.010162 -3.956939,-32.679907 -5.967102,-29.657094 -2.010162,3.022813 32.679907,-3.956939 29.657094,-5.967102 -3.022813,-2.010162 3.956939,32.679907 5.967101,29.657094 z"
         transform="matrix(0.01302764,-0.17479002,0.17479002,0.01302764,908.12804,178.1631)"
         inkscape:transform-center-x="1.7698352"
         inkscape:transform-center-y="37.247536" /><path
         style="fill:#ffffff;fill-opacity:1;stroke:none;stroke-width:0.591886px;stroke-linecap:butt;stroke-linejoin:miter;stroke-opacity:1"
         d="m 983.39145,264.32189 3.6636,-5.9276 1.872,0.77014 c -0.9638,1.94235 -2.0421,3.90224 -2.4214,6.86676 z"
         id="path227"
         sodipodi:nodetypes="ccccc" /><path
         style="fill:#ffffff;fill-opacity:1;stroke:none;stroke-width:0.591886px;stroke-linecap:butt;stroke-linejoin:miter;stroke-opacity:1"
         d="m 975.62946,197.81379 0.3742,-9.36629 -2.6669,-0.54955 c -0.3867,2.89097 -0.6586,5.8878 -2.466,9.479 z"
         id="path228"
         sodipodi:nodetypes="ccccc" /><path
         style="fill:#82ceff;fill-opacity:1;stroke:none;stroke-width:0.591886px;stroke-linecap:butt;stroke-linejoin:miter;stroke-opacity:1"
         d="m 1182.0857,235.87071 -8.779,1.45629 v 2.58496 c 2.7619,-0.19739 5.6002,-0.52183 9.2867,0.46652 z"
         id="path229"
         sodipodi:nodetypes="ccccc" /><rect
         style="fill:#3c6eb4;fill-opacity:1;stroke:none;stroke-width:2.3489;stroke-linecap:round;stroke-linejoin:round;stroke-dasharray:none;stroke-opacity:1;paint-order:stroke fill markers"
         id="rect229"
         width="3.4036191"
         height="10.129014"
         x="832.47247"
         y="745.08923"
         transform="matrix(0.57469599,0.81836698,0.81836698,-0.57469599,0,0)" /><path
         sodipodi:type="star"
         style="fill:#ffffff;fill-opacity:1;stroke:none;stroke-width:3.3766;stroke-linecap:round;stroke-linejoin:round;stroke-dasharray:none;stroke-opacity:1;paint-order:stroke fill markers"
         id="path230"
         inkscape:flatsided="false"
         sodipodi:sides="4"
         sodipodi:cx="-83.895691"
         sodipodi:cy="-93.977196"
         sodipodi:r1="10.353173"
         sodipodi:r2="31.373253"
         sodipodi:arg1="1.277949"
         sodipodi:arg2="2.0633472"
         inkscape:rounded="0.1"
         inkscape:randomized="0"
         d="m -80.906942,-84.064801 c -2.40715,0.725795 -15.609052,18.920401 -17.824378,17.731503 -2.21533,-1.188897 5.649029,-22.248 4.923234,-24.655149 -0.725795,-2.407149 -18.920404,-15.609053 -17.731504,-17.824383 1.1889,-2.21532 22.248001,5.64903 24.65515,4.92324 2.40715,-0.7258 15.609052,-18.9204 17.824378,-17.7315 2.215326,1.18889 -5.649029,22.247996 -4.923234,24.655145 0.725795,2.40715 18.9204,15.609052 17.731503,17.824379 -1.188897,2.215326 -22.248,-5.649029 -24.655149,-4.923235 z"
         transform="matrix(0.15686533,-0.09627976,0.09627976,0.15686533,1231.4364,250.57203)"
         inkscape:transform-center-x="-0.43649807"
         inkscape:transform-center-y="-0.22526058" /><path
         sodipodi:type="star"
         style="fill:#3c6eb4;fill-opacity:1;stroke:none;stroke-width:5.66729;stroke-linecap:round;stroke-linejoin:round;stroke-dasharray:none;stroke-opacity:1;paint-order:stroke fill markers"
         id="path231"
         inkscape:flatsided="false"
         sodipodi:sides="5"
         sodipodi:cx="-28.497557"
         sodipodi:cy="95.920502"
         sodipodi:r1="42.927052"
         sodipodi:r2="26.185501"
         sodipodi:arg1="0.82753514"
         sodipodi:arg2="1.4558536"
         inkscape:rounded="0.17"
         inkscape:randomized="0"
         d="m 0.55086168,127.52622 c -3.33427038,3.06448 -21.54646668,-6.11239 -26.04520868,-5.59301 -4.498742,0.51939 -20.140728,13.60478 -24.085575,11.38068 -3.944846,-2.2241 -0.844998,-22.38074 -2.729151,-26.4988 -1.884154,-4.11805 -19.162742,-14.950858 -18.26652,-19.389916 0.896221,-4.439057 21.024229,-7.71967 24.3585,-10.784156 3.334271,-3.064487 8.297502,-22.844921 12.796245,-23.364308 4.498741,-0.519387 13.838686,17.609722 17.783532,19.833823 3.944847,2.224102 24.2908801,0.831925 26.175034,4.949984 1.884154,4.118058 -12.4714508,18.603076 -13.3676723,23.042133 -0.8962217,4.43906 6.7150868,23.35908 3.38081598,26.42357 z"
         transform="matrix(0.08106538,0.07385097,0.07385097,-0.08106538,1011.9484,268.3003)" /><path
         sodipodi:type="star"
         style="fill:#3c6eb4;fill-opacity:1;stroke:none;stroke-width:5.66729;stroke-linecap:round;stroke-linejoin:round;stroke-dasharray:none;stroke-opacity:1;paint-order:stroke fill markers"
         id="path232"
         inkscape:flatsided="false"
         sodipodi:sides="5"
         sodipodi:cx="-28.497557"
         sodipodi:cy="95.920502"
         sodipodi:r1="42.927052"
         sodipodi:r2="26.185501"
         sodipodi:arg1="0.82753514"
         sodipodi:arg2="1.4558536"
         inkscape:rounded="0.17"
         inkscape:randomized="0"
         d="m 0.55086168,127.52622 c -3.33427038,3.06448 -21.54646668,-6.11239 -26.04520868,-5.59301 -4.498742,0.51939 -20.140728,13.60478 -24.085575,11.38068 -3.944846,-2.2241 -0.844998,-22.38074 -2.729151,-26.4988 -1.884154,-4.11805 -19.162742,-14.950858 -18.26652,-19.389916 0.896221,-4.439057 21.024229,-7.71967 24.3585,-10.784156 3.334271,-3.064487 8.297502,-22.844921 12.796245,-23.364308 4.498741,-0.519387 13.838686,17.609722 17.783532,19.833823 3.944847,2.224102 24.2908801,0.831925 26.175034,4.949984 1.884154,4.118058 -12.4714508,18.603076 -13.3676723,23.042133 -0.8962217,4.43906 6.7150868,23.35908 3.38081598,26.42357 z"
         transform="matrix(-0.01100268,-0.10910775,-0.10910775,0.01100268,970.98666,171.35167)" /><path
         style="fill:#82ceff;fill-opacity:1;stroke:none;stroke-width:0.591886px;stroke-linecap:butt;stroke-linejoin:miter;stroke-opacity:1"
         d="m 961.15112,278.17377 6.8582,5.67061 1.9491,-1.69802 c -1.9609,-1.9551 -4.0676,-3.88442 -5.7401,-7.3152 z"
         id="path233"
         sodipodi:nodetypes="ccccc" /><path
         style="fill:#82ceff;fill-opacity:1;stroke:none;stroke-width:0.591886px;stroke-linecap:butt;stroke-linejoin:miter;stroke-opacity:1"
         d="m 966.28791,248.67411 -9.9224,-2.85529 -1.2869,2.70911 c 2.9915,1.17141 6.1264,2.24785 9.4948,5.12271 z"
         id="path234"
         sodipodi:nodetypes="ccccc" /><path
         sodipodi:type="star"
         style="fill:#ffffff;fill-opacity:1;stroke:none;stroke-width:3.3766;stroke-linecap:round;stroke-linejoin:round;stroke-dasharray:none;stroke-opacity:1;paint-order:stroke fill markers"
         id="path235"
         inkscape:flatsided="false"
         sodipodi:sides="4"
         sodipodi:cx="-83.895691"
         sodipodi:cy="-93.977196"
         sodipodi:r1="10.353173"
         sodipodi:r2="31.373253"
         sodipodi:arg1="1.277949"
         sodipodi:arg2="2.0633472"
         inkscape:rounded="0.1"
         inkscape:randomized="0"
         d="m -80.906942,-84.064801 c -2.40715,0.725795 -15.609052,18.920401 -17.824378,17.731503 -2.21533,-1.188897 5.649029,-22.248 4.923234,-24.655149 -0.725795,-2.407149 -18.920404,-15.609053 -17.731504,-17.824383 1.1889,-2.21532 22.248001,5.64903 24.65515,4.92324 2.40715,-0.7258 15.609052,-18.9204 17.824378,-17.7315 2.215326,1.18889 -5.649029,22.247996 -4.923234,24.655145 0.725795,2.40715 18.9204,15.609052 17.731503,17.824379 -1.188897,2.215326 -22.248,-5.649029 -24.655149,-4.923235 z"
         transform="matrix(-0.17557264,-0.05523381,0.05523381,-0.17557264,926.16468,211.62514)"
         inkscape:transform-center-x="-0.43649807"
         inkscape:transform-center-y="-0.22526058" /><path
         sodipodi:type="star"
         style="fill:#ffffff;fill-opacity:1;stroke:none;stroke-width:5.66729;stroke-linecap:round;stroke-linejoin:round;stroke-dasharray:none;stroke-opacity:1;paint-order:stroke fill markers"
         id="path236"
         inkscape:flatsided="false"
         sodipodi:sides="5"
         sodipodi:cx="-28.497557"
         sodipodi:cy="95.920502"
         sodipodi:r1="42.927052"
         sodipodi:r2="26.185501"
         sodipodi:arg1="0.82753514"
         sodipodi:arg2="1.4558536"
         inkscape:rounded="0.17"
         inkscape:randomized="0"
         d="m 0.55086168,127.52622 c -3.33427038,3.06448 -21.54646668,-6.11239 -26.04520868,-5.59301 -4.498742,0.51939 -20.140728,13.60478 -24.085575,11.38068 -3.944846,-2.2241 -0.844998,-22.38074 -2.729151,-26.4988 -1.884154,-4.11805 -19.162742,-14.950858 -18.26652,-19.389916 0.896221,-4.439057 21.024229,-7.71967 24.3585,-10.784156 3.334271,-3.064487 8.297502,-22.844921 12.796245,-23.364308 4.498741,-0.519387 13.838686,17.609722 17.783532,19.833823 3.944847,2.224102 24.2908801,0.831925 26.175034,4.949984 1.884154,4.118058 -12.4714508,18.603076 -13.3676723,23.042133 -0.8962217,4.43906 6.7150868,23.35908 3.38081598,26.42357 z"
         transform="matrix(-0.07193885,-0.08276689,0.08276689,-0.07193885,753.21977,155.52283)" /><path
         style="fill:#ffffff;fill-opacity:1;stroke:none;stroke-width:0.591886px;stroke-linecap:butt;stroke-linejoin:miter;stroke-opacity:1"
         d="m 776.16638,103.41433 4.3677,-5.429639 1.7625,0.99547 c -1.1962,1.808439 -2.5084,3.620099 -3.2511,6.515069 z"
         id="path237"
         sodipodi:nodetypes="ccccc" /><rect
         style="fill:#ffffff;fill-opacity:1;stroke:none;stroke-width:2.3489;stroke-linecap:round;stroke-linejoin:round;stroke-dasharray:none;stroke-opacity:1;paint-order:stroke fill markers"
         id="rect237"
         width="3.4036191"
         height="10.129013"
         x="-480.93436"
         y="-850.93854"
         transform="rotate(125.84538)" /><rect
         style="fill:#3c6eb4;fill-opacity:1;stroke:none;stroke-width:2.3489;stroke-linecap:round;stroke-linejoin:round;stroke-dasharray:none;stroke-opacity:1;paint-order:stroke fill markers"
         id="rect238"
         width="3.4036191"
         height="10.129014"
         x="31.087709"
         y="856.29254"
         transform="matrix(-0.07607097,0.99710241,0.99710241,0.07607097,0,0)" /><path
         style="fill:#82ceff;fill-opacity:1;stroke:none;stroke-width:0.591886px;stroke-linecap:butt;stroke-linejoin:miter;stroke-opacity:1"
         d="m 923.47401,279.49715 -9.9224,-2.85529 -1.2869,2.70911 c 2.9915,1.17141 6.1264,2.24785 9.4948,5.12271 z"
         id="path238"
         sodipodi:nodetypes="ccccc" /><path
         sodipodi:type="star"
         style="fill:#ffffff;fill-opacity:1;stroke:none;stroke-width:3.3766;stroke-linecap:round;stroke-linejoin:round;stroke-dasharray:none;stroke-opacity:1;paint-order:stroke fill markers"
         id="path239"
         inkscape:flatsided="false"
         sodipodi:sides="4"
         sodipodi:cx="-83.895691"
         sodipodi:cy="-93.977196"
         sodipodi:r1="10.353173"
         sodipodi:r2="31.373253"
         sodipodi:arg1="1.277949"
         sodipodi:arg2="2.0633472"
         inkscape:rounded="0.1"
         inkscape:randomized="0"
         d="m -80.906942,-84.064801 c -2.40715,0.725795 -15.609052,18.920401 -17.824378,17.731503 -2.21533,-1.188897 5.649029,-22.248 4.923234,-24.655149 -0.725795,-2.407149 -18.920404,-15.609053 -17.731504,-17.824383 1.1889,-2.21532 22.248001,5.64903 24.65515,4.92324 2.40715,-0.7258 15.609052,-18.9204 17.824378,-17.7315 2.215326,1.18889 -5.649029,22.247996 -4.923234,24.655145 0.725795,2.40715 18.9204,15.609052 17.731503,17.824379 -1.188897,2.215326 -22.248,-5.649029 -24.655149,-4.923235 z"
         transform="matrix(-0.17557264,-0.05523381,0.05523381,-0.17557264,822.29858,262.05803)"
         inkscape:transform-center-x="-0.43649807"
         inkscape:transform-center-y="-0.22526058" /><path
         style="fill:#82ceff;fill-opacity:1;stroke:none;stroke-width:0.591886px;stroke-linecap:butt;stroke-linejoin:miter;stroke-opacity:1"
         d="m 995.46896,132.3101 -5.94401,-8.44249 -2.70045,1.305 c 1.59748,2.78738 3.36619,5.59057 4.19,9.94166 z"
         id="path240"
         sodipodi:nodetypes="ccccc" /><circle
         style="fill:#ffffff;fill-opacity:1;stroke:none;stroke-width:2.3489;stroke-linecap:round;stroke-linejoin:round;stroke-dasharray:none;stroke-opacity:1;paint-order:stroke fill markers"
         id="circle240"
         cx="-309.71173"
         cy="1018.0916"
         r="1.9340422"
         transform="rotate(-92.197948)" /><circle
         style="fill:#ffffff;fill-opacity:1;stroke:none;stroke-width:2.3489;stroke-linecap:round;stroke-linejoin:round;stroke-dasharray:none;stroke-opacity:1;paint-order:stroke fill markers"
         id="circle241"
         cx="-163.62193"
         cy="1102.9941"
         r="1.9340422"
         transform="rotate(-92.197948)" /><path
         style="fill:#ffffff;fill-opacity:1;stroke:none;stroke-width:0.591886px;stroke-linecap:butt;stroke-linejoin:miter;stroke-opacity:1"
         d="m 1097.9328,102.17556 -7.6646,5.39637 1.1848,2.45165 c 2.5305,-1.45033 5.0754,-3.05602 9.0256,-3.80395 z"
         id="path241"
         sodipodi:nodetypes="ccccc" /><path
         style="fill:#3c6eb4;fill-opacity:1;stroke:none;stroke-width:0.591886px;stroke-linecap:butt;stroke-linejoin:miter;stroke-opacity:1"
         d="m 1103.0803,141.2978 -1.7127,7.33075 3.5473,0.89332 4.2994,-7.52813 z"
         id="path242"
         sodipodi:nodetypes="ccccc" /><path
         sodipodi:type="star"
         style="fill:#82ceff;fill-opacity:1;stroke:none;stroke-width:3.54576;stroke-linecap:round;stroke-linejoin:round;stroke-dasharray:none;stroke-opacity:1;paint-order:stroke fill markers"
         id="path243"
         inkscape:flatsided="true"
         sodipodi:sides="4"
         sodipodi:cx="-51.034725"
         sodipodi:cy="-62.770813"
         sodipodi:r1="21.390997"
         sodipodi:r2="9.2603378"
         sodipodi:arg1="0.58684597"
         sodipodi:arg2="1.3722441"
         inkscape:rounded="-0.12"
         inkscape:randomized="0"
         d="m -33.222628,-50.925817 c 2.010163,-3.022813 -32.679906,3.956939 -29.657093,5.967102 3.022813,2.010162 -3.956939,-32.679907 -5.967102,-29.657094 -2.010162,3.022813 32.679907,-3.956939 29.657094,-5.967102 -3.022813,-2.010162 3.956939,32.679907 5.967101,29.657094 z"
         transform="matrix(0.13457586,-0.11229696,0.11229696,0.13457586,1093.3579,129.83466)"
         inkscape:transform-center-x="23.561818"
         inkscape:transform-center-y="-28.902455" /><path
         sodipodi:type="star"
         style="fill:#ffffff;fill-opacity:1;stroke:none;stroke-width:5.66729;stroke-linecap:round;stroke-linejoin:round;stroke-dasharray:none;stroke-opacity:1;paint-order:stroke fill markers"
         id="path244"
         inkscape:flatsided="false"
         sodipodi:sides="5"
         sodipodi:cx="-28.497557"
         sodipodi:cy="95.920502"
         sodipodi:r1="42.927052"
         sodipodi:r2="26.185501"
         sodipodi:arg1="0.82753514"
         sodipodi:arg2="1.4558536"
         inkscape:rounded="0.17"
         inkscape:randomized="0"
         d="m 0.55086168,127.52622 c -3.33427038,3.06448 -21.54646668,-6.11239 -26.04520868,-5.59301 -4.498742,0.51939 -20.140728,13.60478 -24.085575,11.38068 -3.944846,-2.2241 -0.844998,-22.38074 -2.729151,-26.4988 -1.884154,-4.11805 -19.162742,-14.950858 -18.26652,-19.389916 0.896221,-4.439057 21.024229,-7.71967 24.3585,-10.784156 3.334271,-3.064487 8.297502,-22.844921 12.796245,-23.364308 4.498741,-0.519387 13.838686,17.609722 17.783532,19.833823 3.944847,2.224102 24.2908801,0.831925 26.175034,4.949984 1.884154,4.118058 -12.4714508,18.603076 -13.3676723,23.042133 -0.8962217,4.43906 6.7150868,23.35908 3.38081598,26.42357 z"
         transform="matrix(-0.00420572,-0.10958042,0.10958042,-0.00420572,1048.7095,103.89249)" /><path
         style="fill:#ffffff;fill-opacity:1;stroke:none;stroke-width:0.591886px;stroke-linecap:butt;stroke-linejoin:miter;stroke-opacity:1"
         d="m 1120.9335,151.20479 6.8061,-1.49485 0.7499,1.88016 c -2.0655,0.65986 -4.2233,1.24959 -6.616,3.04048 z"
         id="path245"
         sodipodi:nodetypes="ccccc" /><path
         style="fill:#ffffff;fill-opacity:1;stroke:none;stroke-width:0.591886px;stroke-linecap:butt;stroke-linejoin:miter;stroke-opacity:1"
         d="m 1014.0603,120.2181 1.4949,6.80617 -1.8802,0.74984 c -0.6599,-2.06542 -1.2496,-4.22324 -3.0405,-6.61593 z"
         id="path246"
         sodipodi:nodetypes="ccccc" /><path
         sodipodi:type="star"
         style="fill:#3c6eb4;fill-opacity:1;stroke:none;stroke-width:5.66729;stroke-linecap:round;stroke-linejoin:round;stroke-dasharray:none;stroke-opacity:1;paint-order:stroke fill markers"
         id="path247"
         inkscape:flatsided="false"
         sodipodi:sides="5"
         sodipodi:cx="-28.497557"
         sodipodi:cy="95.920502"
         sodipodi:r1="42.927052"
         sodipodi:r2="26.185501"
         sodipodi:arg1="0.82753514"
         sodipodi:arg2="1.4558536"
         inkscape:rounded="0.17"
         inkscape:randomized="0"
         d="m 0.55086168,127.52622 c -3.33427038,3.06448 -21.54646668,-6.11239 -26.04520868,-5.59301 -4.498742,0.51939 -20.140728,13.60478 -24.085575,11.38068 -3.944846,-2.2241 -0.844998,-22.38074 -2.729151,-26.4988 -1.884154,-4.11805 -19.162742,-14.950858 -18.26652,-19.389916 0.896221,-4.439057 21.024229,-7.71967 24.3585,-10.784156 3.334271,-3.064487 8.297502,-22.844921 12.796245,-23.364308 4.498741,-0.519387 13.838686,17.609722 17.783532,19.833823 3.944847,2.224102 24.2908801,0.831925 26.175034,4.949984 1.884154,4.118058 -12.4714508,18.603076 -13.3676723,23.042133 -0.8962217,4.43906 6.7150868,23.35908 3.38081598,26.42357 z"
         transform="matrix(0.01690509,0.10835026,0.10835026,-0.01690509,1131.3615,137.84493)" /><path
         style="fill:#82ceff;fill-opacity:1;stroke:none;stroke-width:0.591886px;stroke-linecap:butt;stroke-linejoin:miter;stroke-opacity:1"
         d="m 1128.0063,107.03317 -7.1557,-5.29023 -1.8542,1.80113 c 2.064,1.84585 4.2724,3.65805 6.1284,6.99305 z"
         id="path248"
         sodipodi:nodetypes="ccccc" /><rect
         style="fill:#ffffff;fill-opacity:1;stroke:none;stroke-width:2.3489;stroke-linecap:round;stroke-linejoin:round;stroke-dasharray:none;stroke-opacity:1;paint-order:stroke fill markers"
         id="rect248"
         width="3.4036191"
         height="10.129013"
         x="-986.94281"
         y="-414.55267"
         transform="rotate(164.64376)" /><rect
         style="fill:#3c6eb4;fill-opacity:1;stroke:none;stroke-width:2.3489;stroke-linecap:round;stroke-linejoin:round;stroke-dasharray:none;stroke-opacity:1;paint-order:stroke fill markers"
         id="rect249"
         width="3.4036191"
         height="10.129014"
         x="915.26697"
         y="442.55371"
         transform="matrix(0.82544061,0.56448897,0.56448897,-0.82544061,0,0)" /><rect
         style="fill:#3c6eb4;fill-opacity:1;stroke:none;stroke-width:2.3489;stroke-linecap:round;stroke-linejoin:round;stroke-dasharray:none;stroke-opacity:1;paint-order:stroke fill markers"
         id="rect250"
         width="3.4036191"
         height="10.129014"
         x="-632.48083"
         y="889.40662"
         transform="matrix(-0.68405256,0.72943272,0.72943272,0.68405256,0,0)" /><path
         sodipodi:type="star"
         style="fill:#82ceff;fill-opacity:1;stroke:none;stroke-width:3.54576;stroke-linecap:round;stroke-linejoin:round;stroke-dasharray:none;stroke-opacity:1;paint-order:stroke fill markers"
         id="path250"
         inkscape:flatsided="true"
         sodipodi:sides="4"
         sodipodi:cx="-51.034725"
         sodipodi:cy="-62.770813"
         sodipodi:r1="21.390997"
         sodipodi:r2="9.2603378"
         sodipodi:arg1="0.58684597"
         sodipodi:arg2="1.3722441"
         inkscape:rounded="-0.12"
         inkscape:randomized="0"
         d="m -33.222628,-50.925817 c 2.010163,-3.022813 -32.679906,3.956939 -29.657093,5.967102 3.022813,2.010162 -3.956939,-32.679907 -5.967102,-29.657094 -2.010162,3.022813 32.679907,-3.956939 29.657094,-5.967102 -3.022813,-2.010162 3.956939,32.679907 5.967101,29.657094 z"
         transform="matrix(0.13457586,-0.11229696,0.11229696,0.13457586,1049.3545,133.51865)"
         inkscape:transform-center-x="23.561818"
         inkscape:transform-center-y="-28.902455" /><path
         style="fill:#ffffff;fill-opacity:1;stroke:none;stroke-width:0.591886px;stroke-linecap:butt;stroke-linejoin:miter;stroke-opacity:1"
         d="m 1164.8716,116.62701 -9.3737,-0.0147 -0.4469,2.68601 c 2.9037,0.2755 5.9087,0.43235 9.5666,2.10065 z"
         id="path251"
         sodipodi:nodetypes="ccccc" /><path
         sodipodi:type="star"
         style="fill:#ffffff;fill-opacity:1;stroke:none;stroke-width:3.3766;stroke-linecap:round;stroke-linejoin:round;stroke-dasharray:none;stroke-opacity:1;paint-order:stroke fill markers"
         id="path252"
         inkscape:flatsided="false"
         sodipodi:sides="4"
         sodipodi:cx="-83.895691"
         sodipodi:cy="-93.977196"
         sodipodi:r1="10.353173"
         sodipodi:r2="31.373253"
         sodipodi:arg1="1.277949"
         sodipodi:arg2="2.0633472"
         inkscape:rounded="0.1"
         inkscape:randomized="0"
         d="m -80.906942,-84.064801 c -2.40715,0.725795 -15.609052,18.920401 -17.824378,17.731503 -2.21533,-1.188897 5.649029,-22.248 4.923234,-24.655149 -0.725795,-2.407149 -18.920404,-15.609053 -17.731504,-17.824383 1.1889,-2.21532 22.248001,5.64903 24.65515,4.92324 2.40715,-0.7258 15.609052,-18.9204 17.824378,-17.7315 2.215326,1.18889 -5.649029,22.247996 -4.923234,24.655145 0.725795,2.40715 18.9204,15.609052 17.731503,17.824379 -1.188897,2.215326 -22.248,-5.649029 -24.655149,-4.923235 z"
         transform="matrix(-0.10357409,-0.15214774,0.15214774,-0.10357409,1011.3586,259.50091)"
         inkscape:transform-center-x="4.8816156"
         inkscape:transform-center-y="3.1764579" /><path
         style="fill:#82ceff;fill-opacity:1;stroke:none;stroke-width:0.591886px;stroke-linecap:butt;stroke-linejoin:miter;stroke-opacity:1"
         d="m 742.37902,207.60225 5.5607,-6.94759 -1.7287,-1.92188 c -1.9237,1.9917 -3.8192,4.12891 -7.2229,5.85572 z"
         id="path262"
         sodipodi:nodetypes="ccccc" /><circle
         style="fill:#ffffff;fill-opacity:1;stroke:none;stroke-width:2.3489;stroke-linecap:round;stroke-linejoin:round;stroke-dasharray:none;stroke-opacity:1;paint-order:stroke fill markers"
         id="circle262"
         cx="-131.22974"
         cy="798.94135"
         r="1.9340422"
         transform="rotate(-92.197948)" /><path
         style="fill:#82ceff;fill-opacity:1;stroke:none;stroke-width:0.591886px;stroke-linecap:butt;stroke-linejoin:miter;stroke-opacity:1"
         d="m 939.29874,104.98619 -3.97229,-9.530362 -2.91915,0.688502 c 0.95518,3.067417 2.07408,6.1874 1.93498,10.61361 z"
         id="path263"
         sodipodi:nodetypes="ccccc" /><path
         sodipodi:type="star"
         style="fill:#82ceff;fill-opacity:1;stroke:none;stroke-width:3.54576;stroke-linecap:round;stroke-linejoin:round;stroke-dasharray:none;stroke-opacity:1;paint-order:stroke fill markers"
         id="path264"
         inkscape:flatsided="true"
         sodipodi:sides="4"
         sodipodi:cx="-51.034725"
         sodipodi:cy="-62.770813"
         sodipodi:r1="21.390997"
         sodipodi:r2="9.2603378"
         sodipodi:arg1="0.58684597"
         sodipodi:arg2="1.3722441"
         inkscape:rounded="-0.12"
         inkscape:randomized="0"
         d="m -33.222628,-50.925817 c 2.010163,-3.022813 -32.679906,3.956939 -29.657093,5.967102 3.022813,2.010162 -3.956939,-32.679907 -5.967102,-29.657094 -2.010162,3.022813 32.679907,-3.956939 29.657094,-5.967102 -3.022813,-2.010162 3.956939,32.679907 5.967101,29.657094 z"
         transform="matrix(-0.12701637,0.12078126,-0.12078126,-0.12701637,816.9955,94.121775)"
         inkscape:transform-center-x="-26.321301"
         inkscape:transform-center-y="-26.414037" /><path
         sodipodi:type="star"
         style="fill:#ffffff;fill-opacity:1;stroke:none;stroke-width:3.3766;stroke-linecap:round;stroke-linejoin:round;stroke-dasharray:none;stroke-opacity:1;paint-order:stroke fill markers"
         id="path265"
         inkscape:flatsided="false"
         sodipodi:sides="4"
         sodipodi:cx="-83.895691"
         sodipodi:cy="-93.977196"
         sodipodi:r1="10.353173"
         sodipodi:r2="31.373253"
         sodipodi:arg1="1.277949"
         sodipodi:arg2="2.0633472"
         inkscape:rounded="0.1"
         inkscape:randomized="0"
         d="m -80.906942,-84.064801 c -2.40715,0.725795 -15.609052,18.920401 -17.824378,17.731503 -2.21533,-1.188897 5.649029,-22.248 4.923234,-24.655149 -0.725795,-2.407149 -18.920404,-15.609053 -17.731504,-17.824383 1.1889,-2.21532 22.248001,5.64903 24.65515,4.92324 2.40715,-0.7258 15.609052,-18.9204 17.824378,-17.7315 2.215326,1.18889 -5.649029,22.247996 -4.923234,24.655145 0.725795,2.40715 18.9204,15.609052 17.731503,17.824379 -1.188897,2.215326 -22.248,-5.649029 -24.655149,-4.923235 z"
         transform="matrix(-0.17557264,-0.05523381,0.05523381,-0.17557264,898.49307,74.391625)"
         inkscape:transform-center-x="-0.43649807"
         inkscape:transform-center-y="-0.22526058" /><circle
         style="fill:#ffffff;fill-opacity:1;stroke:none;stroke-width:2.3489;stroke-linecap:round;stroke-linejoin:round;stroke-dasharray:none;stroke-opacity:1;paint-order:stroke fill markers"
         id="circle265"
         cx="-128.25406"
         cy="880.04828"
         r="1.9340422"
         transform="rotate(-92.197948)" /><path
         style="fill:#82ceff;fill-opacity:1;stroke:none;stroke-width:0.591886px;stroke-linecap:butt;stroke-linejoin:miter;stroke-opacity:1"
         d="m 768.39154,277.19431 1.8445,10.1589 2.99894,-0.049 c -0.27787,-3.20069 -0.7044,-6.48761 0.37712,-10.78192 z"
         id="path266"
         sodipodi:nodetypes="ccccc" /><path
         style="fill:#ffffff;fill-opacity:1;stroke:none;stroke-width:0.591886px;stroke-linecap:butt;stroke-linejoin:miter;stroke-opacity:1"
         d="m 893.99259,284.00232 -0.7155,-9.34638 -2.7127,-0.23627 c -0.049,2.91632 0.029,5.92441 -1.349,9.70118 z"
         id="path267"
         sodipodi:nodetypes="ccccc" /><path
         style="fill:#ffffff;fill-opacity:1;stroke:none;stroke-width:0.591886px;stroke-linecap:butt;stroke-linejoin:miter;stroke-opacity:1"
         d="m 1172.0638,285.3391 1.5046,-6.80402 2.0211,0.11002 c -0.2694,2.15145 -0.6413,4.35725 -0.022,7.28109 z"
         id="path268"
         sodipodi:nodetypes="ccccc" /><rect
         style="fill:#ffffff;fill-opacity:1;stroke:none;stroke-width:2.3489;stroke-linecap:round;stroke-linejoin:round;stroke-dasharray:none;stroke-opacity:1;paint-order:stroke fill markers"
         id="rect268"
         width="3.4036191"
         height="10.129013"
         x="809.73431"
         y="725.65149"
         transform="rotate(-27.760232)" /><rect
         style="fill:#3c6eb4;fill-opacity:1;stroke:none;stroke-width:2.3489;stroke-linecap:round;stroke-linejoin:round;stroke-dasharray:none;stroke-opacity:1;paint-order:stroke fill markers"
         id="rect269"
         width="3.4036191"
         height="10.129014"
         x="611.41174"
         y="-784.14648"
         transform="matrix(0.6942264,-0.7197567,-0.7197567,-0.6942264,0,0)" /><rect
         style="fill:#3c6eb4;fill-opacity:1;stroke:none;stroke-width:2.3489;stroke-linecap:round;stroke-linejoin:round;stroke-dasharray:none;stroke-opacity:1;paint-order:stroke fill markers"
         id="rect270"
         width="3.4036191"
         height="10.129014"
         x="1051.1904"
         y="-623.38391"
         transform="matrix(0.92730085,-0.3743169,-0.3743169,-0.92730085,0,0)" /><path
         sodipodi:type="star"
         style="fill:#82ceff;fill-opacity:1;stroke:none;stroke-width:3.54576;stroke-linecap:round;stroke-linejoin:round;stroke-dasharray:none;stroke-opacity:1;paint-order:stroke fill markers"
         id="path270"
         inkscape:flatsided="true"
         sodipodi:sides="4"
         sodipodi:cx="-51.034725"
         sodipodi:cy="-62.770813"
         sodipodi:r1="21.390997"
         sodipodi:r2="9.2603378"
         sodipodi:arg1="0.58684597"
         sodipodi:arg2="1.3722441"
         inkscape:rounded="-0.12"
         inkscape:randomized="0"
         d="m -33.222628,-50.925817 c 2.010163,-3.022813 -32.679906,3.956939 -29.657093,5.967102 3.022813,2.010162 -3.956939,-32.679907 -5.967102,-29.657094 -2.010162,3.022813 32.679907,-3.956939 29.657094,-5.967102 -3.022813,-2.010162 3.956939,32.679907 5.967101,29.657094 z"
         transform="matrix(-0.16931312,0.04532483,-0.04532483,-0.16931312,1214.0236,193.4719)"
         inkscape:transform-center-x="-35.748606"
         inkscape:transform-center-y="-10.608767" /><rect
         style="fill:#3c6eb4;fill-opacity:1;stroke:none;stroke-width:2.3489;stroke-linecap:round;stroke-linejoin:round;stroke-dasharray:none;stroke-opacity:1;paint-order:stroke fill markers"
         id="rect271"
         width="3.4036191"
         height="10.129014"
         x="-99.494576"
         y="766.04938"
         transform="matrix(-0.43584497,0.90002176,0.90002176,0.43584497,0,0)" /><path
         sodipodi:type="star"
         style="fill:#ffffff;fill-opacity:1;stroke:none;stroke-width:3.3766;stroke-linecap:round;stroke-linejoin:round;stroke-dasharray:none;stroke-opacity:1;paint-order:stroke fill markers"
         id="path271"
         inkscape:flatsided="false"
         sodipodi:sides="4"
         sodipodi:cx="-83.895691"
         sodipodi:cy="-93.977196"
         sodipodi:r1="10.353173"
         sodipodi:r2="31.373253"
         sodipodi:arg1="1.277949"
         sodipodi:arg2="2.0633472"
         inkscape:rounded="0.1"
         inkscape:randomized="0"
         d="m -80.906942,-84.064801 c -2.40715,0.725795 -15.609052,18.920401 -17.824378,17.731503 -2.21533,-1.188897 5.649029,-22.248 4.923234,-24.655149 -0.725795,-2.407149 -18.920404,-15.609053 -17.731504,-17.824383 1.1889,-2.21532 22.248001,5.64903 24.65515,4.92324 2.40715,-0.7258 15.609052,-18.9204 17.824378,-17.7315 2.215326,1.18889 -5.649029,22.247996 -4.923234,24.655145 0.725795,2.40715 18.9204,15.609052 17.731503,17.824379 -1.188897,2.215326 -22.248,-5.649029 -24.655149,-4.923235 z"
         transform="matrix(0.1838088,-0.00953154,0.00953154,0.1838088,1204.7846,120.08373)"
         inkscape:transform-center-x="-0.49107822"
         inkscape:transform-center-y="0.01093738" /><path
         style="fill:#3c6eb4;fill-opacity:1;stroke:none;stroke-width:0.591886px;stroke-linecap:butt;stroke-linejoin:miter;stroke-opacity:1"
         d="m 1230.5576,223.10908 -7.2597,-1.99256 -1.0287,3.51038 7.3577,4.585 z"
         id="path272"
         sodipodi:nodetypes="ccccc" /><rect
         style="fill:#3c6eb4;fill-opacity:1;stroke:none;stroke-width:2.3489;stroke-linecap:round;stroke-linejoin:round;stroke-dasharray:none;stroke-opacity:1;paint-order:stroke fill markers"
         id="rect283"
         width="3.4036191"
         height="10.129014"
         x="1130.0081"
         y="447.315"
         transform="matrix(0.82544061,0.56448897,0.56448897,-0.82544061,0,0)" /><path
         sodipodi:type="star"
         style="fill:#ffffff;fill-opacity:1;stroke:none;stroke-width:2.60557;stroke-linecap:round;stroke-linejoin:round;stroke-dasharray:none;stroke-opacity:1;paint-order:stroke fill markers"
         id="path283"
         inkscape:flatsided="true"
         sodipodi:sides="4"
         sodipodi:cx="-51.034725"
         sodipodi:cy="-62.770813"
         sodipodi:r1="21.390997"
         sodipodi:r2="9.2603378"
         sodipodi:arg1="0.58684597"
         sodipodi:arg2="1.3722441"
         inkscape:rounded="-0.12"
         inkscape:randomized="0"
         d="m -33.222628,-50.925817 c 2.010163,-3.022813 -32.679906,3.956939 -29.657093,5.967102 3.022813,2.010162 -3.956939,-32.679907 -5.967102,-29.657094 -2.010162,3.022813 32.679907,-3.956939 29.657094,-5.967102 -3.022813,-2.010162 3.956939,32.679907 5.967101,29.657094 z"
         transform="matrix(0.1456816,0.18886168,-0.18886168,0.1456816,1213.6657,284.71824)"
         inkscape:transform-center-x="32.063743"
         inkscape:transform-center-y="-39.331481" /><path
         sodipodi:type="star"
         style="fill:#82ceff;fill-opacity:1;stroke:none;stroke-width:3.54576;stroke-linecap:round;stroke-linejoin:round;stroke-dasharray:none;stroke-opacity:1;paint-order:stroke fill markers"
         id="path284"
         inkscape:flatsided="true"
         sodipodi:sides="4"
         sodipodi:cx="-51.034725"
         sodipodi:cy="-62.770813"
         sodipodi:r1="21.390997"
         sodipodi:r2="9.2603378"
         sodipodi:arg1="0.58684597"
         sodipodi:arg2="1.3722441"
         inkscape:rounded="-0.12"
         inkscape:randomized="0"
         d="m -33.222628,-50.925817 c 2.010163,-3.022813 -32.679906,3.956939 -29.657093,5.967102 3.022813,2.010162 -3.956939,-32.679907 -5.967102,-29.657094 -2.010162,3.022813 32.679907,-3.956939 29.657094,-5.967102 -3.022813,-2.010162 3.956939,32.679907 5.967101,29.657094 z"
         transform="matrix(0.13457586,-0.11229696,0.11229696,0.13457586,1217.7819,284.84415)"
         inkscape:transform-center-x="23.561818"
         inkscape:transform-center-y="-28.902455" /><path
         style="fill:#ffffff;fill-opacity:1;stroke:none;stroke-width:0.591886px;stroke-linecap:butt;stroke-linejoin:miter;stroke-opacity:1"
         d="m 1228.1181,250.0783 3.6636,-5.9276 1.872,0.77014 c -0.9638,1.94235 -2.0421,3.90224 -2.4214,6.86676 z"
         id="path285"
         sodipodi:nodetypes="ccccc" /><path
         sodipodi:type="star"
         style="fill:#82ceff;fill-opacity:1;stroke:none;stroke-width:5.66729;stroke-linecap:round;stroke-linejoin:round;stroke-dasharray:none;stroke-opacity:1;paint-order:stroke fill markers"
         id="path286"
         inkscape:flatsided="false"
         sodipodi:sides="5"
         sodipodi:cx="-28.497557"
         sodipodi:cy="95.920502"
         sodipodi:r1="42.927052"
         sodipodi:r2="26.185501"
         sodipodi:arg1="0.82753514"
         sodipodi:arg2="1.4558536"
         inkscape:rounded="0.17"
         inkscape:randomized="0"
         d="m 0.55086168,127.52622 c -3.33427038,3.06448 -21.54646668,-6.11239 -26.04520868,-5.59301 -4.498742,0.51939 -20.140728,13.60478 -24.085575,11.38068 -3.944846,-2.2241 -0.844998,-22.38074 -2.729151,-26.4988 -1.884154,-4.11805 -19.162742,-14.950858 -18.26652,-19.389916 0.896221,-4.439057 21.024229,-7.71967 24.3585,-10.784156 3.334271,-3.064487 8.297502,-22.844921 12.796245,-23.364308 4.498741,-0.519387 13.838686,17.609722 17.783532,19.833823 3.944847,2.224102 24.2908801,0.831925 26.175034,4.949984 1.884154,4.118058 -12.4714508,18.603076 -13.3676723,23.042133 -0.8962217,4.43906 6.7150868,23.35908 3.38081598,26.42357 z"
         transform="matrix(0.1096611,0,0,0.1096611,1237.2959,273.12222)" /><path
         style="fill:#ffffff;fill-opacity:1;stroke:none;stroke-width:0.591886px;stroke-linecap:butt;stroke-linejoin:miter;stroke-opacity:1"
         d="m 1122.2807,284.33617 -9.3737,-0.0147 -0.4469,2.68601 c 2.9037,0.2755 5.9087,0.43235 9.5666,2.10065 z"
         id="path287"
         sodipodi:nodetypes="ccccc" /><path
         sodipodi:type="star"
         style="fill:#3c6eb4;fill-opacity:1;stroke:none;stroke-width:5.66729;stroke-linecap:round;stroke-linejoin:round;stroke-dasharray:none;stroke-opacity:1;paint-order:stroke fill markers"
         id="path288"
         inkscape:flatsided="false"
         sodipodi:sides="5"
         sodipodi:cx="-28.497557"
         sodipodi:cy="95.920502"
         sodipodi:r1="42.927052"
         sodipodi:r2="26.185501"
         sodipodi:arg1="0.82753514"
         sodipodi:arg2="1.4558536"
         inkscape:rounded="0.17"
         inkscape:randomized="0"
         d="m 0.55086168,127.52622 c -3.33427038,3.06448 -21.54646668,-6.11239 -26.04520868,-5.59301 -4.498742,0.51939 -20.140728,13.60478 -24.085575,11.38068 -3.944846,-2.2241 -0.844998,-22.38074 -2.729151,-26.4988 -1.884154,-4.11805 -19.162742,-14.950858 -18.26652,-19.389916 0.896221,-4.439057 21.024229,-7.71967 24.3585,-10.784156 3.334271,-3.064487 8.297502,-22.844921 12.796245,-23.364308 4.498741,-0.519387 13.838686,17.609722 17.783532,19.833823 3.944847,2.224102 24.2908801,0.831925 26.175034,4.949984 1.884154,4.118058 -12.4714508,18.603076 -13.3676723,23.042133 -0.8962217,4.43906 6.7150868,23.35908 3.38081598,26.42357 z"
         transform="matrix(0.01690509,0.10835026,0.10835026,-0.01690509,1138.8477,106.10408)" /><path
         style="fill:#82ceff;fill-opacity:1;stroke:none;stroke-width:0.591886px;stroke-linecap:butt;stroke-linejoin:miter;stroke-opacity:1"
         d="m 1206.9676,126.93887 -3.9723,-9.53036 -2.9191,0.6885 c 0.9552,3.06742 2.0741,6.1874 1.935,10.61361 z"
         id="path289"
         sodipodi:nodetypes="ccccc" /><circle
         style="fill:#ffffff;fill-opacity:1;stroke:none;stroke-width:2.3489;stroke-linecap:round;stroke-linejoin:round;stroke-dasharray:none;stroke-opacity:1;paint-order:stroke fill markers"
         id="circle289"
         cx="-310.67111"
         cy="1119.252"
         transform="rotate(-92.197948)"
         r="1.9340422" /><rect
         style="fill:#ffffff;fill-opacity:1;stroke:none;stroke-width:2.3489;stroke-linecap:round;stroke-linejoin:round;stroke-dasharray:none;stroke-opacity:1;paint-order:stroke fill markers"
         id="rect289"
         width="3.4036191"
         height="10.129013"
         x="-1153.2654"
         y="-426.67795"
         transform="rotate(164.64376)" /><path
         style="fill:#3c6eb4;fill-opacity:1;stroke:none;stroke-width:0.591886px;stroke-linecap:butt;stroke-linejoin:miter;stroke-opacity:1"
         d="m 1224.0335,139.70424 7.2597,1.99255 1.0287,-3.51039 -7.3577,-4.585 z"
         id="path290"
         sodipodi:nodetypes="ccccc" /><path
         sodipodi:type="star"
         style="fill:#ffffff;fill-opacity:1;stroke:none;stroke-width:3.3766;stroke-linecap:round;stroke-linejoin:round;stroke-dasharray:none;stroke-opacity:1;paint-order:stroke fill markers"
         id="path291"
         inkscape:flatsided="false"
         sodipodi:sides="4"
         sodipodi:cx="-83.895691"
         sodipodi:cy="-93.977196"
         sodipodi:r1="10.353173"
         sodipodi:r2="31.373253"
         sodipodi:arg1="1.277949"
         sodipodi:arg2="2.0633472"
         inkscape:rounded="0.1"
         inkscape:randomized="0"
         d="m -80.906942,-84.064801 c -2.40715,0.725795 -15.609052,18.920401 -17.824378,17.731503 -2.21533,-1.188897 5.649029,-22.248 4.923234,-24.655149 -0.725795,-2.407149 -18.920404,-15.609053 -17.731504,-17.824383 1.1889,-2.21532 22.248001,5.64903 24.65515,4.92324 2.40715,-0.7258 15.609052,-18.9204 17.824378,-17.7315 2.215326,1.18889 -5.649029,22.247996 -4.923234,24.655145 0.725795,2.40715 18.9204,15.609052 17.731503,17.824379 -1.188897,2.215326 -22.248,-5.649029 -24.655149,-4.923235 z"
         transform="matrix(-0.17557264,-0.05523381,0.05523381,-0.17557264,1218.4522,153.98953)"
         inkscape:transform-center-x="-0.43649807"
         inkscape:transform-center-y="-0.22526058" /><path
         style="fill:#82ceff;fill-opacity:1;stroke:none;stroke-width:0.591886px;stroke-linecap:butt;stroke-linejoin:miter;stroke-opacity:1"
         d="m 739.07677,99.08843 1.8445,10.1589 2.99894,-0.049 c -0.27787,-3.20069 -0.7044,-6.48761 0.37712,-10.78192 z"
         id="path292"
         sodipodi:nodetypes="ccccc" /><path
         style="fill:#ffffff;fill-opacity:1;stroke:none;stroke-width:0.591886px;stroke-linecap:butt;stroke-linejoin:miter;stroke-opacity:1"
         d="m 742.03725,272.73555 6.8061,-1.49485 0.7499,1.88016 c -2.0655,0.65986 -4.2233,1.24959 -6.616,3.04048 z"
         id="path293"
         sodipodi:nodetypes="ccccc" /><circle
         style="fill:#3c6eb4;fill-opacity:1;stroke:none;stroke-width:2.3489;stroke-linecap:round;stroke-linejoin:round;stroke-dasharray:none;stroke-opacity:1;paint-order:stroke fill markers"
         id="circle293"
         cx="743.36169"
         cy="186.39014"
         r="1.9340422" /><circle
         style="fill:#82ceff;fill-opacity:1;stroke:none;stroke-width:2.3489;stroke-linecap:round;stroke-linejoin:round;stroke-dasharray:none;stroke-opacity:1;paint-order:stroke fill markers"
         id="circle294"
         cx="718.53021"
         cy="336.08292"
         r="1.9340422" /><path
         style="fill:#3c6eb4;fill-opacity:1;stroke:none;stroke-width:0.591886px;stroke-linecap:butt;stroke-linejoin:miter;stroke-opacity:1"
         d="m 801.64864,374.48795 -7.2597,1.99254 -1.0287,-3.51039 7.3577,-4.58499 z"
         id="path294"
         sodipodi:nodetypes="ccccc" /><path
         sodipodi:type="star"
         style="fill:#82ceff;fill-opacity:1;stroke:none;stroke-width:5.66729;stroke-linecap:round;stroke-linejoin:round;stroke-dasharray:none;stroke-opacity:1;paint-order:stroke fill markers"
         id="path295"
         inkscape:flatsided="false"
         sodipodi:sides="5"
         sodipodi:cx="-28.497557"
         sodipodi:cy="95.920502"
         sodipodi:r1="42.927052"
         sodipodi:r2="26.185501"
         sodipodi:arg1="0.82753514"
         sodipodi:arg2="1.4558536"
         inkscape:rounded="0.17"
         inkscape:randomized="0"
         d="m 0.55086168,127.52622 c -3.33427038,3.06448 -21.54646668,-6.11239 -26.04520868,-5.59301 -4.498742,0.51939 -20.140728,13.60478 -24.085575,11.38068 -3.944846,-2.2241 -0.844998,-22.38074 -2.729151,-26.4988 -1.884154,-4.11805 -19.162742,-14.950858 -18.26652,-19.389916 0.896221,-4.439057 21.024229,-7.71967 24.3585,-10.784156 3.334271,-3.064487 8.297502,-22.844921 12.796245,-23.364308 4.498741,-0.519387 13.838686,17.609722 17.783532,19.833823 3.944847,2.224102 24.2908801,0.831925 26.175034,4.949984 1.884154,4.118058 -12.4714508,18.603076 -13.3676723,23.042133 -0.8962217,4.43906 6.7150868,23.35908 3.38081598,26.42357 z"
         transform="matrix(0.1096611,0,0,0.1096611,777.3881,363.2987)" /><path
         style="fill:#ffffff;fill-opacity:1;stroke:none;stroke-width:0.591886px;stroke-linecap:butt;stroke-linejoin:miter;stroke-opacity:1"
         d="m 760.67319,344.62047 5.0985,7.86593 2.4952,-1.08985 c -1.3521,-2.58433 -2.8591,-5.18893 -3.4549,-9.16492 z"
         id="path296"
         sodipodi:nodetypes="ccccc" /><path
         style="fill:#3c6eb4;fill-opacity:1;stroke:none;stroke-width:0.591886px;stroke-linecap:butt;stroke-linejoin:miter;stroke-opacity:1"
         d="m 784.01333,348.1107 7.2597,1.99255 1.0287,-3.51039 -7.3577,-4.585 z"
         id="path297"
         sodipodi:nodetypes="ccccc" /><path
         style="fill:#82ceff;fill-opacity:1;stroke:none;stroke-width:0.591886px;stroke-linecap:butt;stroke-linejoin:miter;stroke-opacity:1"
         d="m 777.18534,396.82697 1.8445,10.1589 2.99894,-0.049 c -0.27787,-3.20069 -0.7044,-6.48761 0.37712,-10.78192 z"
         id="path298"
         sodipodi:nodetypes="ccccc" /><rect
         style="fill:#3c6eb4;fill-opacity:1;stroke:none;stroke-width:2.3489;stroke-linecap:round;stroke-linejoin:round;stroke-dasharray:none;stroke-opacity:1;paint-order:stroke fill markers"
         id="rect298"
         width="3.4036191"
         height="10.129014"
         x="4.3446841"
         y="826.10529"
         transform="matrix(-0.43584497,0.90002176,0.90002176,0.43584497,0,0)" /><path
         style="fill:#ffffff;fill-opacity:1;stroke:none;stroke-width:0.591886px;stroke-linecap:butt;stroke-linejoin:miter;stroke-opacity:1"
         d="m 750.83105,392.36821 6.8061,-1.49485 0.7499,1.88016 c -2.0655,0.65986 -4.2233,1.24959 -6.616,3.04048 z"
         id="path299"
         sodipodi:nodetypes="ccccc" /></g><g
       id="g252"
       transform="matrix(20.763045,9.1288327,-21.55807,8.7921767,6112.7125,-2015.5643)"
       inkscape:export-filename="/home/thlavack/Pictures/fedora-design/ #615 Fedora Appreciation Week/pngs/f.png"
       inkscape:export-xdpi="95.5"
       inkscape:export-ydpi="95.5"
       style="opacity:0.716112;mix-blend-mode:lighten;fill:#db3279;stroke:none"><rect
         style="fill:#db3279;stroke:none;stroke-width:0.0579804;stroke-linecap:round;stroke-linejoin:bevel;stroke-dasharray:none;paint-order:markers fill stroke"
         id="rect252"
         width="18.117592"
         height="18.122772"
         x="-178.3461"
         y="176.42265"
         transform="rotate(-46.076207)" /></g><rect
       style="fill:#a07cbc;fill-opacity:0.5;stroke:none;stroke-width:1.08413;stroke-linecap:round;stroke-linejoin:bevel;stroke-dasharray:none;paint-order:markers fill stroke"
       id="rect253"
       width="543.85663"
       height="224.85291"
       x="777.99908"
       y="220.02156" /><g
       id="g266"
       transform="translate(-5.5910719)"><g
         id="g261"
         transform="translate(-133.75161,91.680391)"><path
           fill="#d13852"
           d="m 1155.5394,203.92823 c -0.6673,-10.44252 -2.9076,-18.92401 -10.1767,-27.66048 -14.5626,-17.46476 -48.0356,-20.37242 -63.0078,-3.55858 -2.6119,2.47364 -5.0775,5.45179 -7.5539,9.01038 l -5.6036,8.05295 -5.6064,-8.05295 c -2.4846,-3.55859 -4.9555,-6.53946 -7.5675,-9.01038 -14.983,-16.81384 -48.4533,-13.90891 -63.00775,3.55858 -7.27993,8.73647 -9.51761,17.21796 -10.18486,27.66048 -0.94931,31.04548 21.57941,55.90411 24.35961,59.54678 15.2894,17.93673 31.9676,34.89699 48.9035,50.52281 3.065,2.68251 5.7122,4.91476 8.3594,7.12804 1.5922,1.29922 3.1627,2.61471 4.744,3.90579 1.5785,-1.29381 3.1436,-2.60657 4.7276,-3.90579 2.6581,-2.21328 5.3053,-4.44553 8.3594,-7.12804 16.944,-15.62582 33.6249,-32.57522 48.9307,-50.52281 2.7801,-3.64267 25.3116,-28.5013 24.3541,-59.54678"
           id="path253"
           style="mix-blend-mode:normal;fill:#db578f;fill-opacity:1;stroke-width:2.71233" /><path
           fill="#f1a5b1"
           d="m 1146.1791,198.38965 a 27.443489,27.443489 0 0 0 -1.2396,-7.89023 24.600952,24.600952 0 0 0 -3.1707,-6.56386 c -8.0638,-11.85023 -25.6343,-16.11947 -40.3136,-13.1196 -5.7257,1.37784 -11.4596,3.53147 -14.096,8.99953 -0.8978,2.3462 0.99,3.47451 3.9058,3.33076 10.5618,-1.17987 22.2466,-0.1168 31.5852,4.42112 2.3272,1.13919 4.5052,2.48995 6.4961,4.07667 6.6995,5.1887 9.5935,13.2552 10.9036,21.25663 3.2575,-0.65638 5.0287,-4.56487 5.4518,-8.0421 a 28.506728,28.506728 0 0 0 0.4801,-6.46892"
           id="path254"
           style="mix-blend-mode:normal;stroke-width:2.71233" /><text
           xml:space="preserve"
           style="font-weight:600;font-size:24.2496px;line-height:1.17;font-family:Montserrat;-inkscape-font-specification:'Montserrat Semi-Bold';text-align:start;text-decoration-color:#000000;text-anchor:start;fill:#ffffff;stroke:none;stroke-width:2.14809;stroke-linecap:round;stroke-linejoin:bevel;stroke-dasharray:none;paint-order:markers fill stroke"
           x="999.72534"
           y="241.20113"
           id="text254"><tspan
             sodipodi:role="line"
             id="tspan254"
             style="font-style:normal;font-variant:normal;font-weight:bold;font-stretch:normal;font-family:Montserrat;-inkscape-font-specification:'Montserrat Bold';stroke:none;stroke-width:2.14809"
             x="999.72534"
             y="241.20113">Thank you!</tspan></text></g><g
         id="g265"
         transform="matrix(1.3394811,0,0,1.3394811,-344.01059,-123.6407)"><g
           id="g260"
           transform="matrix(1.1434802,0,0,1.1434802,467.74602,51.245998)"
           style="mix-blend-mode:normal;fill:#ffffff"><g
             id="g259"
             transform="matrix(1.1692152,0,0,1.1692152,-107.92803,-51.425699)"
             style="fill:#ffffff"><g
               id="g258"
               transform="matrix(0.57928696,0,0,0.57928696,236.77961,-75.570812)"
               style="fill:#ffffff;fill-opacity:1"><g
                 id="g254"
                 transform="matrix(0.68945,0,0,0.60473167,421.95324,488.53103)"
                 style="fill:#ffffff;fill-opacity:1"
                 inkscape:export-filename="/home/thlavack/Pictures/fedora-design/ #615 Fedora Appreciation Week/pngs/f.png"
                 inkscape:export-xdpi="95.5"
                 inkscape:export-ydpi="95.5" /><g
                 id="g257"
                 transform="matrix(1.1150486,0,0,1.1150486,476.18545,303.65207)"
                 style="fill:#ffffff;fill-opacity:1"><g
                   id="g256"
                   transform="translate(16.185201,-4.7334797)"
                   inkscape:export-filename="/home/thlavack/Pictures/fedora-design/ #615 Fedora Appreciation Week/pngs/f.png"
                   inkscape:export-xdpi="95.5"
                   inkscape:export-ydpi="95.5"
                   style="fill:#ffffff;fill-opacity:1"><g
                     id="g255"
                     style="fill:#ffffff;fill-opacity:1" /></g></g><path
                 id="path257"
                 style="color:#000000;font-style:normal;font-variant:normal;font-weight:normal;font-stretch:normal;font-size:medium;line-height:normal;font-family:sans-serif;font-variant-ligatures:normal;font-variant-position:normal;font-variant-caps:normal;font-variant-numeric:normal;font-variant-alternates:normal;font-feature-settings:normal;text-indent:0;text-align:start;text-decoration:none;text-decoration-line:none;text-decoration-style:solid;text-decoration-color:#000000;letter-spacing:normal;word-spacing:normal;text-transform:none;writing-mode:lr-tb;direction:ltr;text-orientation:mixed;dominant-baseline:auto;baseline-shift:baseline;text-anchor:start;white-space:normal;shape-padding:0;clip-rule:nonzero;display:inline;overflow:visible;visibility:visible;isolation:auto;mix-blend-mode:normal;color-interpolation:sRGB;color-interpolation-filters:linearRGB;solid-color:#000000;solid-opacity:1;vector-effect:none;fill:#ffffff;fill-opacity:1;fill-rule:nonzero;stroke:none;stroke-width:1.34691;stroke-linecap:round;stroke-linejoin:round;stroke-miterlimit:4;stroke-dasharray:none;stroke-dashoffset:0;stroke-opacity:1;paint-order:markers stroke fill;color-rendering:auto;image-rendering:auto;shape-rendering:auto;text-rendering:auto;enable-background:accumulate"
                 d="m 504.80404,607.37872 c -0.37131,0.006 -0.66775,0.31131 -0.66268,0.68264 0,2.00903 -1.59478,3.63437 -3.60345,3.67221 -2.00867,0.0379 -3.66355,-1.52567 -3.73919,-3.53328 -0.033,-0.89793 -1.37974,-0.84833 -1.34676,0.0496 0.1027,2.72605 2.3841,4.88185 5.1116,4.83047 1.8165,-0.0342 3.3965,-1.03968 4.2501,-2.51284 0.88702,1.53073 2.55702,2.54833 4.44072,2.51284 1.83543,-0.0345 3.43002,-1.06083 4.27754,-2.55916 0.88042,1.55629 2.5646,2.595 4.46707,2.55916 1.81945,-0.0342 3.40176,-1.04289 4.25438,-2.51998 0.88597,1.53465 2.55804,2.55554 4.44464,2.51998 1.82017,-0.0342 3.40374,-1.04368 4.25651,-2.52175 0.88571,1.53556 2.55773,2.55731 4.44498,2.52175 2.7275,-0.0514 4.92598,-2.29096 4.92598,-5.01894 0.005,-0.3797 -0.30437,-0.68862 -0.68406,-0.68264 -0.37174,0.005 -0.66883,0.3109 -0.66376,0.68264 0,2.00903 -1.59479,3.63437 -3.60345,3.67219 -2.00868,0.0379 -3.6639,-1.52565 -3.73955,-3.53326 -2e-4,-0.0397 -0.004,-0.0793 -0.0111,-0.11835 2e-5,-0.007 2.9e-4,-0.0132 2.9e-4,-0.0208 0.005,-0.3797 -0.30437,-0.68862 -0.68406,-0.68264 -0.37187,0.005 -0.66918,0.31076 -0.66411,0.68264 0,2.00903 -1.59478,3.63438 -3.60345,3.67221 -2.00867,0.0379 -3.66354,-1.52567 -3.73919,-3.53326 -2.3e-4,-0.0376 -0.004,-0.0752 -0.0101,-0.11224 5e-5,-0.008 5.9e-4,-0.0178 5.9e-4,-0.0268 0.005,-0.3797 -0.30438,-0.68862 -0.68407,-0.68264 -0.37117,0.006 -0.6674,0.31145 -0.66232,0.68264 0,2.00903 -1.59478,3.63438 -3.60345,3.67222 -2.00867,0.0379 -3.66389,-1.52568 -3.73955,-3.53328 -0.003,-0.091 -0.0252,-0.18027 -0.0641,-0.26256 -0.0563,-0.32679 -0.34217,-0.56395 -0.67374,-0.55902 -0.37131,0.006 -0.66775,0.31131 -0.66268,0.68264 0,2.00903 -1.59478,3.63438 -3.60345,3.67222 -2.00867,0.0379 -3.6639,-1.52568 -3.73955,-3.53328 -6e-4,-0.0182 -0.002,-0.0364 -0.004,-0.0545 5.2e-4,-0.0283 0.002,-0.056 0.002,-0.0845 0.005,-0.3797 -0.30438,-0.68862 -0.68407,-0.68264 z m -8.77781,-3.47637 v 3.76518 c 0,0.15059 0.1392,0.27172 0.31228,0.27172 h 43.09998 c 0.17309,0 0.31228,-0.12116 0.31228,-0.27172 v -3.76518 z m 0.13019,3.25339 c -0.0111,0.12145 -0.0171,0.24331 -0.0179,0.36525 1.3e-4,2.42858 2.00531,4.39724 4.47871,4.39712 2.01962,-4.8e-4 3.78903,-1.32815 4.31992,-3.24144 0.53049,1.91185 2.29775,3.23916 4.31585,3.24144 2.01932,-5.4e-4 3.78851,-1.32788 4.31961,-3.24081 0.53073,1.9116 2.29793,3.23861 4.31585,3.24081 2.01962,-4.8e-4 3.78903,-1.32815 4.31992,-3.24144 0.53049,1.91185 2.29775,3.23916 4.31585,3.24144 2.01962,-4.7e-4 3.78904,-1.32815 4.31993,-3.24144 0.53049,1.91185 2.29774,3.23916 4.31584,3.24144 2.47327,-6e-5 4.47826,-1.96866 4.47839,-4.39712 -10e-4,-0.12195 -0.007,-0.2438 -0.0185,-0.36525 z m 1.47639,-4.43699 c -1.26989,0 -2.31836,1.04847 -2.31836,2.31836 v 22.80859 c 0,1.26989 1.04847,2.31836 2.31836,2.31836 h 40.51172 c 1.26989,0 2.31641,-1.04847 2.31641,-2.31836 v -22.80859 c 0,-1.26989 -1.04652,-2.31836 -2.31641,-2.31836 z m 0,1.6543 h 40.51172 c 0.38272,0 0.66406,0.28134 0.66406,0.66406 v 22.80859 c 0,0.38272 -0.28134,0.66407 -0.66406,0.66407 h -40.51172 c -0.38272,0 -0.66406,-0.28135 -0.66406,-0.66407 v -22.80859 c 0,-0.38272 0.28134,-0.66406 0.66406,-0.66406 z m 14.75867,-34.43679 c -2.2695,2.1e-4 -4.12523,1.85313 -4.12481,4.12262 0,6.7e-4 0,10e-4 0,0.002 7e-5,0.0227 0.008,0.0448 0.009,0.0675 -2.14484,0.13974 -3.86763,1.8938 -3.86783,4.07255 4.3e-4,2.22739 1.79097,4.05542 4.01374,4.11609 0.003,3.9e-4 0.003,0.002 0.007,0.002 0.008,2.1e-4 0.0155,0.004 0.024,0.004 0.004,3e-5 0.007,3e-5 0.0109,0 0.007,2.4e-4 0.006,0.002 0.0131,0.002 h 6.79264 c 0.67897,0 1.24572,-0.56817 1.24572,-1.24572 v -6.79265 c 0,-0.16429 -0.005,-0.0975 -0.007,-0.0567 0.003,-0.0552 0.006,-0.11028 0.007,-0.16551 0,-10e-4 0,-0.003 0,-0.004 4.1e-4,-2.26949 -1.85313,-4.12459 -4.12263,-4.12481 z m 12.73993,-0.0998 c -3.44447,0 -6.23601,2.79057 -6.23825,6.23427 h -6.9e-4 v 4.82894 h 6.9e-4 c 6.8e-4,0.78178 0.6351,1.41461 1.41731,1.41461 h 0.007 6.8e-4 4.81564 c 3.44486,-0.001 6.2356,-2.79367 6.2356,-6.23825 0,-3.44602 -2.79222,-6.23957 -6.23826,-6.23957 z m 1.2644,2.56735 c 1.04769,0 2.03689,0.80278 2.03689,1.90923 0,0.10259 -3.9e-4,0.20537 -0.0173,0.32176 -0.0289,0.29438 -0.2974,0.50551 -0.59033,0.46402 -0.29291,-0.042 -0.4916,-0.3193 -0.43741,-0.61026 0.005,-0.0332 0.007,-0.0859 0.007,-0.17547 0,-0.62735 -0.51302,-0.86954 -0.99849,-0.86954 -0.48517,0 -0.92288,0.40798 -0.92404,0.86954 0.008,0.5339 0,1.06396 0,1.59679 l 0.90011,-0.007 c 0.70301,-0.0142 0.71089,1.04507 0.008,1.03969 l -0.90809,0.007 c -0.003,0.42941 0.003,0.35143 6.9e-4,0.5677 0,0 0.008,0.52453 -0.008,0.92272 -0.10868,1.16942 -1.10402,2.10466 -2.30012,2.10466 -1.26777,0 -2.31342,-1.03721 -2.31342,-2.30811 0.0381,-1.30739 1.08165,-2.33491 2.39452,-2.32271 l 0.73125,-0.006 v 1.03838 l -0.73125,0.007 h -0.006 c -0.72157,0.0214 -1.339,0.5103 -1.35081,1.28302 0,0.70408 0.56899,1.2684 1.27503,1.2684 0.70487,0 1.26839,-0.51338 1.26839,-1.26707 0.008,-1.24991 -0.005,-2.63061 -6.8e-4,-3.92882 3.9e-4,-0.073 0.004,-0.13103 0.012,-0.21139 0.11904,-0.96117 0.9788,-1.69386 1.95179,-1.69386 z m -22.85898,12.22347 c -1.14144,0 -2.08571,0.94436 -2.08576,2.08576 v 13.03501 c -8.5e-4,0.45688 0.36915,0.82777 0.82603,0.82803 0.45714,1.1e-4 0.82755,-0.37089 0.8267,-0.82803 v -6.61359 c 0.52029,0.27487 1.09861,0.42487 1.83355,0.41102 1.81649,-0.0342 3.39599,-1.0396 4.24959,-2.51279 0.887,1.53075 2.55737,2.5483 4.44108,2.51279 1.83543,-0.0345 3.43009,-1.06048 4.27761,-2.55883 0.88042,1.55629 2.56464,2.59467 4.46711,2.55883 1.81945,-0.0342 3.40165,-1.04239 4.25426,-2.51946 0.88597,1.53465 2.55783,2.55502 4.44442,2.51946 0.5605,-0.0106 1.09768,-0.11467 1.59868,-0.29559 l -0.004,6.36338 c 2.6e-4,0.45532 0.36871,0.82467 0.82403,0.82603 0.45688,8.5e-4 0.82777,-0.36915 0.82803,-0.82603 l 0.008,-12.89823 c 7.4e-4,-1.14208 -0.94433,-2.08776 -2.08577,-2.08776 z m 0,1.65406 h 28.70357 c 0.25427,0 0.43386,0.17805 0.4337,0.4317 l -0.003,5.06628 c -0.48718,0.25412 -1.03587,0.40859 -1.62471,0.41969 -2.00866,0.0379 -3.6635,-1.5254 -3.73915,-3.53299 -2e-4,-0.0375 -0.004,-0.0757 -0.01,-0.11276 3e-5,-0.008 0,-0.0178 0,-0.0267 0.005,-0.37969 -0.30423,-0.68856 -0.68391,-0.68257 -0.37118,0.007 -0.66697,0.31139 -0.6619,0.68257 0,2.00903 -1.59504,3.63461 -3.60371,3.67244 -2.00866,0.0379 -3.66416,-1.52605 -3.73982,-3.53365 -0.003,-0.0909 -0.0252,-0.17992 -0.0641,-0.26223 -0.0563,-0.32679 -0.34167,-0.56408 -0.67323,-0.55913 -0.37132,0.005 -0.6683,0.31126 -0.66323,0.68257 0,2.00903 -1.59435,3.63461 -3.60304,3.67244 -2.00865,0.0379 -3.66418,-1.52605 -3.73983,-3.53365 -7.5e-4,-0.0182 -0.002,-0.0359 -0.004,-0.054 5.4e-4,-0.0283 0.002,-0.0562 0.002,-0.0847 0.005,-0.37954 -0.30436,-0.68833 -0.68391,-0.68257 h -10e-4 c -0.37118,0.005 -0.66698,0.31137 -0.6619,0.68257 0,2.00901 -1.59504,3.6346 -3.60371,3.67244 -0.72815,0.0137 -1.32555,-0.18342 -1.80752,-0.53579 v -4.9503 c 1e-5,-0.25434 0.17875,-0.4317 0.43303,-0.4317 z m -1.17284,-1.06411 v 4.04849 H 533.413 v -4.04849 z m 0,3.72848 v 3.27098 c 0.80558,0.58402 1.82434,0.90489 2.87734,0.90626 2.01963,-4.1e-4 3.78906,-1.16496 4.31994,-2.84316 0.53046,1.67688 2.29762,2.84108 4.31566,2.84316 2.01929,-4.8e-4 3.78846,-1.1647 4.31957,-2.84254 0.53077,1.67674 2.29804,2.84068 4.31601,2.84254 2.01963,-4.1e-4 3.78906,-1.16496 4.31994,-2.84316 0.53049,1.67699 2.29784,2.84122 4.31601,2.84316 0.79663,-0.002 1.57835,-0.18617 2.26454,-0.53469 v -3.64255 z"
                 sodipodi:nodetypes="ccsccscscscscscccscccccscccccsscccsscccccssssccccccccccccccccsssssssssssssssssscssccccscsssscsccccccccscccscccscccsscccccccscccccccscccccscccccscscscscccccsscsccscccccsccccssccsscsccccccccccccccccccccc" /></g><text
               xml:space="preserve"
               style="font-style:normal;font-weight:normal;font-size:10.6896px;line-height:1.17;font-family:sans-serif;letter-spacing:0px;word-spacing:0px;fill:#ffffff;fill-opacity:1;stroke:none;stroke-width:0.281615"
               x="556.72455"
               y="268.22989"
               id="text259"><tspan
                 sodipodi:role="line"
                 id="tspan258"
                 x="556.72455"
                 y="268.22989"
                 style="font-style:normal;font-variant:normal;font-weight:600;font-stretch:normal;font-size:10.6896px;font-family:Montserrat;-inkscape-font-specification:'Montserrat Semi-Bold';text-align:start;letter-spacing:-0.196355px;text-anchor:start;fill:#ffffff;fill-opacity:1;stroke-width:0.281615">APPRECIATION</tspan><tspan
                 sodipodi:role="line"
                 x="556.72455"
                 y="281.10367"
                 style="font-style:normal;font-variant:normal;font-weight:600;font-stretch:normal;font-size:10.6896px;font-family:Montserrat;-inkscape-font-specification:'Montserrat Semi-Bold';text-align:start;letter-spacing:-0.196355px;text-anchor:start;fill:#ffffff;fill-opacity:1;stroke-width:0.281615"
                 id="tspan259">WEEK</tspan></text></g></g><text
           xml:space="preserve"
           style="font-style:normal;font-variant:normal;font-weight:normal;font-stretch:normal;font-size:9.19397px;line-height:1.17;font-family:'Open Sans';-inkscape-font-specification:'Open Sans';text-align:start;text-decoration-color:#000000;text-anchor:start;fill:#ffffff;stroke:none;stroke-width:0.974801;stroke-linecap:round;stroke-linejoin:bevel;stroke-dasharray:none;paint-order:markers fill stroke"
           x="1099.2678"
           y="335.80048"
           id="text260"><tspan
             sodipodi:role="line"
             style="font-style:normal;font-variant:normal;font-weight:normal;font-stretch:normal;font-size:9.19397px;font-family:Montserrat;-inkscape-font-specification:Montserrat;fill:#ffffff;stroke-width:0.974801"
             x="1099.2678"
             y="335.80048"
             id="tspan260">November 6 - 12</tspan></text></g></g></g></svg>
