<?xml version="1.0" encoding="UTF-8" standalone="no"?>
<!-- Created with Inkscape (http://www.inkscape.org/) -->

<svg
   width="31.639801mm"
   height="52.298656mm"
   viewBox="0 0 31.639801 52.298658"
   version="1.1"
   id="svg5"
   xml:space="preserve"
   inkscape:export-filename="beefy miracle v4.svg"
   inkscape:export-xdpi="96"
   inkscape:export-ydpi="96"
   inkscape:version="1.2.2 (b0a8486541, 2022-12-01)"
   sodipodi:docname="beefy-all-versions.svg"
   xmlns:inkscape="http://www.inkscape.org/namespaces/inkscape"
   xmlns:sodipodi="http://sodipodi.sourceforge.net/DTD/sodipodi-0.dtd"
   xmlns="http://www.w3.org/2000/svg"
   xmlns:svg="http://www.w3.org/2000/svg"><sodipodi:namedview
     id="namedview7"
     pagecolor="#ffffff"
     bordercolor="#999999"
     borderopacity="1"
     inkscape:showpageshadow="0"
     inkscape:pageopacity="0"
     inkscape:pagecheckerboard="0"
     inkscape:deskcolor="#d1d1d1"
     inkscape:document-units="mm"
     showgrid="false"
     showguides="true"
     inkscape:zoom="1.2599928"
     inkscape:cx="301.98585"
     inkscape:cy="85.714776"
     inkscape:window-width="2560"
     inkscape:window-height="1403"
     inkscape:window-x="0"
     inkscape:window-y="0"
     inkscape:window-maximized="1"
     inkscape:current-layer="g9693"><inkscape:grid
       type="xygrid"
       id="grid105985"
       originx="0"
       originy="0" /></sodipodi:namedview><defs
     id="defs2"><inkscape:path-effect
       effect="powerstroke"
       id="path-effect1287"
       is_visible="true"
       lpeversion="1"
       offset_points="0.31114256,0.10072944 | 2.0067069,0.18484344 | 3.8,0.1322915"
       not_jump="false"
       sort_points="true"
       interpolator_type="CentripetalCatmullRom"
       interpolator_beta="0.2"
       start_linecap_type="zerowidth"
       linejoin_type="round"
       miter_limit="4"
       scale_width="1"
       end_linecap_type="zerowidth" /><inkscape:path-effect
       effect="powerstroke"
       id="path-effect1285"
       is_visible="true"
       lpeversion="1"
       offset_points="0.61386243,0.13770205 | 1.5,0.1322915 | 2.3481713,0.11451532"
       not_jump="false"
       sort_points="true"
       interpolator_type="CentripetalCatmullRom"
       interpolator_beta="0.2"
       start_linecap_type="zerowidth"
       linejoin_type="round"
       miter_limit="4"
       scale_width="1"
       end_linecap_type="zerowidth" /><inkscape:path-effect
       effect="powerstroke"
       id="path-effect1283"
       is_visible="true"
       lpeversion="1"
       offset_points="0.2,0.1322915 | 0.99944812,0.16724882 | 1.8,0.1322915"
       not_jump="false"
       sort_points="true"
       interpolator_type="CentripetalCatmullRom"
       interpolator_beta="0.2"
       start_linecap_type="zerowidth"
       linejoin_type="round"
       miter_limit="4"
       scale_width="1"
       end_linecap_type="zerowidth" /><inkscape:path-effect
       effect="powerstroke"
       id="path-effect1281"
       is_visible="true"
       lpeversion="1"
       offset_points="0.2,0.1322915 | 2,0.1322915 | 3.8,0.1322915"
       not_jump="false"
       sort_points="true"
       interpolator_type="CentripetalCatmullRom"
       interpolator_beta="0.2"
       start_linecap_type="zerowidth"
       linejoin_type="round"
       miter_limit="4"
       scale_width="1"
       end_linecap_type="zerowidth" /><inkscape:path-effect
       effect="powerstroke"
       id="path-effect1279"
       is_visible="true"
       lpeversion="1"
       offset_points="0.2,0.1322915 | 1.5,0.1322915 | 2.8,0.1322915"
       not_jump="false"
       sort_points="true"
       interpolator_type="CentripetalCatmullRom"
       interpolator_beta="0.2"
       start_linecap_type="zerowidth"
       linejoin_type="round"
       miter_limit="4"
       scale_width="1"
       end_linecap_type="zerowidth" /><inkscape:path-effect
       effect="powerstroke"
       id="path-effect1277"
       is_visible="true"
       lpeversion="1"
       offset_points="0.23569706,0.10149726 | 1,0.1322915 | 1.8,0.1322915"
       not_jump="false"
       sort_points="true"
       interpolator_type="CentripetalCatmullRom"
       interpolator_beta="0.2"
       start_linecap_type="zerowidth"
       linejoin_type="round"
       miter_limit="4"
       scale_width="1"
       end_linecap_type="zerowidth" /><inkscape:path-effect
       effect="powerstroke"
       id="path-effect1260"
       is_visible="true"
       lpeversion="1"
       offset_points="0.33108853,0.11600943 | 1.4773906,0.19339623 | 2.3609656,0.14383449"
       not_jump="false"
       sort_points="true"
       interpolator_type="CentripetalCatmullRom"
       interpolator_beta="0.2"
       start_linecap_type="zerowidth"
       linejoin_type="round"
       miter_limit="4"
       scale_width="1"
       end_linecap_type="zerowidth" /><inkscape:path-effect
       effect="powerstroke"
       id="path-effect1258"
       is_visible="true"
       lpeversion="1"
       offset_points="0.36788863,0.14157154 | 0.56133335,0.17233079 | 0.75026576,0.14769723"
       not_jump="false"
       sort_points="true"
       interpolator_type="CentripetalCatmullRom"
       interpolator_beta="0.2"
       start_linecap_type="zerowidth"
       linejoin_type="round"
       miter_limit="4"
       scale_width="1"
       end_linecap_type="zerowidth" /><inkscape:path-effect
       effect="powerstroke"
       id="path-effect1256"
       is_visible="true"
       lpeversion="1"
       offset_points="0.2,0.1322915 | 1,0.1322915 | 1.5376708,0.12458469"
       not_jump="false"
       sort_points="true"
       interpolator_type="CentripetalCatmullRom"
       interpolator_beta="0.2"
       start_linecap_type="zerowidth"
       linejoin_type="round"
       miter_limit="4"
       scale_width="1"
       end_linecap_type="zerowidth" /><inkscape:path-effect
       effect="powerstroke"
       id="path-effect1254"
       is_visible="true"
       lpeversion="1"
       offset_points="0.2,0.1322915 | 1,0.1322915 | 1.5139467,0.13895254"
       not_jump="false"
       sort_points="true"
       interpolator_type="CentripetalCatmullRom"
       interpolator_beta="0.2"
       start_linecap_type="zerowidth"
       linejoin_type="round"
       miter_limit="4"
       scale_width="1"
       end_linecap_type="zerowidth" /><inkscape:path-effect
       effect="powerstroke"
       id="path-effect1252"
       is_visible="true"
       lpeversion="1"
       offset_points="0.2,0.1322915 | 3,0.1322915 | 5.8,0.1322915"
       not_jump="false"
       sort_points="true"
       interpolator_type="CentripetalCatmullRom"
       interpolator_beta="0.2"
       start_linecap_type="zerowidth"
       linejoin_type="round"
       miter_limit="4"
       scale_width="1"
       end_linecap_type="zerowidth" /><inkscape:path-effect
       effect="powerstroke"
       id="path-effect1250"
       is_visible="true"
       lpeversion="1"
       offset_points="0.2,0.1322915 | 2.5011962,0.24261833 | 4.8,0.1322915"
       not_jump="false"
       sort_points="true"
       interpolator_type="CentripetalCatmullRom"
       interpolator_beta="0.2"
       start_linecap_type="zerowidth"
       linejoin_type="round"
       miter_limit="4"
       scale_width="1"
       end_linecap_type="zerowidth" /><inkscape:path-effect
       effect="powerstroke"
       id="path-effect1248"
       is_visible="true"
       lpeversion="1"
       offset_points="0.2,0.1322915 | 1,0.1322915 | 1.8,0.1322915"
       not_jump="false"
       sort_points="true"
       interpolator_type="CentripetalCatmullRom"
       interpolator_beta="0.2"
       start_linecap_type="zerowidth"
       linejoin_type="round"
       miter_limit="4"
       scale_width="1"
       end_linecap_type="zerowidth" /><inkscape:path-effect
       effect="powerstroke"
       id="path-effect1246"
       is_visible="true"
       lpeversion="1"
       offset_points="0.2,0.1322915 | 0.5,0.1322915 | 0.8,0.1322915"
       not_jump="false"
       sort_points="true"
       interpolator_type="CentripetalCatmullRom"
       interpolator_beta="0.2"
       start_linecap_type="zerowidth"
       linejoin_type="round"
       miter_limit="4"
       scale_width="1"
       end_linecap_type="zerowidth" /><inkscape:path-effect
       effect="powerstroke"
       id="path-effect1244"
       is_visible="true"
       lpeversion="1"
       offset_points="0.49761005,0.10886083 | 1,0.1322915 | 1.5042847,0.095561932"
       not_jump="false"
       sort_points="true"
       interpolator_type="CentripetalCatmullRom"
       interpolator_beta="0.2"
       start_linecap_type="zerowidth"
       linejoin_type="round"
       miter_limit="4"
       scale_width="1"
       end_linecap_type="zerowidth" /><inkscape:path-effect
       effect="powerstroke"
       id="path-effect1242"
       is_visible="true"
       lpeversion="1"
       offset_points="0.60619244,0.134148 | 1.5,0.1322915 | 2.7338483,0.099043881"
       not_jump="false"
       sort_points="true"
       interpolator_type="CentripetalCatmullRom"
       interpolator_beta="0.2"
       start_linecap_type="zerowidth"
       linejoin_type="round"
       miter_limit="4"
       scale_width="1"
       end_linecap_type="zerowidth" /><inkscape:path-effect
       effect="powerstroke"
       id="path-effect1240"
       is_visible="true"
       lpeversion="1"
       offset_points="0.2,0.1249555 | 7,0.1249555 | 13.8,0.1249555"
       not_jump="false"
       sort_points="true"
       interpolator_type="CentripetalCatmullRom"
       interpolator_beta="0.2"
       start_linecap_type="zerowidth"
       linejoin_type="round"
       miter_limit="4"
       scale_width="1"
       end_linecap_type="zerowidth" /><inkscape:path-effect
       effect="powerstroke"
       id="path-effect1238"
       is_visible="true"
       lpeversion="1"
       offset_points="0.2,0.120239 | 2.4989438,0.17500622 | 4.8,0.120239"
       not_jump="false"
       sort_points="true"
       interpolator_type="CentripetalCatmullRom"
       interpolator_beta="0.2"
       start_linecap_type="zerowidth"
       linejoin_type="round"
       miter_limit="4"
       scale_width="1"
       end_linecap_type="zerowidth" /><inkscape:path-effect
       effect="powerstroke"
       id="path-effect1236"
       is_visible="true"
       lpeversion="1"
       offset_points="0.39096641,0.1165374 | 2.5,0.1322915 | 4.8,0.1322915"
       not_jump="false"
       sort_points="true"
       interpolator_type="CentripetalCatmullRom"
       interpolator_beta="0.2"
       start_linecap_type="zerowidth"
       linejoin_type="round"
       miter_limit="4"
       scale_width="1"
       end_linecap_type="zerowidth" /><inkscape:path-effect
       effect="powerstroke"
       id="path-effect1234"
       is_visible="true"
       lpeversion="1"
       offset_points="0.59014187,0.13515849 | 1.5,0.1322915 | 2.8,0.1322915"
       not_jump="false"
       sort_points="true"
       interpolator_type="CentripetalCatmullRom"
       interpolator_beta="0.2"
       start_linecap_type="zerowidth"
       linejoin_type="round"
       miter_limit="4"
       scale_width="1"
       end_linecap_type="zerowidth" /><inkscape:path-effect
       effect="powerstroke"
       id="path-effect1232"
       is_visible="true"
       lpeversion="1"
       offset_points="0.29530953,0.065786799 | 1,0.1322915 | 1.5963124,0.081691646"
       not_jump="false"
       sort_points="true"
       interpolator_type="CentripetalCatmullRom"
       interpolator_beta="0.2"
       start_linecap_type="zerowidth"
       linejoin_type="round"
       miter_limit="4"
       scale_width="1"
       end_linecap_type="zerowidth" /><inkscape:path-effect
       effect="powerstroke"
       id="path-effect1230"
       is_visible="true"
       lpeversion="1"
       offset_points="0.2135276,0.066983117 | 1.0107233,0.13410698 | 1.8353932,0.054400249"
       not_jump="false"
       sort_points="true"
       interpolator_type="CentripetalCatmullRom"
       interpolator_beta="0.2"
       start_linecap_type="zerowidth"
       linejoin_type="round"
       miter_limit="4"
       scale_width="1"
       end_linecap_type="zerowidth" /><inkscape:path-effect
       effect="powerstroke"
       id="path-effect1228"
       is_visible="true"
       lpeversion="1"
       offset_points="0.29555816,0.0897531 | 2,0.1322915 | 3.8,0.1322915"
       not_jump="false"
       sort_points="true"
       interpolator_type="CentripetalCatmullRom"
       interpolator_beta="0.2"
       start_linecap_type="zerowidth"
       linejoin_type="round"
       miter_limit="4"
       scale_width="1"
       end_linecap_type="zerowidth" /><inkscape:path-effect
       effect="powerstroke"
       id="path-effect1130"
       is_visible="true"
       lpeversion="1"
       offset_points="0.19085399,0.089459237 | 1.9865897,0.17937559 | 3.4975843,0.11242178"
       not_jump="false"
       sort_points="true"
       interpolator_type="CentripetalCatmullRom"
       interpolator_beta="0.2"
       start_linecap_type="zerowidth"
       linejoin_type="round"
       miter_limit="4"
       scale_width="1"
       end_linecap_type="zerowidth" /><linearGradient
       id="linearGradient38280"
       inkscape:swatch="solid"><stop
         style="stop-color:#000000;stop-opacity:1;"
         offset="0"
         id="stop38278" /></linearGradient></defs><g
     inkscape:label="Layer 1"
     inkscape:groupmode="layer"
     id="layer1"
     transform="translate(-6.6840706,-43.618147)"><g
       id="g4983"
       inkscape:label="beefy05"
       transform="matrix(1.0183133,0,0,1.0183133,-148.34114,63.816594)"><g
         id="g5010"
         inkscape:label="right arm"><g
           id="g5019"
           inkscape:label="right hand"><path
             style="fill:#e8e8e8;fill-opacity:1;stroke:none;stroke-width:0.264583px;stroke-linecap:butt;stroke-linejoin:miter;stroke-opacity:1"
             d="m 158.87581,-11.515119 -0.62006,0.259463 -0.94145,0.134216 -0.67439,-0.178101 -0.47224,-0.479118 -0.21884,-0.521915 0.10287,-0.668481 0.39314,-0.715356 0.18424,-0.430224 -0.7827,0.310066 -1.1869,0.304279 -1.02546,-0.01526 -0.7538,-0.254919 -0.40343,-0.511584 -0.04,-0.627743 0.57632,-0.558847 0.90841,-0.45772 1.74718,-0.108585 2.84457,0.0053 0.81831,-0.08291 -0.13183,-0.531239 -0.23756,-1.657736 0.13422,-0.749595 0.5179,-0.46616 0.94089,-0.171537 0.55129,0.348256 0.14589,0.58126 -0.009,1.553278 -0.0364,1.301493 0.32298,1.009856 0.16388,1.187705 -0.21019,0.69892 -0.49504,0.389722 -0.44689,0.169859 0.24502,0.360696 0.11979,0.437866 -0.34411,0.501528 -0.66291,0.367953 -0.60919,0.03238 -0.3524,-0.159097 z"
             id="path4389" /><path
             style="fill:#000000;fill-rule:nonzero;stroke:none;stroke-width:0.264583px;stroke-linecap:butt;stroke-linejoin:miter;stroke-opacity:1"
             d="m 158.30443,-14.820479 c -0.007,-0.01429 -0.0466,-0.04642 -0.32561,0.05843 -0.20886,0.07849 -0.64701,0.273019 -1.3562,0.535872 -0.40796,0.151208 -0.9173,0.325316 -1.41345,0.446085 -0.22778,0.05545 -0.45424,0.100019 -0.66755,0.125892 -0.2062,0.02501 -0.39686,0.03213 -0.56267,0.01607 -0.33985,-0.03276 -0.59853,-0.102497 -0.79384,-0.191937 -0.19303,-0.0884 -0.32048,-0.194288 -0.40557,-0.298605 -0.0882,-0.108162 -0.13501,-0.219683 -0.15941,-0.318587 -0.0254,-0.102793 -0.0274,-0.195632 -0.023,-0.262689 2.7e-4,-0.0041 5.7e-4,-0.0082 8.9e-4,-0.01215 3.4e-4,-0.0036 0.002,-0.01344 0.008,-0.03048 0.006,-0.01651 0.0149,-0.03735 0.0287,-0.06228 0.0272,-0.04945 0.0697,-0.109959 0.12985,-0.177679 0.119,-0.133929 0.29974,-0.28741 0.54402,-0.429216 0.51264,-0.297589 1.24871,-0.512189 2.19228,-0.454861 1.12932,0.06901 2.12883,0.02061 2.67571,-0.02313 1e-5,0 0.0103,-8.26e-4 0.0103,-8.27e-4 0.99505,-0.08042 1.15696,-0.18863 1.1558,-0.198774 -0.004,-0.03279 -0.17776,-0.04186 -1.16676,-0.02515 -1.5e-4,3e-6 -0.0101,1.71e-4 -0.0102,1.73e-4 -0.52456,0.0089 -1.55311,0.02427 -2.64301,-0.06247 -1.00051,-0.07929 -1.80703,0.135325 -2.38712,0.462292 -0.27517,0.155102 -0.48789,0.329133 -0.63662,0.493701 -0.0748,0.08282 -0.13468,0.164636 -0.17776,0.241936 -0.0219,0.03923 -0.0401,0.07853 -0.0538,0.117323 -0.0137,0.03891 -0.0237,0.07989 -0.0269,0.121477 -4.5e-4,0.0058 -8.5e-4,0.01161 -0.001,0.01752 -0.006,0.09538 -0.002,0.226604 0.0357,0.372801 0.0368,0.142421 0.10725,0.303205 0.23515,0.455077 0.12409,0.147338 0.29782,0.281557 0.53618,0.385756 0.23903,0.104489 0.53694,0.176186 0.90437,0.205313 0.19686,0.01568 0.41205,0.0029 0.63186,-0.02761 0.2285,-0.0317 0.46663,-0.08318 0.70129,-0.145009 0.51162,-0.134801 1.02721,-0.32419 1.43595,-0.490073 0.69799,-0.283275 1.17275,-0.530084 1.33564,-0.624009 0.26085,-0.150404 0.25498,-0.208622 0.24914,-0.220182 z"
             id="path50164"
             inkscape:path-effect="#path-effect1130"
             inkscape:original-d="m 158.30443,-14.820479 c 0,0 -2.90889,1.469787 -4.33968,1.344614 -1.43079,-0.125172 -1.57397,-0.896904 -1.54556,-1.260217 0.0284,-0.363313 1.08127,-1.43693 3.09237,-1.29562 2.01111,0.141311 3.8309,-0.06764 3.8309,-0.06764"
             sodipodi:nodetypes="csssc" /><path
             style="fill:#000000;fill-rule:nonzero;stroke:none;stroke-width:0.264583px;stroke-linecap:butt;stroke-linejoin:miter;stroke-opacity:1"
             d="m 159.33856,-16.099495 c 0.0167,-0.0048 0.035,-0.05811 -0.003,-0.358523 -0.0145,-0.114228 -0.0346,-0.247827 -0.0613,-0.420057 -0.0166,-0.107615 -0.0376,-0.243589 -0.057,-0.386507 -0.0361,-0.265583 -0.0754,-0.613142 -0.0743,-0.938921 4.7e-4,-0.144422 0.009,-0.286185 0.0291,-0.415511 0.0192,-0.122571 0.0487,-0.230394 0.0898,-0.317406 0.04,-0.0845 0.095,-0.164043 0.16363,-0.236474 0.0664,-0.07009 0.14507,-0.133105 0.23349,-0.186792 0.17133,-0.104033 0.37449,-0.169932 0.57671,-0.183417 0.0984,-0.0066 0.19474,-5.58e-4 0.28505,0.01862 0.0897,0.01903 0.17256,0.05088 0.24558,0.09568 0.0727,0.04462 0.13641,0.102536 0.18795,0.175072 0.0518,0.0729 0.0926,0.162371 0.11717,0.271086 0.0544,0.241312 0.0764,0.521283 0.0808,0.811532 0.005,0.301364 -0.01,0.616198 -0.026,0.902105 -0.0151,0.263884 -0.0382,0.59053 -0.0469,0.837064 -0.004,0.123456 -0.006,0.242728 -0.002,0.351051 0.004,0.1047 0.0129,0.204273 0.0316,0.29077 0.0165,0.07741 0.0398,0.167768 0.067,0.267852 0.0269,0.09902 0.0577,0.20824 0.0896,0.324555 0.0637,0.23197 0.13093,0.488994 0.17967,0.746476 0.0496,0.261867 0.0777,0.512401 0.068,0.732706 -0.005,0.112096 -0.0194,0.212492 -0.0439,0.300466 -0.025,0.09016 -0.0598,0.164908 -0.10318,0.225924 -0.10868,0.15329 -0.22101,0.254455 -0.31942,0.32333 -0.11179,0.07824 -0.21651,0.122213 -0.29492,0.149502 -0.13554,0.04717 -0.21202,0.0585 -0.25023,0.08104 -0.0533,0.03144 -0.0656,0.108132 -0.0684,0.128857 -0.003,0.01907 -0.009,0.102267 0.068,0.135725 0.0454,0.01973 0.16371,0.03872 0.34902,-0.0076 0.11057,-0.02766 0.25385,-0.082 0.40545,-0.186627 0.13363,-0.09222 0.27628,-0.22532 0.40779,-0.417499 0.0702,-0.102402 0.11874,-0.218068 0.15017,-0.34172 0.0305,-0.120136 0.0451,-0.248295 0.0478,-0.38056 0.005,-0.257707 -0.0345,-0.536252 -0.0932,-0.808954 -0.0581,-0.269749 -0.13518,-0.535308 -0.20603,-0.767103 -0.029,-0.09482 -0.0704,-0.226548 -0.0994,-0.321368 -0.0302,-0.09836 -0.0548,-0.181661 -0.0725,-0.250645 -0.0161,-0.06213 -0.027,-0.142492 -0.0331,-0.238874 -0.006,-0.09843 -0.007,-0.210014 -0.005,-0.33004 0.004,-0.24795 0.0233,-0.5539 0.0385,-0.829485 0.0157,-0.286417 0.0314,-0.609471 0.0282,-0.920276 -0.003,-0.298388 -0.0231,-0.599108 -0.0805,-0.866691 -0.0304,-0.14145 -0.0835,-0.265516 -0.15648,-0.371322 -0.0727,-0.105337 -0.16323,-0.190126 -0.26584,-0.255228 -0.10248,-0.06503 -0.2157,-0.109649 -0.33338,-0.136364 -0.1184,-0.02688 -0.2416,-0.03571 -0.36415,-0.02901 -0.25049,0.01369 -0.50035,0.09218 -0.71248,0.219187 -0.11014,0.06594 -0.21044,0.145097 -0.2966,0.235749 -0.0893,0.09394 -0.16287,0.199648 -0.21685,0.315097 -0.0569,0.121678 -0.0915,0.259902 -0.11197,0.399991 -0.0218,0.149115 -0.0285,0.306989 -0.0262,0.461324 0.005,0.349223 0.0565,0.708166 0.1071,0.978566 0.0277,0.148137 0.0572,0.280786 0.0844,0.391051 0.0417,0.168446 0.0847,0.308161 0.12235,0.414138 0.10273,0.289324 0.15846,0.321979 0.17065,0.318503 z"
             id="path50166"
             inkscape:path-effect="#path-effect1236"
             inkscape:original-d="m 159.33856,-16.099495 c 0,0 -0.59475,-2.084955 -0.21162,-2.900249 0.38313,-0.815295 1.85733,-1.01627 2.07768,-0.01217 0.22035,1.004101 -0.0926,2.600391 0.0448,3.188942 0.13738,0.58855 0.72652,2.070733 0.26524,2.734167 -0.46128,0.663433 -1.08162,0.579384 -1.08162,0.579384"
             sodipodi:nodetypes="cssssc" /><path
             style="fill:#000000;fill-rule:nonzero;stroke:none;stroke-width:0.264583px;stroke-linecap:butt;stroke-linejoin:miter;stroke-opacity:1"
             d="m 160.43291,-12.470227 c -0.009,0.01262 0.001,0.04201 0.0683,0.146731 0.0474,0.07388 0.10918,0.16747 0.15959,0.271328 0.0179,0.03696 0.0332,0.07258 0.0458,0.107378 0.005,0.0136 0.01,0.02716 0.0136,0.04068 0.0144,0.04739 0.0229,0.09328 0.0238,0.137622 8.5e-4,0.04202 -0.005,0.08438 -0.0212,0.12732 -0.0157,0.0417 -0.0427,0.08858 -0.0895,0.138879 -0.11117,0.118903 -0.21503,0.223191 -0.31718,0.310215 -0.098,0.08344 -0.19418,0.150893 -0.29495,0.201386 -0.0899,0.04505 -0.19241,0.07998 -0.31396,0.09943 -0.10927,0.01749 -0.232,0.0223 -0.37705,0.01329 -0.0566,-0.0039 -0.0974,-0.0176 -0.1274,-0.03429 -0.0301,-0.01674 -0.0535,-0.03885 -0.0728,-0.06482 -0.0204,-0.02752 -0.0371,-0.06091 -0.0506,-0.09922 -0.0144,-0.04082 -0.0244,-0.08503 -0.0316,-0.129614 -0.0174,-0.108195 -0.0181,-0.206563 -0.0263,-0.267338 -0.002,-0.01674 -0.005,-0.03093 -0.008,-0.04313 -0.0225,-0.07998 -0.0958,-0.101067 -0.11855,-0.105508 -0.0203,-0.004 -0.10311,-0.01168 -0.14448,0.07681 -0.006,0.01321 -0.0119,0.02932 -0.0171,0.04861 -0.0174,0.06505 -0.0324,0.190525 -0.0122,0.338535 0.008,0.06115 0.0233,0.128941 0.049,0.196361 0.0242,0.06344 0.0588,0.128956 0.10847,0.188037 0.0485,0.05766 0.11014,0.107829 0.18696,0.143165 0.0757,0.03482 0.16096,0.05289 0.25506,0.05387 0.1639,0.0011 0.3077,-0.0135 0.43932,-0.04238 0.14698,-0.03226 0.27039,-0.0806 0.37979,-0.135127 0.12202,-0.06082 0.23711,-0.136234 0.3504,-0.225073 0.11775,-0.09234 0.23502,-0.200397 0.35393,-0.321137 0.073,-0.07442 0.12415,-0.15362 0.15558,-0.235723 0.0325,-0.08485 0.0424,-0.168913 0.0369,-0.247957 -0.006,-0.08151 -0.0278,-0.15671 -0.0575,-0.222726 -0.009,-0.019 -0.0177,-0.03735 -0.0275,-0.05503 -0.0247,-0.04495 -0.0541,-0.08735 -0.0862,-0.126725 -0.0886,-0.108446 -0.19353,-0.188189 -0.27205,-0.234303 -0.114,-0.06696 -0.15394,-0.05786 -0.16012,-0.04955 z"
             id="path50168"
             inkscape:path-effect="#path-effect1234"
             inkscape:original-d="m 160.43291,-12.470227 c 0,0 0.77818,0.57889 0.30568,1.070978 -0.47249,0.492088 -0.81169,0.693651 -1.41329,0.67402 -0.6016,-0.01963 -0.43066,-0.894653 -0.43066,-0.894653"
             sodipodi:nodetypes="cssc" /><path
             style="fill:#000000;fill-rule:nonzero;stroke:none;stroke-width:0.264583px;stroke-linecap:butt;stroke-linejoin:miter;stroke-opacity:1"
             d="m 158.28151,-14.805727 c 0.003,0.0171 0.0438,0.04375 0.31611,0.04467 0.0331,1.12e-4 0.069,-1.07e-4 0.10793,-6.13e-4 0.12156,-0.0016 0.35696,-0.0072 0.58418,0.0014 0.22875,0.0087 0.50106,0.03269 0.72546,0.100011 0.10126,0.03038 0.18963,0.06867 0.25884,0.115902 0.0331,0.02261 0.0611,0.04674 0.0839,0.07235 0.0223,0.02501 0.0398,0.0516 0.0526,0.08009 0.0648,0.143697 0.10797,0.324418 0.11008,0.531721 0.002,0.202736 -0.0353,0.427262 -0.12689,0.660327 -0.0931,0.236878 -0.24028,0.477756 -0.45178,0.710611 -0.22409,0.246716 -0.5128,0.476163 -0.86829,0.68053 -0.35316,0.203036 -0.69327,0.355532 -1.01178,0.445279 -0.29467,0.08303 -0.55967,0.109209 -0.79428,0.08128 -0.22664,-0.02698 -0.42197,-0.104009 -0.5906,-0.225246 -0.17093,-0.122886 -0.31685,-0.293268 -0.43924,-0.505466 -0.0552,-0.09609 -0.0851,-0.196548 -0.0966,-0.299082 -0.0121,-0.107217 -0.004,-0.218772 0.0178,-0.330775 0.0233,-0.118576 0.0623,-0.23679 0.10922,-0.349859 0.0506,-0.122074 0.1106,-0.238338 0.17019,-0.342865 0.13332,-0.233847 0.30975,-0.479327 0.36954,-0.568524 0.0221,-0.03299 0.04,-0.06079 0.0546,-0.08521 0.0952,-0.159671 0.054,-0.219893 0.0369,-0.236809 -0.0157,-0.01551 -0.0834,-0.06318 -0.23686,0.06357 -0.023,0.01897 -0.0493,0.04289 -0.0789,0.0724 -0.0995,0.09887 -0.27609,0.301995 -0.44414,0.578188 -0.0686,0.112768 -0.13836,0.242286 -0.19769,0.382245 -0.0548,0.129273 -0.10233,0.271285 -0.13062,0.419608 -0.0268,0.140431 -0.0369,0.289648 -0.0175,0.440443 0.0188,0.145746 0.0651,0.292032 0.14918,0.431277 0.14765,0.243916 0.32959,0.447773 0.55066,0.596091 0.21945,0.147237 0.46824,0.23354 0.74372,0.257789 0.28234,0.02485 0.58462,-0.01609 0.90272,-0.112292 0.34378,-0.103974 0.70184,-0.271221 1.06616,-0.482987 0.37461,-0.217732 0.68485,-0.464261 0.9293,-0.734158 0.23091,-0.254947 0.39555,-0.522511 0.5009,-0.790753 0.10362,-0.263809 0.14726,-0.521692 0.14429,-0.758587 -0.003,-0.241365 -0.0545,-0.458232 -0.13685,-0.635615 -0.0252,-0.05429 -0.0583,-0.102275 -0.0971,-0.144474 -0.0393,-0.04288 -0.0843,-0.07962 -0.13226,-0.111191 -0.0988,-0.06497 -0.21415,-0.110413 -0.33105,-0.142764 -0.25783,-0.07135 -0.55514,-0.08766 -0.79017,-0.08616 -0.24981,0.0016 -0.46648,0.02328 -0.60172,0.04278 -0.0394,0.0057 -0.0758,0.0118 -0.10892,0.01812 -0.27323,0.05204 -0.30266,0.105774 -0.30098,0.116777 z"
             id="path50896"
             inkscape:path-effect="#path-effect1228"
             inkscape:original-d="m 158.28151,-14.805727 c 0,0 1.94459,-0.296425 2.24559,0.360354 0.30101,0.656779 0.12908,1.874501 -1.38726,2.75115 -1.51633,0.87665 -2.5004,0.696262 -3.04958,-0.231376 -0.54918,-0.927637 0.80908,-2.300426 0.80908,-2.300426"
             sodipodi:nodetypes="csssc" /><path
             style="fill:#000000;fill-rule:nonzero;stroke:none;stroke-width:0.264583px;stroke-linecap:butt;stroke-linejoin:miter;stroke-opacity:1"
             d="m 157.01399,-13.735184 c -0.008,0.0052 -0.0365,0.03949 0.017,0.122139 0.006,0.0094 0.0135,0.01986 0.0222,0.03116 0.0445,0.05774 0.13786,0.154233 0.30092,0.248702 0.13994,0.08107 0.33105,0.160245 0.58148,0.20697 0.25547,0.04767 0.55195,0.05768 0.88919,0.01764 0.01,-0.0011 0.0191,-0.0024 0.0286,-0.0036 0.20054,-0.02693 0.41425,-0.0875 0.63122,-0.172331 0.21559,-0.0843 0.41777,-0.186071 0.58569,-0.281639 0.28421,-0.161747 0.44525,-0.288827 0.4986,-0.340282 0.0583,-0.05628 0.05,-0.08666 0.045,-0.09416 v 0 c -0.006,-0.0082 -0.0273,-0.02631 -0.1033,0.0023 -0.0756,0.02847 -0.24929,0.119167 -0.53413,0.248383 -0.17121,0.07766 -0.36964,0.161235 -0.57714,0.230835 -0.20955,0.07029 -0.40367,0.118039 -0.58098,0.140958 -0.008,0.0011 -0.0166,0.0021 -0.025,0.0031 -0.31567,0.03705 -0.58524,0.03213 -0.81591,-0.0014 -0.22511,-0.03277 -0.39716,-0.09056 -0.52548,-0.147239 -0.14442,-0.06379 -0.24917,-0.134315 -0.29753,-0.165549 -0.0105,-0.0068 -0.0196,-0.01261 -0.028,-0.01785 -0.0712,-0.04436 -0.10043,-0.0361 -0.11239,-0.02807 z"
             id="path50898"
             inkscape:path-effect="#path-effect1230"
             inkscape:original-d="m 157.01399,-13.735184 c 0,0 0.43901,0.653493 1.79504,0.493379 0.83177,-0.09821 1.80481,-0.758809 1.80481,-0.758809"
             sodipodi:nodetypes="csc" /><path
             style="fill:#000000;fill-rule:nonzero;stroke:none;stroke-width:0.264583px;stroke-linecap:butt;stroke-linejoin:miter;stroke-opacity:1"
             d="m 156.42334,-12.543028 c -0.007,0.0035 -0.0289,0.03703 0.0237,0.151143 0.007,0.015 0.0149,0.03075 0.0241,0.04701 0.0348,0.06166 0.0954,0.152187 0.19015,0.247795 0.10114,0.102052 0.24197,0.210479 0.42818,0.28952 0.19342,0.0821 0.41532,0.123704 0.66094,0.112481 0.12215,-0.0056 0.25532,-0.02826 0.39309,-0.06228 0.13906,-0.03434 0.28439,-0.08063 0.42984,-0.133797 0.30246,-0.11057 0.60879,-0.252125 0.86802,-0.38315 0.10749,-0.05433 0.20812,-0.107466 0.29926,-0.157102 0.52977,-0.28852 0.65568,-0.420026 0.64949,-0.430955 -0.007,-0.01185 -0.27556,0.08943 -0.72138,0.284235 -0.0938,0.041 -0.19761,0.08565 -0.30691,0.131258 -0.26453,0.110385 -0.57208,0.230924 -0.86745,0.32456 -0.1422,0.04508 -0.28064,0.08364 -0.41002,0.11208 -0.12883,0.02832 -0.2454,0.04589 -0.34642,0.05086 -0.21076,0.01033 -0.39624,-0.01679 -0.56196,-0.07295 -0.16013,-0.05426 -0.28881,-0.131342 -0.38989,-0.206846 -0.0931,-0.06955 -0.16506,-0.139789 -0.20955,-0.184494 -0.0119,-0.01197 -0.0235,-0.0235 -0.0342,-0.03407 -0.0823,-0.08106 -0.10593,-0.0915 -0.11901,-0.0853 z"
             id="path50900"
             inkscape:path-effect="#path-effect1232"
             inkscape:original-d="m 156.42334,-12.543028 c 0,0 0.3607,0.761149 1.32085,0.715803 0.89187,-0.04212 2.64594,-1.03514 2.64594,-1.03514"
             sodipodi:nodetypes="csc" /></g><path
           style="fill:#000000;fill-rule:nonzero;stroke:none;stroke-width:0.264583px;stroke-linecap:butt;stroke-linejoin:miter;stroke-opacity:1"
           d="m 159.24164,-10.719795 c -0.0201,-0.0052 -0.11044,0.0024 -0.18123,0.221842 -0.0558,0.173084 -0.1233,0.535689 -0.11086,1.0484551 0.008,0.3480231 0.0589,0.7494525 0.19684,1.1332889 0.0687,0.1910984 0.15752,0.3735705 0.27011,0.5419966 0.11877,0.1776597 0.25998,0.3337501 0.42408,0.4671989 0.16594,0.1349365 0.35287,0.2381511 0.55929,0.3106759 0.1956,0.068721 0.40241,0.1076722 0.61491,0.1226812 0.42658,0.03013 0.85886,-0.03754 1.22755,-0.1328103 0.42722,-0.1103966 0.77295,-0.2580902 0.95949,-0.3547927 0.0509,-0.026379 0.0938,-0.050816 0.12909,-0.073055 0.21863,-0.1376274 0.20642,-0.2290051 0.19631,-0.2470816 v 0 c -0.013,-0.02327 -0.0748,-0.068535 -0.30922,0.0078 -0.0384,0.012508 -0.0823,0.02826 -0.13405,0.047549 -0.17516,0.065283 -0.53445,0.2103562 -0.92217,0.3163113 -0.34848,0.095232 -0.74485,0.1676267 -1.13053,0.1508699 -0.19113,-0.0083 -0.37378,-0.038274 -0.54386,-0.094213 -0.17903,-0.058883 -0.33941,-0.144988 -0.47987,-0.2592137 -0.1423,-0.1157124 -0.26346,-0.2531121 -0.36409,-0.4105098 -0.0955,-0.149443 -0.17013,-0.3130912 -0.22692,-0.4864182 -0.11453,-0.349521 -0.15028,-0.7185754 -0.15322,-1.045579 -0.004,-0.4795783 0.0517,-0.8239084 0.0576,-0.9966924 0.007,-0.217451 -0.0536,-0.261685 -0.0792,-0.268306 z"
           id="path50902"
           inkscape:path-effect="#path-effect1248"
           inkscape:original-d="m 159.24164,-10.719795 c 0,0 -0.58805,2.2770129 0.68241,3.3101433 1.27045,1.0331305 3.60317,-0.2717443 3.60317,-0.2717443"
           sodipodi:nodetypes="csc" /></g><g
         id="g5411"
         inkscape:label="right leg"><path
           style="fill:#000000;fill-rule:nonzero;stroke:none;stroke-width:0.264583px;stroke-linecap:butt;stroke-linejoin:miter;stroke-opacity:1"
           d="m 162.65106,5.5192418 c 0.003,-0.015688 -0.0411,-0.1216201 -0.48814,-0.1891305 -0.0721,-0.010885 -0.15825,-0.02121 -0.258,-0.029634 -0.36259,-0.030621 -1.0278,-0.045103 -1.77847,0.1025454 -0.65244,0.1283301 -1.38002,0.3817245 -2.01593,0.8672444 -0.31634,0.241526 -0.60137,0.5339107 -0.84269,0.8844023 -0.25311,0.3676016 -0.44946,0.7864706 -0.5875,1.2561965 0,-1.3e-6 -0.002,0.00648 -0.002,0.00648 -0.26953,0.921712 -0.33341,1.7373496 -0.20796,2.4562976 0.12162,0.696998 0.41045,1.240059 0.7513,1.663166 0.39,0.484127 0.84968,0.810942 1.16818,1.003732 0.0853,0.05162 0.1651,0.09638 0.23668,0.134107 0.12262,0.06463 0.23879,0.116708 0.34151,0.158514 0.2461,0.100162 0.41682,0.145607 0.49622,0.175155 -0.0857,-0.07599 -0.16794,-0.159699 -0.40194,-0.339666 -0.0882,-0.06783 -0.1865,-0.140295 -0.2971,-0.219323 -0.0622,-0.04446 -0.13766,-0.09807 -0.21331,-0.153092 -0.28896,-0.210179 -0.71006,-0.530955 -1.06125,-0.974374 -0.30631,-0.386751 -0.56905,-0.875698 -0.68275,-1.507975 -0.11778,-0.654921 -0.0673,-1.4177786 0.19148,-2.3026611 0,-1.8e-6 0.002,-0.00605 0.002,-0.00605 0.12885,-0.4384805 0.3117,-0.823951 0.5441,-1.1586422 0.22151,-0.3190086 0.48268,-0.5841947 0.77254,-0.8034137 0.58391,-0.4416109 1.25782,-0.6766453 1.87608,-0.8024881 0.70219,-0.1429258 1.3546,-0.1473167 1.69834,-0.1472499 0.013,2.5e-6 0.26359,5.567e-4 0.25055,5.542e-4 0.43489,-3.503e-4 0.5026,-0.043412 0.50819,-0.074692 z"
           id="path50904"
           inkscape:path-effect="#path-effect1283"
           inkscape:original-d="m 162.65106,5.5192418 c 0,0 -4.70488,-0.8414564 -5.8121,2.9450426 -1.10814,3.7896426 1.61248,4.9358136 2.6254,5.5440316"
           sodipodi:nodetypes="csc" /><path
           style="fill:#e8e8e8;fill-opacity:1;stroke:none;stroke-width:0.264583px;stroke-linecap:butt;stroke-linejoin:miter;stroke-opacity:1"
           d="m 161.63041,15.265306 0.0841,-0.364045 -0.0757,-0.533728 -0.36506,-0.458669 -0.6138,-0.339013 -0.52946,-0.0254 -0.67268,0.328057 -0.29162,0.426794 -0.0537,0.420288 0.22306,0.548042 0.34204,0.390837 0.55461,0.257093 0.73554,0.0037 -0.66576,1.301382 -0.29315,0.987213 -0.20312,1.100805 0.15764,1.61345 0.34066,1.433314 0.44407,0.699334 0.46519,0.171598 0.71666,-0.315574 0.78152,-0.883939 0.62371,-1.251656 0.32741,-0.932357 0.007,-0.552038 -0.12729,-0.700465 -0.44554,-1.185723 -0.69856,-1.260702 z"
           id="path4876" /><path
           style="fill:#000000;fill-rule:nonzero;stroke:none;stroke-width:0.264583px;stroke-linecap:butt;stroke-linejoin:miter;stroke-opacity:1"
           d="m 161.00171,15.867845 c -0.007,-0.01518 -0.0366,-0.01559 -0.17185,-0.01093 -0.0949,0.0033 -0.22492,0.0058 -0.37378,-0.01668 -0.0682,-0.01029 -0.13647,-0.0252 -0.20537,-0.04567 -0.0816,-0.02425 -0.1702,-0.05859 -0.26224,-0.109283 -0.15809,-0.08708 -0.33505,-0.227102 -0.50782,-0.462514 -0.08,-0.10891 -0.13302,-0.219451 -0.16339,-0.328623 -0.0302,-0.108754 -0.0383,-0.217215 -0.0272,-0.322482 0.0226,-0.215316 0.12525,-0.416166 0.27838,-0.572632 0.15523,-0.158619 0.36316,-0.27352 0.59441,-0.314858 0.11504,-0.02056 0.23531,-0.02286 0.35766,-0.0037 0.12325,0.01928 0.24891,0.06038 0.37389,0.126904 0.26476,0.140974 0.42685,0.299051 0.52952,0.44733 0.0423,0.06111 0.0754,0.12184 0.1016,0.180854 0.0396,0.0893 0.0664,0.180338 0.0827,0.273039 0.0263,0.149831 0.0216,0.284784 0.0147,0.38131 -0.009,0.130478 -0.0111,0.170164 -0.003,0.173769 0.005,0.0022 0.0443,-0.01244 0.10052,-0.150443 0.0388,-0.09527 0.0791,-0.243326 0.077,-0.421011 -0.001,-0.110385 -0.0191,-0.225135 -0.058,-0.339206 -0.0258,-0.07555 -0.0616,-0.153545 -0.11005,-0.231858 -0.11901,-0.19249 -0.31157,-0.382992 -0.61067,-0.544789 -0.14993,-0.08109 -0.30377,-0.132319 -0.4571,-0.156382 -0.15204,-0.02386 -0.30194,-0.02075 -0.44508,0.0051 -0.28688,0.05182 -0.54282,0.194138 -0.73598,0.387926 -0.18997,0.190591 -0.33036,0.441594 -0.36807,0.725027 -0.0185,0.139112 -0.0119,0.284115 0.025,0.429933 0.037,0.146459 0.10381,0.291019 0.20254,0.42912 0.19519,0.273179 0.40686,0.44555 0.61114,0.549367 0.11769,0.05981 0.23156,0.09615 0.33632,0.116077 0.0879,0.01672 0.17444,0.02249 0.25729,0.01948 0.1801,-0.0066 0.32564,-0.0537 0.41811,-0.09841 0.13272,-0.06417 0.14256,-0.1085 0.13914,-0.115763 z"
           id="path50906"
           inkscape:path-effect="#path-effect1285"
           inkscape:original-d="m 161.00171,15.867845 c 0,0 -0.92333,0.434721 -1.64153,-0.557911 -0.71819,-0.992635 0.49054,-2.211766 1.59622,-1.61807 1.10567,0.593696 0.6633,1.571805 0.6633,1.571805"
           sodipodi:nodetypes="cssc" /><path
           style="fill:#000000;fill-rule:nonzero;stroke:none;stroke-width:0.264583px;stroke-linecap:butt;stroke-linejoin:miter;stroke-opacity:1"
           d="m 161.0977,15.777699 c -0.0138,-0.0095 -0.12702,0.02661 -0.41593,0.499919 -0.10094,0.165377 -0.24749,0.426474 -0.39956,0.76086 -0.15778,0.346924 -0.34105,0.816067 -0.46392,1.345692 -0.10797,0.465392 -0.17445,0.999549 -0.12148,1.547017 0.0479,0.496207 0.10625,0.961175 0.18128,1.375948 0.0733,0.405413 0.16251,0.762673 0.27438,1.061318 0.0562,0.1501 0.11842,0.286028 0.1877,0.406508 0.0704,0.122358 0.14842,0.229464 0.23557,0.319444 0.0897,0.09258 0.18836,0.166414 0.29661,0.219684 0.11264,0.05543 0.23154,0.08658 0.35485,0.09583 0.008,6.04e-4 0.0162,0.001 0.0243,0.0013 0.0664,0.0022 0.1333,-0.0066 0.19976,-0.02404 0.0721,-0.01891 0.1445,-0.04824 0.21671,-0.08586 0.1385,-0.07217 0.28157,-0.177737 0.42588,-0.309107 0.1393,-0.126806 0.28165,-0.279401 0.42297,-0.451943 0.13782,-0.168272 0.27465,-0.355511 0.40583,-0.555244 0.25814,-0.393031 0.49297,-0.832316 0.6654,-1.260047 0.0863,-0.214112 0.15694,-0.425193 0.207,-0.62611 0.0507,-0.20353 0.0808,-0.398565 0.0841,-0.577583 0.003,-0.181455 -0.0178,-0.377681 -0.0554,-0.577972 -0.0391,-0.208678 -0.0967,-0.425265 -0.1658,-0.64015 -0.15239,-0.473945 -0.36118,-0.942109 -0.57037,-1.338684 -0.27129,-0.51433 -0.54324,-0.909015 -0.75579,-1.164919 -0.0583,-0.0702 -0.11245,-0.130582 -0.16199,-0.182104 -0.0901,-0.09371 -0.17397,-0.166081 -0.24945,-0.221863 -0.19789,-0.146235 -0.34024,-0.179891 -0.40586,-0.198858 0.0534,0.0476 0.13588,0.152101 0.26968,0.335642 0.0507,0.06957 0.11226,0.15533 0.18205,0.254072 0.0387,0.05481 0.0825,0.117702 0.13078,0.1894 0.17538,0.260662 0.41544,0.647622 0.6648,1.154721 0.19105,0.388524 0.38324,0.84046 0.52267,1.290549 0.0632,0.203868 0.11462,0.404819 0.14904,0.594279 0.0332,0.182736 0.0498,0.351161 0.0469,0.498314 -0.003,0.141571 -0.0268,0.306111 -0.0719,0.489385 -0.0444,0.180089 -0.10802,0.373834 -0.18792,0.574746 -0.15988,0.402035 -0.37962,0.819894 -0.6226,1.19559 -0.12315,0.190426 -0.25076,0.367681 -0.37805,0.525665 -0.13075,0.162289 -0.25932,0.301954 -0.38139,0.415113 -0.12747,0.118161 -0.24331,0.203218 -0.34435,0.257157 -0.0521,0.02783 -0.0983,0.0463 -0.13853,0.05731 -0.0369,0.01009 -0.0677,0.01361 -0.0931,0.01303 -0.003,-7.1e-5 -0.006,-2.03e-4 -0.009,-3.92e-4 -0.0784,-0.0052 -0.15154,-0.02386 -0.22069,-0.05695 -0.0668,-0.03198 -0.13271,-0.07876 -0.1974,-0.144005 -0.0633,-0.06386 -0.12515,-0.145058 -0.18487,-0.246133 -0.0588,-0.09953 -0.11453,-0.216534 -0.1671,-0.351924 -0.10506,-0.270588 -0.19369,-0.604564 -0.27002,-0.997997 -0.0779,-0.401476 -0.14121,-0.855693 -0.19579,-1.34643 -0.0561,-0.502635 -0.004,-1.002673 0.0892,-1.450017 0.10592,-0.507324 0.26937,-0.965707 0.40855,-1.309016 0.13116,-0.323522 0.26426,-0.601059 0.34318,-0.764791 0.2355,-0.488625 0.25289,-0.586861 0.23904,-0.596349 z"
           id="path50908"
           inkscape:path-effect="#path-effect1287"
           inkscape:original-d="m 161.0977,15.777699 c 0,0 -1.45014,2.116949 -1.24044,4.136831 0.20971,2.019885 0.55788,3.25201 1.38313,3.311081 0.82525,0.05907 2.41488,-2.413389 2.43947,-3.708114 0.0246,-1.294726 -1.31643,-3.851618 -2.1653,-4.320764"
           sodipodi:nodetypes="csssc" /></g><g
         id="g5405"
         inkscape:label="left leg"><path
           style="fill:#000000;fill-rule:nonzero;stroke:none;stroke-width:0.264583px;stroke-linecap:butt;stroke-linejoin:miter;stroke-opacity:1"
           d="m 169.43112,8.2278844 v 0 c -0.003,-0.00347 -0.1242,-0.033228 -0.52864,0.3406368 -0.23799,0.2200076 -0.70043,0.7066099 -1.15278,1.4760928 -0.36373,0.618727 -0.72812,1.433394 -0.95013,2.449202 -0.22606,1.034287 -0.28734,2.19781 -0.11991,3.491995 0.29372,2.273644 0.99408,3.886967 1.69296,4.957616 0.46506,0.712432 0.86621,1.090275 1.0365,1.221428 0.24378,0.187752 0.3283,0.13119 0.33836,0.117363 0.017,-0.02335 0.0296,-0.09185 -0.15669,-0.309721 -0.0961,-0.112421 -0.53067,-0.566826 -0.95289,-1.203575 -0.67859,-1.023371 -1.40057,-2.582213 -1.69588,-4.817383 -0.1669,-1.265 -0.10534,-2.398486 0.11438,-3.401526 0.21584,-0.985329 0.56884,-1.77419 0.91626,-2.375423 0.42556,-0.7364396 0.8741,-1.2394823 1.07445,-1.4636241 0.32765,-0.3665671 0.39404,-0.469456 0.38401,-0.4830815 z"
           id="path50910"
           sodipodi:nodetypes="csc"
           inkscape:path-effect="#path-effect1277"
           inkscape:original-d="m 169.43112,8.2278844 c 0,0 -3.31308,2.4376506 -2.62028,7.7407906 0.60294,4.615275 2.93664,6.313543 2.93664,6.313543" /><path
           style="fill:#e8e8e8;fill-opacity:1;stroke:none;stroke-width:0.264583px;stroke-linecap:butt;stroke-linejoin:miter;stroke-opacity:1"
           d="m 170.11545,24.684632 -0.47794,-0.33518 -0.52664,-0.764579 0.0343,-0.556118 0.23662,-0.593878 0.42053,-0.244848 0.63315,0.01445 0.84659,0.281144 0.3371,0.38414 0.0673,0.923894 -0.0316,0.446815 0.95104,0.962474 0.57784,1.197817 0.31031,0.79996 -0.0554,0.677764 -0.54634,1.327693 -0.8128,1.237265 -0.68838,0.697286 -0.592,0.272002 -0.39671,-0.224917 -0.37244,-0.717627 -0.38373,-1.994804 -0.0256,-1.149679 0.23703,-1.649383 z"
           id="path4736" /><path
           style="fill:#000000;fill-rule:nonzero;stroke:none;stroke-width:0.264583px;stroke-linecap:butt;stroke-linejoin:miter;stroke-opacity:1"
           d="m 170.17605,24.703744 c 0.008,-0.02045 0.0234,-0.09443 -0.0817,-0.186045 -0.0166,-0.01444 -0.0363,-0.03013 -0.0603,-0.04833 -0.0729,-0.05538 -0.24881,-0.177123 -0.39757,-0.325596 -0.0655,-0.06534 -0.13168,-0.141 -0.19026,-0.227132 -0.0549,-0.08071 -0.10343,-0.171149 -0.13841,-0.271801 -0.0336,-0.09662 -0.0552,-0.204009 -0.0572,-0.323152 -0.002,-0.116913 0.0148,-0.246714 0.0589,-0.390174 0.043,-0.139871 0.10296,-0.248667 0.17333,-0.333043 0.0712,-0.08543 0.15514,-0.148205 0.24756,-0.192806 0.0958,-0.04623 0.20136,-0.07318 0.31138,-0.08449 0.11613,-0.01195 0.23541,-0.0063 0.35071,0.01129 0.22715,0.03462 0.465,0.119871 0.66728,0.2357 0.094,0.0538 0.17566,0.111723 0.23973,0.168911 0.0315,0.02814 0.0579,0.05535 0.079,0.08092 0.0212,0.02563 0.0359,0.04831 0.0453,0.06724 0.0238,0.04701 0.0431,0.103312 0.0581,0.167757 0.0152,0.06559 0.0253,0.137106 0.0315,0.211672 0.0132,0.160087 0.008,0.328 -5.3e-4,0.468975 -0.0142,0.242469 -0.0312,0.367748 -0.0193,0.454611 0.0143,0.104367 0.0883,0.128977 0.10984,0.133532 v 0 c 0.0211,0.0044 0.10169,0.01158 0.15103,-0.08938 0.036,-0.0737 0.0731,-0.23135 0.0914,-0.476426 0.0113,-0.151151 0.0141,-0.339387 -0.008,-0.524862 -0.0105,-0.08675 -0.0268,-0.174614 -0.0511,-0.258622 -0.0238,-0.08225 -0.0558,-0.162492 -0.099,-0.234943 -0.0239,-0.04048 -0.0539,-0.079 -0.0873,-0.115188 -0.0336,-0.03642 -0.072,-0.07178 -0.11352,-0.10567 -0.0841,-0.06856 -0.18429,-0.133415 -0.29295,-0.191285 -0.23318,-0.124193 -0.50178,-0.214957 -0.76119,-0.254498 -0.13207,-0.02013 -0.27329,-0.02886 -0.41537,-0.01684 -0.13467,0.01139 -0.27203,0.0416 -0.40276,0.09994 -0.12718,0.05676 -0.24678,0.139623 -0.34977,0.255132 -0.10162,0.113964 -0.18402,0.256304 -0.24235,0.429334 -0.0575,0.170405 -0.0844,0.331552 -0.0864,0.483191 -0.002,0.154681 0.0218,0.296697 0.0627,0.425491 0.0425,0.133661 0.10304,0.25183 0.17096,0.354671 0.0723,0.109421 0.15367,0.202602 0.2328,0.279717 0.18951,0.184672 0.38092,0.293248 0.48647,0.339437 0.0309,0.01351 0.058,0.02342 0.0813,0.03028 0.15249,0.0448 0.19882,-0.02958 0.20604,-0.04751 z"
           id="path50912"
           inkscape:path-effect="#path-effect1279"
           inkscape:original-d="m 170.17605,24.703744 c 0,0 -1.41452,-0.569985 -1.01023,-1.818753 0.40429,-1.248767 2.12342,-0.548864 2.38976,-0.07361 0.26634,0.475255 0.0478,1.51039 0.0478,1.51039"
           sodipodi:nodetypes="cssc" /><path
           style="fill:#000000;fill-rule:nonzero;stroke:none;stroke-width:0.264583px;stroke-linecap:butt;stroke-linejoin:miter;stroke-opacity:1"
           d="m 170.14939,24.678759 c -0.0188,-0.0062 -0.10233,-0.01735 -0.19719,0.194453 -0.0604,0.134888 -0.17585,0.476086 -0.29127,1.024598 -0.0698,0.331727 -0.14336,0.762649 -0.18067,1.227062 -0.0333,0.41499 -0.039,0.872198 0.02,1.311516 0.0543,0.404108 0.11779,0.809136 0.19485,1.183738 0.0762,0.370536 0.16537,0.709743 0.27261,0.994556 0.0543,0.144272 0.11336,0.274801 0.17796,0.3889 0.066,0.116589 0.13847,0.217165 0.21872,0.298036 0.0834,0.08404 0.17569,0.147229 0.27762,0.18422 0.0526,0.01911 0.10673,0.0308 0.16196,0.03514 0.0568,0.0045 0.1138,0.0011 0.17057,-0.0093 0.062,-0.01128 0.12568,-0.03475 0.18981,-0.06673 0.0626,-0.0312 0.12794,-0.07171 0.19553,-0.120203 0.13046,-0.09358 0.27298,-0.219679 0.4226,-0.372309 0.14468,-0.147592 0.29643,-0.320475 0.44921,-0.51208 0.14932,-0.187255 0.29926,-0.391951 0.44311,-0.606417 0.28375,-0.423016 0.54237,-0.881906 0.72085,-1.310221 0.0895,-0.214831 0.15932,-0.423006 0.20194,-0.616254 0.0216,-0.09775 0.0364,-0.192529 0.0431,-0.28314 0.007,-0.09148 0.005,-0.179904 -0.006,-0.263615 -0.0416,-0.307634 -0.132,-0.627195 -0.24753,-0.929819 -0.13022,-0.341134 -0.29133,-0.658793 -0.45612,-0.930557 -0.21447,-0.353708 -0.42903,-0.620702 -0.60777,-0.80341 -0.0487,-0.04981 -0.0946,-0.09323 -0.13717,-0.130608 -0.2818,-0.247753 -0.50387,-0.300479 -0.60022,-0.335738 0.0659,0.06575 0.20082,0.254342 0.40872,0.518304 0.0326,0.04145 0.0692,0.08797 0.10889,0.139572 0.14554,0.189371 0.33403,0.449532 0.53006,0.78825 0.15082,0.260589 0.30171,0.560724 0.42623,0.880392 0.11073,0.284276 0.19761,0.576863 0.24101,0.852268 0.009,0.0559 0.0119,0.120307 0.008,0.193372 -0.004,0.07222 -0.0143,0.151428 -0.0315,0.237119 -0.0341,0.170035 -0.0934,0.360545 -0.17444,0.564718 -0.16162,0.407406 -0.4025,0.852263 -0.67255,1.267949 -0.13642,0.209996 -0.27885,0.410356 -0.42062,0.593304 -0.14516,0.187315 -0.28843,0.354845 -0.4237,0.496418 -0.14047,0.147012 -0.26967,0.263274 -0.38285,0.346227 -0.0585,0.04285 -0.11122,0.07576 -0.15794,0.09947 -0.0484,0.02458 -0.0876,0.03789 -0.11806,0.04343 -0.0357,0.0065 -0.0694,0.0081 -0.10142,0.0052 -0.031,-0.0028 -0.0612,-0.0098 -0.0909,-0.02119 -0.0572,-0.02201 -0.11542,-0.06168 -0.17426,-0.124225 -0.0571,-0.06071 -0.11319,-0.141363 -0.16753,-0.243677 -0.053,-0.09985 -0.10301,-0.217674 -0.15001,-0.352744 -0.093,-0.267368 -0.17084,-0.591835 -0.23777,-0.955179 -0.0675,-0.366493 -0.12254,-0.764758 -0.17033,-1.165685 -0.0486,-0.408812 -0.0392,-0.840276 -0.005,-1.240061 0.0381,-0.44528 0.10824,-0.864415 0.17007,-1.187938 0.10368,-0.542488 0.18427,-0.858974 0.20642,-1.019374 0.0309,-0.223504 -0.0353,-0.260629 -0.057,-0.267791 z"
           id="path50914"
           inkscape:path-effect="#path-effect1281"
           inkscape:original-d="m 170.14939,24.678759 c 0,0 -0.68987,2.096155 -0.4818,3.736397 0.20808,1.640245 0.53159,3.103165 1.28324,2.9664 0.75166,-0.136766 2.68061,-2.873194 2.51693,-3.99649 -0.16368,-1.123294 -1.03688,-2.615934 -1.88186,-3.154459"
           sodipodi:nodetypes="csssc" /></g><g
         id="g5399"
         inkscape:label="body"><path
           style="fill:#aa430f;fill-opacity:1;stroke:none;stroke-width:0.264583px;stroke-linecap:butt;stroke-linejoin:miter;stroke-opacity:1"
           d="m 175.02351,-12.605743 -0.0473,-1.068266 -0.16172,-1.119952 -0.43243,-1.105813 -0.88493,-1.037188 -1.10115,-0.390079 -1.03692,0.136918 -0.94629,0.630769 -0.57975,0.8922 -0.58235,1.582192 -0.35873,2.132264 -0.19121,1.626941 -0.4645,2.3053959 -0.87313,3.6080827 -0.65445,2.1155244 -0.74574,1.92045139 -0.35233,1.12988909 -0.16893,1.33536692 0.0703,1.311222 0.24189,1.0385901 0.55974,0.8413803 0.77496,0.4508368 0.74335,-0.014817 0.3754,-0.1520587 -0.41902,-1.2425971 0.0596,-1.6785616 0.57588,-1.7860671 0.85926,-1.65355189 0.97836,-1.23192721 0.99217,-1.2286594 0.2497,-1.4223986 0.45043,-1.8823041 0.32319,-2.0527009 0.59696,-1.899844 0.7168,-1.26634 0.78469,-0.647108 z"
           id="path3693" /><path
           style="fill:#ffcf00;fill-opacity:1;fill-rule:nonzero;stroke:none;stroke-width:0.264583px;stroke-linecap:butt;stroke-linejoin:miter;stroke-opacity:1"
           d="m 171.3421,-7.905143 v 0 c -0.004,-0.018802 -0.0367,-0.093688 -0.25883,-0.068349 -0.0331,0.00377 -0.0724,0.0097 -0.11858,0.018262 -0.15544,0.028808 -0.44203,0.098823 -0.78061,0.2216481 -0.25395,0.092124 -0.57028,0.2266196 -0.8328,0.3993594 -0.11897,0.078282 -0.23512,0.1697663 -0.32943,0.2750192 -0.0458,0.051095 -0.0879,0.1070757 -0.12277,0.1680887 -0.0342,0.059877 -0.062,0.1255005 -0.0788,0.1965498 -0.0165,0.069646 -0.0216,0.1397361 -0.0168,0.2093624 0.005,0.068151 0.0187,0.1346195 0.0394,0.1985793 0.0403,0.1244412 0.10681,0.2426805 0.18424,0.3536806 0.0762,0.1092822 0.16657,0.2164993 0.26082,0.3207975 0.0929,0.1028057 0.19249,0.2059029 0.28752,0.3057938 0.0955,0.1003551 0.18622,0.1973724 0.26712,0.293089 0.081,0.09587 0.14814,0.1857444 0.19804,0.2708324 0.0503,0.085724 0.0788,0.1593226 0.0897,0.2228404 0.005,0.03145 0.007,0.060364 0.004,0.087492 -0.003,0.027181 -0.009,0.054651 -0.0204,0.083108 -0.0262,0.065276 -0.0663,0.1218286 -0.12018,0.1733919 -0.0562,0.053804 -0.12804,0.1025558 -0.21474,0.1478592 -0.0896,0.046792 -0.19102,0.087857 -0.29991,0.1261546 -0.11307,0.039766 -0.23349,0.076301 -0.35201,0.112086 -0.11876,0.035851 -0.24815,0.074653 -0.37084,0.1169704 -0.11974,0.041297 -0.24421,0.089605 -0.36114,0.1491135 -0.11311,0.057562 -0.22557,0.1287693 -0.32339,0.2204653 -0.0965,0.090438 -0.17892,0.2010318 -0.23312,0.3368986 -0.0286,0.071648 -0.0452,0.1451286 -0.0514,0.2192664 -0.006,0.073344 -0.002,0.1457671 0.01,0.2162725 0.0233,0.1387894 0.0766,0.272923 0.14256,0.398516 0.0659,0.1253957 0.14792,0.248665 0.23476,0.3668004 0.087,0.1182884 0.18155,0.2351826 0.27297,0.3462614 0.094,0.1142031 0.1815,0.2185523 0.26327,0.3217826 0.0822,0.10377743 0.15102,0.19710267 0.20372,0.28199891 0.0265,0.0426314 0.0476,0.0812 0.0639,0.11606529 0.0165,0.0353732 0.027,0.0648281 0.0332,0.0890782 0.006,0.0243472 0.008,0.0416073 0.007,0.0532115 -2.1e-4,0.0109543 -0.002,0.0193353 -0.005,0.0266054 -0.005,0.0107909 -0.0109,0.0207241 -0.0207,0.0309205 -0.0104,0.0108844 -0.0259,0.0230764 -0.049,0.0360299 -0.0238,0.0133367 -0.0537,0.0263444 -0.0906,0.0390829 -0.0378,0.0130544 -0.0807,0.025055 -0.12872,0.0367279 -0.0996,0.024217 -0.21947,0.0465518 -0.34202,0.0722427 -0.13719,0.0287594 -0.27417,0.060939 -0.41431,0.10575347 -0.15835,0.0506342 -0.30608,0.11290603 -0.44517,0.19158222 -0.16977,0.0960325 -0.31155,0.2081304 -0.43032,0.32926505 -0.059,0.0602028 -0.11076,0.12101238 -0.15583,0.18035982 -0.083,0.10933309 -0.14881,0.22237283 -0.20141,0.33181892 -0.13919,0.28963496 -0.19469,0.57618386 -0.22903,0.72408976 0.0646,-0.1432668 0.20352,-0.3868201 0.39283,-0.62166255 0.0709,-0.087924 0.14934,-0.17542935 0.23636,-0.25959982 0.0472,-0.0456902 0.0988,-0.0917727 0.15552,-0.1368133 0.11385,-0.0904411 0.24163,-0.17140811 0.39033,-0.23897272 0.1218,-0.0553438 0.25054,-0.0985525 0.39124,-0.13310765 0.12535,-0.0307878 0.24926,-0.0521985 0.38211,-0.0721948 0.11131,-0.01675446 0.24822,-0.03499881 0.35866,-0.05577005 0.056,-0.01052303 0.11302,-0.02299961 0.1683,-0.03880475 0.0537,-0.01536411 0.10871,-0.03469667 0.16162,-0.06026812 0.0518,-0.02505708 0.10378,-0.05711468 0.15136,-0.09924019 0.0471,-0.0416956 0.0885,-0.0920527 0.12088,-0.15237008 0.0335,-0.0624552 0.0526,-0.1289469 0.0591,-0.19708046 0.006,-0.0663316 5.8e-4,-0.13143254 -0.0127,-0.19346874 -0.0131,-0.0610205 -0.0337,-0.12062418 -0.0588,-0.17802796 -0.0248,-0.056837 -0.0548,-0.11328621 -0.0879,-0.16890021 -0.065,-0.1092583 -0.14555,-0.2205966 -0.2311,-0.3312424 -0.0845,-0.1092581 -0.17682,-0.2215733 -0.2663,-0.3320919 -0.0897,-0.1108394 -0.17671,-0.219983 -0.25495,-0.3277088 -0.0784,-0.1078883 -0.14486,-0.2101734 -0.19509,-0.3067296 -0.0507,-0.097572 -0.081,-0.181864 -0.0928,-0.2540371 -0.006,-0.035716 -0.007,-0.067296 -0.005,-0.09572 0.002,-0.02827 0.009,-0.05457 0.0187,-0.079781 0.0242,-0.060546 0.062,-0.1135711 0.11431,-0.1626018 0.0547,-0.051277 0.12529,-0.098171 0.21152,-0.1421407 0.089,-0.045383 0.19019,-0.085412 0.29913,-0.123066 0.1119,-0.038683 0.23146,-0.074659 0.34915,-0.1101886 0.12045,-0.036362 0.25122,-0.075868 0.37616,-0.1197078 0.12056,-0.042303 0.24583,-0.092045 0.36377,-0.1535551 0.11415,-0.059527 0.22728,-0.1330428 0.32584,-0.2272967 0.0971,-0.092873 0.17995,-0.2057869 0.23521,-0.3436786 0.0287,-0.071736 0.0463,-0.145037 0.0531,-0.2192263 0.007,-0.073512 0.003,-0.1456827 -0.01,-0.2157827 -0.0243,-0.1381698 -0.0809,-0.2672343 -0.15083,-0.3852618 -0.0697,-0.1175674 -0.15635,-0.2304355 -0.24774,-0.3372304 -0.0915,-0.1069458 -0.19151,-0.2121169 -0.28851,-0.3124022 -0.0998,-0.1032158 -0.19358,-0.1983579 -0.28261,-0.2945926 -0.0894,-0.096647 -0.16652,-0.1864493 -0.22844,-0.2719516 -0.0634,-0.087578 -0.10533,-0.1631107 -0.1288,-0.2288983 -0.0117,-0.032869 -0.0184,-0.062048 -0.0212,-0.088105 -0.003,-0.026184 -0.002,-0.05049 0.002,-0.073833 0.004,-0.02364 0.0133,-0.049896 0.0283,-0.079023 0.0154,-0.029866 0.0366,-0.061773 0.0644,-0.095432 0.0583,-0.070655 0.13936,-0.1422588 0.23716,-0.2126957 0.21636,-0.155833 0.49463,-0.2919621 0.73315,-0.3966567 0.31671,-0.1390139 0.57001,-0.2301486 0.72229,-0.2930277 0.0423,-0.017467 0.0773,-0.032652 0.10683,-0.046465 0.19636,-0.091885 0.19271,-0.1642862 0.18742,-0.1864134 z"
           id="path50965"
           inkscape:path-effect="#path-effect1250"
           inkscape:original-d="m 171.3421,-7.905143 c 0,0 -2.13251,0.5099066 -2.30069,1.2601469 -0.16817,0.7502403 1.6207,1.5817382 1.29793,2.3864276 -0.32277,0.8046897 -1.96456,0.6046712 -2.27521,1.3825875 -0.31065,0.7779165 1.44399,1.88676635 1.15098,2.45032328 -0.29301,0.5635572 -1.98863,-0.15546307 -2.70815,1.97333852"
           sodipodi:nodetypes="cssssc" /><path
           style="fill:#d09151;fill-opacity:1;stroke:none;stroke-width:0.264583px;stroke-linecap:butt;stroke-linejoin:miter;stroke-opacity:1"
           d="m 175.11411,-12.580945 0.5795,-0.03502 0.77671,0.261841 0.87476,0.518559 0.84219,0.760751 0.48083,0.964049 0.15317,1.4701333 -0.11303,1.7186524 -0.33874,2.331798 -0.81671,4.05200958 -0.75117,3.98740782 -0.23934,1.2817607 -0.50983,1.2686162 -1.04919,1.2032139 -0.95951,0.6580981 -0.92123,0.4002246 -1.19225,0.2219669 -1.12449,0.00476 -1.06697,-0.1701509 -1.32774,-0.5207873 -1.1072,-0.4850077 -0.68398,-0.324485 -1.02322,-0.1967918 -1.02206,-0.3484985 -1.28314,-0.5789719 -1.48194,-1.0560526 -1.22455,-1.5229284 -0.55131,-1.5708683 -0.0393,-1.58231966 0.58437,-1.94859304 0.96863,-1.6854598 0.91233,-1.1847676 0.9325,-1.2100293 0.16962,-1.5944371 0.31401,-2.6712076 0.53883,-1.714865 0.76806,-0.94302 1.09205,-0.722792 1.37287,-0.191134 1.44862,0.307285 -0.30978,2.458776 -0.6238,3.2911696 -0.54484,2.332288 -0.72868,2.5002995 -0.63034,1.7432459 -0.67369,2.2185873 -0.12912,1.7692658 0.38793,1.8397035 0.72341,0.7054162 0.81435,0.2705285 0.91148,-0.060994 -0.40517,-1.215464 -0.0736,-1.6696426 0.6626,-1.89971833 0.67819,-1.40414902 1.38611,-1.74823595 0.71473,-1.1638272 0.45511,-2.0160916 0.77283,-3.6302217 0.43132,-1.4449149 0.69971,-1.203347 0.74266,-0.688886 z"
           id="path3764" /><path
           style="fill:#000000;fill-rule:nonzero;stroke:none;stroke-width:0.249911px;stroke-linecap:butt;stroke-linejoin:miter;stroke-opacity:1"
           d="m 169.15516,-13.366568 c 0.005,-0.01323 0.0308,-0.09365 -0.19706,-0.197067 -0.11473,-0.05206 -0.47706,-0.189276 -1.00867,-0.267569 -0.30606,-0.04508 -0.72161,-0.07703 -1.15194,-0.01551 -0.19055,0.02724 -0.39116,0.07381 -0.58953,0.150088 -0.18562,0.07138 -0.37241,0.169975 -0.5476,0.305894 -0.28277,0.21905 -0.55393,0.426931 -0.77143,0.624033 -0.20703,0.187625 -0.38932,0.38535 -0.54571,0.635169 -0.14634,0.233745 -0.26834,0.510326 -0.37948,0.874673 -0.10545,0.345707 -0.20204,0.771509 -0.30786,1.3359102 -0.204,1.0881285 -0.27185,1.9487546 -0.3274,2.6693261 -0.0258,0.3349084 -0.048,0.6214118 -0.0814,0.8589998 -0.0164,0.1165682 -0.0352,0.2195696 -0.058,0.3102359 -0.0225,0.089767 -0.0483,0.1651788 -0.0781,0.2284939 -0.005,0.010277 -0.0131,0.025743 -0.0262,0.046869 -0.0129,0.020805 -0.0292,0.045242 -0.0492,0.07353 -0.04,0.05659 -0.0917,0.1247565 -0.15466,0.2050194 -0.12446,0.1586984 -0.28901,0.3599739 -0.47732,0.5968726 -0.37121,0.4669665 -0.84061,1.0798428 -1.27706,1.7869889 -0.43187,0.699728 -0.83775,1.5016159 -1.08535,2.35783606 -0.12319,0.42599309 -0.20758,0.86674093 -0.23608,1.31605523 -0.0284,0.44809674 -0.001,0.90457211 0.0984,1.36294601 0.19772,0.9096146 0.60805,1.6816557 1.13755,2.3299081 0.52804,0.6464633 1.17335,1.1683992 1.84207,1.5822627 0.66971,0.4144773 1.36501,0.7218855 1.99447,0.938216 0.31586,0.1085555 0.6158,0.1944062 0.88861,0.2594859 0.27353,0.065251 0.52071,0.1098448 0.73041,0.1354746 0.0366,0.00413 0.0858,0.01578 0.14933,0.036701 0.063,0.020737 0.13577,0.049131 0.21851,0.084389 0.16647,0.070934 0.36537,0.1662034 0.59479,0.2750709 0.46303,0.2197217 1.03379,0.486705 1.6812,0.7054703 0.65662,0.2218821 1.38422,0.391373 2.1506,0.4139867 0.78174,0.023067 1.59398,-0.1070929 2.40443,-0.4788847 0.82255,-0.3773508 1.42854,-0.8551241 1.87595,-1.3503927 0.45989,-0.5090864 0.75641,-1.041253 0.94881,-1.5134999 0.199,-0.4884421 0.29175,-0.9253773 0.33569,-1.2311686 0.0397,-0.2759281 0.042,-0.4540234 0.0418,-0.5029658 0.53302,-2.75244049 1.12084,-5.7678854 1.74116,-8.9392923 0.002,-0.0016 0.0542,-0.2657913 0.11677,-0.6936315 0.0611,-0.4179929 0.13254,-0.9985404 0.16975,-1.6245313 0.0366,-0.616207 0.0408,-1.2867273 -0.0344,-1.8907572 -0.0373,-0.2997768 -0.0946,-0.5865867 -0.1787,-0.8439037 -0.0836,-0.255637 -0.19543,-0.487464 -0.34515,-0.674329 -0.25395,-0.323414 -0.58893,-0.640632 -0.96798,-0.91154 -0.37715,-0.269554 -0.80132,-0.495641 -1.23657,-0.635633 -0.43411,-0.139627 -0.88563,-0.195564 -1.31376,-0.116717 -0.21468,0.03954 -0.42281,0.11289 -0.61849,0.225847 -0.19606,0.113176 -0.37732,0.264788 -0.53908,0.458265 -0.61532,0.73559 -0.94102,1.414869 -1.13682,1.961802 -0.099,0.2766589 -0.16534,0.5211343 -0.21746,0.7180761 -0.0267,0.1010004 -0.049,0.1867654 -0.0707,0.262201 -0.0219,0.076123 -0.0412,0.1341607 -0.0601,0.1778139 -0.009,0.021524 -0.0174,0.045262 -0.025,0.069429 -0.008,0.024647 -0.0157,0.052096 -0.0237,0.081752 -0.016,0.059454 -0.0331,0.1310077 -0.0512,0.2120463 -0.0364,0.1633598 -0.0778,0.3709447 -0.12244,0.6058395 -0.0894,0.4699207 -0.19903,1.0874524 -0.30682,1.6773315 -0.11354,0.6213468 -0.22868,1.2328635 -0.33855,1.7461196 -0.0561,0.2620769 -0.10989,0.4940297 -0.16042,0.6856302 -0.0256,0.097049 -0.05,0.1825893 -0.0732,0.2557383 -0.0236,0.07436 -0.045,0.133262 -0.0639,0.1772407 -0.0391,0.090762 -0.0932,0.1846071 -0.16216,0.2854062 -0.0705,0.1031452 -0.15498,0.2114397 -0.25111,0.3283188 -0.19978,0.2428771 -0.44635,0.5193677 -0.70822,0.8454236 -0.60951,0.7588943 -1.21382,1.67805811 -1.748,2.9997791 -0.35557,0.8783858 -0.51732,1.5618013 -0.57379,2.1196462 -0.0665,0.657119 0.0119,1.1672438 0.12653,1.5718535 0.14864,0.5245112 0.39734,0.9828052 0.55623,1.2617937 0.0491,0.086293 0.0971,0.1676278 0.13955,0.2382107 0.3266,0.5428316 0.52867,0.7979848 0.63143,0.9749132 -0.0793,-0.2373446 -0.12602,-0.470043 -0.4104,-1.0915356 -0.0346,-0.07561 -0.0731,-0.1584568 -0.11449,-0.248211 -0.13292,-0.2882879 -0.34383,-0.7418842 -0.4617,-1.2252194 -0.0907,-0.3719187 -0.14993,-0.837068 -0.079,-1.4394272 0.0605,-0.5136992 0.21826,-1.1585583 0.56759,-2.0060215 0.52681,-1.27598597 1.11268,-2.15554149 1.70221,-2.8849393 0.25508,-0.3155987 0.49797,-0.5868073 0.70692,-0.8408054 0.0997,-0.1212032 0.1933,-0.2409159 0.27413,-0.3596453 0.0791,-0.116213 0.14873,-0.2353511 0.2016,-0.359673 0.0263,-0.0619 0.0523,-0.13552 0.078,-0.2176116 0.0256,-0.081745 0.0516,-0.1744266 0.0781,-0.2762188 0.0522,-0.2007546 0.1068,-0.4400411 0.16277,-0.7057417 0.1096,-0.520265 0.22375,-1.1378726 0.33498,-1.7599896 0.10759,-0.6017629 0.21105,-1.2002935 0.29866,-1.6762033 0.0431,-0.2340211 0.0821,-0.4371542 0.11569,-0.5948078 0.0167,-0.078301 0.0317,-0.1439193 0.0449,-0.1959407 0.007,-0.02588 0.0125,-0.047435 0.0177,-0.064993 0.005,-0.018251 0.009,-0.029005 0.0117,-0.035653 0.0267,-0.067003 0.0494,-0.14386 0.071,-0.2251234 0.0215,-0.080912 0.0436,-0.1729674 0.0677,-0.271043 0.048,-0.1951401 0.10742,-0.4272309 0.19715,-0.6887438 0.17619,-0.5135193 0.47462,-1.1563303 1.05198,-1.8588693 0.13441,-0.16365 0.28251,-0.289141 0.44023,-0.382316 0.15756,-0.09308 0.32679,-0.15512 0.50471,-0.189793 0.35661,-0.06949 0.74961,-0.02913 1.14776,0.09481 0.39819,0.123956 0.79392,0.329221 1.15097,0.579593 0.35867,0.251511 0.67388,0.545414 0.91173,0.842208 0.12165,0.148999 0.22023,0.343301 0.29815,0.575688 0.0781,0.232985 0.13383,0.4992759 0.17135,0.7858402 0.0757,0.5782078 0.0761,1.2287493 0.0435,1.8364552 -0.0331,0.6155609 -0.10002,1.1882036 -0.15726,1.6015621 -0.0585,0.4225747 -0.10723,0.6832589 -0.10553,0.6818763 -0.60929,3.1782951 -1.19047,6.19951154 -1.72413,8.9553166 a 0.1249555,0.1249555 49.954355 0 0 -0.002,0.026067 c -1e-4,-0.00539 0.004,0.170388 -0.0406,0.4757742 -0.0426,0.2901457 -0.13229,0.7059736 -0.32341,1.1704814 -0.18467,0.4488145 -0.46814,0.9530144 -0.90624,1.4344942 -0.4257,0.4678587 -1.00412,0.9216845 -1.79403,1.2809543 -0.76948,0.3499755 -1.53976,0.4706337 -2.28356,0.4454898 -0.73077,-0.024703 -1.42916,-0.1898744 -2.06619,-0.4088542 -0.62853,-0.2160566 -1.18442,-0.4797663 -1.64481,-0.7024468 -0.2255,-0.1090701 -0.4305,-0.2094506 -0.60306,-0.2851204 -0.0864,-0.037911 -0.16738,-0.070798 -0.24117,-0.096211 -0.0729,-0.02511 -0.14359,-0.044596 -0.20878,-0.053356 -0.1963,-0.025907 -0.43153,-0.07013 -0.69487,-0.1349711 -0.26239,-0.064604 -0.55188,-0.1494815 -0.85731,-0.2565574 -0.60933,-0.2136117 -1.28,-0.5148482 -1.92312,-0.9176004 -0.6424,-0.4022991 -1.25382,-0.9036995 -1.74943,-1.5167466 -0.49593,-0.6134455 -0.87494,-1.3373703 -1.05545,-2.1861639 -0.09,-0.4231725 -0.1135,-0.84587258 -0.0851,-1.2631994 0.0285,-0.41877161 0.10929,-0.83248981 0.22793,-1.23587727 0.23887,-0.81216223 0.63052,-1.58040663 1.05413,-2.25972713 0.4277,-0.6858675 0.8889,-1.2825027 1.25922,-1.7427643 0.18768,-0.2332579 0.35287,-0.4325185 0.48271,-0.5953005 0.065,-0.081464 0.12209,-0.1550404 0.16837,-0.2190553 0.0233,-0.032203 0.0445,-0.06298 0.063,-0.091899 0.0184,-0.02866 0.0355,-0.057698 0.0494,-0.086119 0.0457,-0.092639 0.0813,-0.1940828 0.11011,-0.3019965 0.0291,-0.1090536 0.052,-0.2272972 0.0711,-0.3530789 0.0386,-0.253432 0.0645,-0.5542505 0.0923,-0.8852042 0.0605,-0.7195084 0.13006,-1.5585254 0.33158,-2.6232099 0.10558,-0.5577288 0.19935,-0.9660318 0.29797,-1.2894088 0.1031,-0.338083 0.20995,-0.577117 0.33117,-0.772937 0.12845,-0.20751 0.28017,-0.377116 0.46652,-0.549783 0.20058,-0.185858 0.4537,-0.38551 0.73919,-0.613317 0.13775,-0.110127 0.28728,-0.192989 0.44055,-0.255385 0.16412,-0.06681 0.33429,-0.110852 0.50139,-0.13907 0.37887,-0.06398 0.75833,-0.04917 1.04898,-0.02069 0.52263,0.05122 0.82604,0.132674 0.97919,0.157037 0.23537,0.03744 0.26205,-0.02201 0.26968,-0.04206 z"
           id="path50013-5"
           sodipodi:nodetypes="csssssscccsscsc"
           inkscape:path-effect="#path-effect1240"
           inkscape:original-d="m 169.15516,-13.366568 c 0,0 -2.15036,-0.818815 -3.3673,0.138001 -1.21692,0.95682 -1.50699,1.15704 -1.91966,3.3476172 -0.41264,2.1905799 -0.27434,3.4943704 -0.57497,4.1152712 -0.30062,0.6209026 -3.97116,4.0983143 -3.21363,7.6200266 0.75751,3.5217103 4.80962,4.9221735 6.43664,5.1286951 0.81374,0.1032888 3.93406,2.5255245 7.12322,1.0686158 3.18918,-1.4569085 3.13314,-4.4866583 3.13314,-4.4866583 l 1.73387,-8.9536523 c 0,0 0.81921,-4.2673092 -0.26054,-5.6036213 -0.98854,-1.246667 -3.23029,-2.392556 -4.41609,-0.9627 -1.18579,1.429856 -1.25378,2.6370915 -1.43646,3.0818315 -0.1827,0.4447382 -0.78975,4.6675421 -1.1539,5.5191593 -0.36403,0.8516407 -1.74909,1.690028 -2.87717,4.4519826 -1.32866,3.2530461 -0.14881,4.2334119 0.68897,6.088416" /><path
           style="fill:#000000;fill-rule:nonzero;stroke:none;stroke-width:0.240478px;stroke-linecap:butt;stroke-linejoin:miter;stroke-opacity:1"
           d="m 175.04871,-12.573094 c 0.02,4.9e-4 0.10106,-0.02067 0.10923,-0.478918 0.001,-0.06681 7.2e-4,-0.14767 -0.003,-0.242077 -0.0104,-0.304561 -0.0571,-0.927919 -0.23936,-1.60967 -0.0746,-0.278968 -0.17617,-0.583273 -0.31543,-0.881125 -0.12772,-0.273149 -0.29092,-0.549049 -0.50055,-0.795817 -0.19732,-0.232278 -0.43805,-0.441702 -0.73332,-0.597438 -0.28189,-0.148682 -0.61114,-0.246912 -0.99431,-0.268478 -0.42609,-0.02391 -0.81353,0.04118 -1.16295,0.18637 -0.33956,0.141088 -0.63501,0.354384 -0.8912,0.62117 -0.25072,0.261091 -0.46215,0.571589 -0.64101,0.912109 -0.17656,0.336147 -0.3214,0.701584 -0.44093,1.077481 -0.23745,0.74674 -0.3746,1.533694 -0.46093,2.206134 -0.0433,0.337297 -0.0739,0.646477 -0.0977,0.906011 -0.008,0.08592 -0.0238,0.267596 -0.0317,0.353518 -0.009,0.105157 -0.0178,0.193771 -0.0259,0.265896 -0.008,0.07132 -0.0212,0.164735 -0.0391,0.277742 -0.0181,0.113991 -0.0408,0.246709 -0.0676,0.395155 -0.0548,0.3032412 -0.12634,0.6693712 -0.20992,1.0743595 -0.17784,0.8616924 -0.40268,1.8631587 -0.64245,2.8460818 0,-4e-6 -0.003,0.013072 -0.003,0.013068 -0.23833,0.9763404 -0.51965,2.0502305 -0.80925,3.0095477 -0.13703,0.4539163 -0.2762,0.8830611 -0.41294,1.2614385 -0.13363,0.3697882 -0.26404,0.6886039 -0.38676,0.933906 -0.10379,0.20726714 -0.20122,0.44934084 -0.28956,0.71669351 -0.0874,0.26451851 -0.16609,0.55440328 -0.23297,0.85993523 -0.13324,0.60866176 -0.21917,1.27744746 -0.23358,1.92607406 -0.0146,0.6572629 0.0442,1.2902572 0.19989,1.8227496 0.0799,0.2733236 0.18564,0.5214167 0.32106,0.7339684 0.13951,0.2189732 0.31032,0.3998329 0.51528,0.5308218 0.35243,0.2250223 0.6438,0.3449663 0.88056,0.404494 0.26998,0.067881 0.47707,0.05914 0.62568,0.027585 0.19264,-0.040904 0.30471,-0.1230845 0.35426,-0.1728381 0.0149,-0.015009 0.0263,-0.029009 0.0347,-0.041557 0.0576,-0.085932 0.002,-0.1389017 -0.0135,-0.1513512 -0.016,-0.012658 -0.0691,-0.051141 -0.1347,-0.038018 -0.0104,0.00208 -0.0218,0.00518 -0.0355,0.00938 -0.0347,0.010634 -0.13722,0.049838 -0.26152,0.063599 -0.10251,0.01135 -0.25925,0.012251 -0.47673,-0.048345 -0.19265,-0.053675 -0.44722,-0.1594477 -0.77081,-0.3683438 -0.15138,-0.097732 -0.28502,-0.2367092 -0.39994,-0.4176155 -0.11205,-0.1763962 -0.20472,-0.3902712 -0.27722,-0.6376209 -0.14182,-0.4838412 -0.20053,-1.0756301 -0.1882,-1.7091109 0.0121,-0.6228751 0.0927,-1.2681669 0.21893,-1.85608114 0.0633,-0.29471108 0.13758,-0.57268188 0.21951,-0.8245155 0.083,-0.25497394 0.17295,-0.48076355 0.26628,-0.66975253 0.1304,-0.26351243 0.26506,-0.59723913 0.39986,-0.97351283 0.1385,-0.386599 0.27862,-0.8222074 0.41598,-1.2802626 0.29025,-0.9678697 0.57211,-2.0486984 0.81122,-3.0282586 0,-5.8e-6 0.003,-0.013119 0.003,-0.013124 0.24082,-0.9872311 0.46743,-1.9913574 0.64803,-2.8573259 0.0848,-0.4067649 0.1579,-0.7755066 0.21448,-1.0820811 0.0277,-0.150075 0.0514,-0.28524 0.0706,-0.402239 0.0189,-0.115452 0.0335,-0.21442 0.043,-0.292915 0.009,-0.07664 0.0186,-0.168915 0.0287,-0.274171 0.0132,-0.137676 0.0203,-0.215276 0.0335,-0.35295 0.0249,-0.257521 0.0562,-0.561744 0.0999,-0.892663 0.0873,-0.661617 0.22315,-1.423689 0.45272,-2.139978 0.11535,-0.359922 0.253,-0.703925 0.41762,-1.016123 0.16683,-0.316389 0.35912,-0.595871 0.58034,-0.825973 0.22524,-0.234274 0.47862,-0.41551 0.76419,-0.534468 0.29324,-0.122154 0.62367,-0.180011 0.99772,-0.159913 0.32987,0.01765 0.6074,0.100235 0.84291,0.222608 0.24766,0.12869 0.45487,0.304568 0.62935,0.505802 0.1862,0.214758 0.33649,0.460023 0.45833,0.710715 0.1327,0.273018 0.23334,0.555981 0.31044,0.819843 0.1844,0.631166 0.2617,1.258878 0.29633,1.540135 0.0136,0.110089 0.015,0.123834 0.0286,0.233924 0.0555,0.44305 0.11089,0.46583 0.13092,0.46632 z"
           id="path50015-4"
           sodipodi:nodetypes="cssssc"
           inkscape:path-effect="#path-effect1238"
           inkscape:original-d="m 175.04871,-12.573094 c 0,0 0.11089,-4.532581 -2.68655,-4.686435 -3.2494,-0.178713 -3.42405,5.169367 -3.56347,6.362463 -0.13943,1.1930959 -1.58642,7.855523 -2.5888,9.8705096 -0.7942,1.59650318 -1.22704,5.4234082 0.22038,6.3524695 1.29773,0.8329811 1.78049,0.2240325 1.78049,0.2240325" /><path
           style="fill:#000000;stroke:none;stroke-width:0.219545px;stroke-linecap:butt;stroke-linejoin:miter;stroke-opacity:1"
           d="m 172.42047,-13.507289 c 0.26883,0.06586 0.37236,0.442088 0.35056,0.691409 -0.0217,0.249333 -0.18751,0.607099 -0.52039,0.533256 -0.33292,-0.07367 -0.37211,-0.5139 -0.33709,-0.742298 0.035,-0.228369 0.23805,-0.547847 0.50692,-0.48237 z"
           id="path23327-7-5-5-7-7"
           sodipodi:nodetypes="zszzz" /><path
           style="fill:#000000;stroke:none;stroke-width:0.210038px;stroke-linecap:butt;stroke-linejoin:miter;stroke-opacity:1"
           d="m 169.91332,-13.685348 c 0.25478,0.05973 0.35832,0.422857 0.34157,0.66487 -0.0166,0.242022 -0.16764,0.591355 -0.48302,0.524856 -0.31539,-0.06632 -0.35916,-0.492472 -0.32962,-0.714404 0.0295,-0.221902 0.21626,-0.534693 0.47107,-0.475326 z"
           id="path48533-5-4"
           sodipodi:nodetypes="zszzz" /><path
           style="fill:#ececec;fill-opacity:1;stroke:none;stroke-width:0.245139px;stroke-linecap:butt;stroke-linejoin:miter;stroke-opacity:1"
           d="m 169.76817,-13.468927 c 0.0906,0.03033 0.16061,0.194629 0.12663,0.359601 -0.0341,0.165067 -0.11591,0.278117 -0.22643,0.242 -0.11043,-0.03664 -0.16511,-0.2221 -0.13328,-0.382001 0.0318,-0.159892 0.14296,-0.249267 0.23308,-0.219596 z"
           id="path23791-4-7-9-4-4"
           sodipodi:nodetypes="szzss" /><path
           style="fill:#ececec;fill-opacity:1;stroke:none;stroke-width:0.257278px;stroke-linecap:butt;stroke-linejoin:miter;stroke-opacity:1"
           d="m 172.20808,-13.232056 c 0.0956,0.02852 0.17466,0.199085 0.14522,0.374346 -0.0296,0.175366 -0.1108,0.297701 -0.22741,0.263846 -0.11654,-0.03441 -0.18035,-0.227882 -0.15297,-0.397711 0.0273,-0.169815 0.14006,-0.268315 0.23517,-0.240476 z"
           id="path48535-2-3"
           sodipodi:nodetypes="szzss" /><path
           style="fill:#6b2300;fill-opacity:1;stroke:none;stroke-width:0.264583px;stroke-linecap:butt;stroke-linejoin:miter;stroke-opacity:1"
           d="m 172.39488,-10.986876 -0.88809,0.324902 -0.97343,0.7440075 -0.36747,-1.2431925 -0.0732,-0.490438 2.37687,0.03541 z"
           id="path2654" /><path
           style="fill:#c25620;fill-opacity:1;stroke:none;stroke-width:0.264583px;stroke-linecap:butt;stroke-linejoin:miter;stroke-opacity:1"
           d="m 170.56546,-9.8972745 0.51306,-0.4981655 0.98416,-0.481069 0.37579,-0.127379 -0.15452,0.747319 -0.38336,0.9846981 -0.41958,0.2291691 -0.4798,-0.1691312 z"
           id="path3208" /><path
           style="fill:#000000;fill-rule:nonzero;stroke:none;stroke-width:0.264583px;stroke-linecap:butt;stroke-linejoin:miter;stroke-opacity:1"
           d="m 169.57475,-11.647564 c 0.29631,0.02267 1.12738,0.111064 1.77786,0.136027 0.31934,0.01226 0.65504,0.01534 1.00417,0.01443 -0.003,0.06322 -0.009,0.144088 -0.0169,0.238729 -0.0203,0.23087 -0.059,0.547589 -0.1313,0.866108 -0.0337,0.148334 -0.0767,0.306389 -0.13132,0.4579605 -0.0507,0.140721 -0.11101,0.2749478 -0.1822,0.3899072 -0.0683,0.1102599 -0.144,0.1986078 -0.22686,0.2589768 -0.0403,0.029373 -0.082,0.051912 -0.12534,0.067434 -0.0429,0.015386 -0.0885,0.024268 -0.13752,0.02556 -0.0487,0.00128 -0.0949,-0.00526 -0.13918,-0.018635 -0.0446,-0.013468 -0.0883,-0.034183 -0.13139,-0.062017 -0.0882,-0.057015 -0.17173,-0.1427944 -0.25002,-0.2513758 -0.0812,-0.1125823 -0.15356,-0.2452674 -0.21757,-0.385524 -0.0684,-0.1498506 -0.12675,-0.3072906 -0.17594,-0.4562576 -0.10574,-0.32023 -0.18899,-0.669387 -0.22766,-0.81974 -0.004,-0.01605 -0.008,-0.03163 -0.0122,-0.04677 -0.0907,-0.34324 -0.13584,-0.38931 -0.15738,-0.386777 -0.0128,0.0015 -0.0688,0.06033 -0.0307,0.421192 0.002,0.01591 0.004,0.03228 0.006,0.04909 0.0219,0.177758 0.0778,0.500448 0.18482,0.857698 0.0469,0.156658 0.10536,0.3248711 0.17663,0.4874201 0.0664,0.1514974 0.14556,0.3016381 0.23919,0.4335211 0.0898,0.1264672 0.19568,0.2401327 0.32035,0.3210469 0.0617,0.040021 0.1281,0.072137 0.19934,0.09359 0.0711,0.021416 0.14577,0.031815 0.2235,0.02957 0.0776,-0.00224 0.15109,-0.016705 0.22028,-0.041799 0.0695,-0.025197 0.13327,-0.060632 0.19166,-0.1035567 0.11844,-0.087067 0.2151,-0.2052567 0.29452,-0.3343006 0.0832,-0.1352867 0.15055,-0.2874075 0.2053,-0.4391068 0.0592,-0.1640191 0.10549,-0.3325851 0.14186,-0.4876011 0.078,-0.332477 0.12381,-0.661106 0.15036,-0.897889 0.0279,-0.24918 0.0361,-0.406458 0.0378,-0.408758 a 0.14030571,0.09507131 11.895388 0 0 -0.14648,-0.151782 c -0.40348,-0.0031 -0.78997,-0.0019 -1.15508,0.01136 -0.65053,0.02359 -1.48179,0.110224 -1.77815,0.132269 z"
           id="path50961"
           inkscape:path-effect="#path-effect1242"
           inkscape:original-d="m 169.57475,-11.647564 2.93307,0.0031 c 0,0 -0.0881,2.556839 -1.09882,2.5850463 -1.01077,0.028208 -1.31504,-2.5601133 -1.31504,-2.5601133" /><path
           style="fill:#000000;fill-rule:nonzero;stroke:none;stroke-width:0.264583px;stroke-linecap:butt;stroke-linejoin:miter;stroke-opacity:1"
           d="m 170.56827,-9.901407 c 0.0208,0.017264 0.0954,0.00343 0.2703,-0.120861 0.14067,-0.100117 0.32525,-0.247215 0.55529,-0.388624 0.23162,-0.142402 0.48422,-0.263736 0.68272,-0.362441 -3e-5,1.5e-5 0.005,-0.0025 0.005,-0.0025 0.19581,-0.09745 0.32156,-0.193351 0.31717,-0.20866 -0.005,-0.01808 -0.1063,-0.04511 -0.38464,0.02984 -0.002,5.04e-4 -0.004,0.001 -0.006,0.0015 -0.21772,0.05916 -0.49912,0.165977 -0.75141,0.31574 -0.25183,0.149476 -0.44673,0.314747 -0.56476,0.453361 -0.15103,0.178158 -0.13958,0.2697617 -0.12409,0.282634 z"
           id="path50963"
           inkscape:path-effect="#path-effect1244"
           inkscape:original-d="m 170.56827,-9.901407 c 0,0 0.27611,-0.33231 0.75722,-0.62274 0.4811,-0.29043 1.07331,-0.460359 1.07331,-0.460359" /></g><g
         id="g4992"
         inkscape:label="left arm"><path
           style="fill:#000000;fill-rule:nonzero;stroke:none;stroke-width:0.264583px;stroke-linecap:butt;stroke-linejoin:miter;stroke-opacity:1"
           d="m 175.31727,-5.9625616 c -0.007,0.027608 0.0307,0.1102852 0.28081,0.2163111 0.25995,0.1101882 0.78969,0.2577068 1.36413,0.517556 0.49298,0.2229979 1.01217,0.5200193 1.54304,0.8630467 0.11183,0.072258 0.21908,0.1431395 0.32499,0.2138659 0.48143,0.3214931 1.10083,0.7957495 1.30662,0.9909967 -0.23239,-0.3018674 -0.60639,-0.7723305 -1.1506,-1.2046841 -0.10212,-0.081127 -0.20983,-0.160555 -0.32215,-0.2380058 -0.53327,-0.3677072 -1.09434,-0.6407877 -1.59285,-0.8662858 -0.60539,-0.273846 -1.10817,-0.4730427 -1.39601,-0.5295701 -0.27598,-0.054198 -0.35233,0.013233 -0.35798,0.036769 z"
           id="path50152"
           inkscape:path-effect="#path-effect1246"
           inkscape:original-d="m 175.31727,-5.9625616 c 0,0 2.92538,0.7016314 4.81959,2.8017764"
           sodipodi:nodetypes="cc" /><g
           id="g5000"
           inkscape:label="left hand"><path
             style="fill:#e8e8e8;fill-opacity:1;stroke:none;stroke-width:0.264583px;stroke-linecap:butt;stroke-linejoin:miter;stroke-opacity:1"
             d="m 179.76139,-0.83377777 0.0632,-1.04232363 0.21304,-1.2964107 0.45014,-1.1787161 0.82678,-0.7015059 1.01177,-0.088884 0.66681,0.5139253 0.18218,0.5705372 -0.36859,1.0778664 -0.46489,1.0901865 -0.0457,1.30379709 0.25431,1.36160879 0.45917,1.87378922 0.069,0.8234521 -0.29658,0.7412196 -0.51121,0.5063464 -1.26762,0.7928451 -0.78524,0.1889151 -0.72478,-0.3087105 -0.51843,-0.6485176 -0.19938,-0.6746319 0.0354,-0.6387597 0.15316,-1.0433315 -0.88546,0.4452382 -0.8219,1.5062041 -0.64784,0.73397 -0.65508,0.2372149 -0.59777,-0.2659989 -0.33537,-0.8290666 0.0391,-0.9432448 0.54846,-1.2804114 0.51788,-0.8378983 1.0638,-0.90811218 1.19723,-0.52540032 z"
             id="path4387" /><path
             style="fill:#000000;fill-rule:nonzero;stroke:none;stroke-width:0.264583px;stroke-linecap:butt;stroke-linejoin:miter;stroke-opacity:1"
             d="m 178.10334,2.777323 c -0.0232,-0.00973 -0.0798,0.064624 -0.33864,0.4940754 -0.0565,0.093773 -0.12204,0.2025748 -0.19204,0.3165089 -0.11937,0.1942805 -0.29182,0.466668 -0.48923,0.7245669 -0.1261,0.1647255 -0.26689,0.3296443 -0.41584,0.468964 -0.13895,0.1299794 -0.28107,0.2339434 -0.42085,0.2960646 -0.0668,0.029692 -0.13141,0.049071 -0.19363,0.057872 -0.0609,0.00861 -0.1201,0.00719 -0.17822,-0.005 -0.0574,-0.012045 -0.11671,-0.035205 -0.17794,-0.073135 -0.0612,-0.037914 -0.12546,-0.091291 -0.19185,-0.164629 -0.13651,-0.1507114 -0.22745,-0.3257087 -0.28005,-0.519174 -0.0539,-0.1980526 -0.0676,-0.4159474 -0.0475,-0.6454795 0.0209,-0.239414 0.0783,-0.4872378 0.16129,-0.7324924 0.0724,-0.2139568 0.16358,-0.4238055 0.26558,-0.6234411 0.0234,-0.045817 0.0476,-0.091466 0.0725,-0.1368947 0.28004,-0.5113692 0.64715,-0.9896121 1.03814,-1.37055257 0.20017,-0.19502443 0.4053,-0.36336171 0.60807,-0.49901986 0.20697,-0.13847082 0.40901,-0.24126254 0.59991,-0.30533242 0.63352,-0.21176171 1.04256,-0.36331113 1.31135,-0.47561182 0.10432,-0.043583 0.19374,-0.0848289 0.26733,-0.12254619 0.13144,-0.067369 0.203,-0.11855735 0.24037,-0.15644096 0.0494,-0.0501038 0.0388,-0.0770614 0.0337,-0.0855436 l 0,-2e-8 c -0.005,-0.009102 -0.0189,-0.0306011 -0.0841,-0.0300612 -0.0506,4.1893e-4 -0.13336,0.0130279 -0.27403,0.0475269 -0.0782,0.0191931 -0.17248,0.0447144 -0.27926,0.0758899 -0.28248,0.0824782 -0.68304,0.20669616 -1.32526,0.40446711 -0.23,0.0710869 -0.46403,0.18626489 -0.69506,0.3361573 -0.22674,0.14711212 -0.45188,0.32850854 -0.66824,0.53613149 -0.42178,0.40474802 -0.81409,0.91321667 -1.11242,1.45921867 -0.0266,0.048681 -0.0525,0.097671 -0.0775,0.1469172 -0.10904,0.2142804 -0.20739,0.4419467 -0.2857,0.6766107 -0.0896,0.2684549 -0.1533,0.5472599 -0.17526,0.8235156 -0.0211,0.2648913 -0.004,0.5287537 0.0672,0.7772961 0.0699,0.244799 0.1908,0.4710294 0.37232,0.6649894 0.0876,0.093623 0.17945,0.1686065 0.2751,0.2246983 0.0965,0.056616 0.19578,0.093279 0.2965,0.1110642 0.10171,0.01796 0.20178,0.016119 0.29851,-0.00109 0.0979,-0.017419 0.19165,-0.050422 0.28021,-0.093669 0.18236,-0.089062 0.34976,-0.2249862 0.49738,-0.3740179 0.1599,-0.1614236 0.30465,-0.3464522 0.42855,-0.5248654 0.19636,-0.2827366 0.35473,-0.5694129 0.46077,-0.7800703 0.0621,-0.1232766 0.1152,-0.2393983 0.1591,-0.3429363 0.19889,-0.4691071 0.17915,-0.5762217 0.16888,-0.5805378 z"
             id="path50154"
             inkscape:path-effect="#path-effect1260"
             inkscape:original-d="m 178.10334,2.777323 c 0,0 -1.50101,3.5721424 -2.73162,2.2383554 -1.26676,-1.372975 0.79567,-4.58056823 2.4963,-5.1266116 1.70063,-0.54604311 1.90773,-0.66898268 1.90773,-0.66898268"
             sodipodi:nodetypes="cssc" /><path
             style="fill:#000000;fill-rule:nonzero;stroke:none;stroke-width:0.264583px;stroke-linecap:butt;stroke-linejoin:miter;stroke-opacity:1"
             d="m 179.7631,-0.74070437 c 0.0237,-1.47e-5 0.0939,-0.0166652 0.14173,-0.33655003 0.007,-0.047959 0.0145,-0.1040063 0.0229,-0.1723272 0.0223,-0.182331 0.0765,-0.6979977 0.16348,-1.1802713 0.0713,-0.3953965 0.18247,-0.8834445 0.36073,-1.3146306 0.0801,-0.1936921 0.17404,-0.3768146 0.28427,-0.5346962 0.10453,-0.1497087 0.22214,-0.2745372 0.35434,-0.3647158 0.26887,-0.1833161 0.55715,-0.2804449 0.83193,-0.2944935 0.25976,-0.013281 0.50014,0.048402 0.6854,0.1726166 0.0899,0.060259 0.1667,0.135203 0.22648,0.223521 0.0591,0.087232 0.10249,0.1890394 0.12467,0.3051888 0.0221,0.1155281 0.0234,0.246988 -0.004,0.3936685 -0.0271,0.14651 -0.0825,0.3080469 -0.17362,0.4827327 -0.19823,0.3794217 -0.3445,0.7038361 -0.44719,1.0053207 -0.10503,0.3083524 -0.16318,0.5891345 -0.18569,0.8739502 -0.0233,0.2949431 -0.008,0.59074689 0.0308,0.91004617 0.0408,0.33665717 0.11,0.71504326 0.18855,1.12551926 0.0824,0.43057469 0.18608,0.82266017 0.29078,1.23145567 0.0949,0.3706766 0.18361,0.7293617 0.22523,1.0564327 0.0202,0.1589193 0.0294,0.310486 0.0235,0.4544006 -0.006,0.1417 -0.0262,0.275181 -0.0646,0.4009258 -0.0379,0.1241994 -0.0938,0.2419212 -0.17191,0.353735 -0.0777,0.1112474 -0.17872,0.2183817 -0.30893,0.3209695 -0.28551,0.2252955 -0.5768,0.4598874 -0.87376,0.6593164 -0.14867,0.099841 -0.29559,0.1886645 -0.44033,0.2615171 -0.14641,0.073694 -0.28787,0.1296584 -0.42414,0.1645771 -0.13818,0.035404 -0.26871,0.048582 -0.39241,0.038198 -0.12562,-0.010544 -0.24669,-0.045565 -0.36452,-0.1093639 -0.12152,-0.065799 -0.2426,-0.1638833 -0.36211,-0.3021278 -0.12392,-0.1433466 -0.24445,-0.3279506 -0.36017,-0.5591205 -0.0355,-0.071613 -0.063,-0.1553822 -0.0834,-0.2477537 -0.0215,-0.097199 -0.0347,-0.2014551 -0.042,-0.3071081 -0.0162,-0.2349774 -0.003,-0.4789453 0.0125,-0.6716418 0.0273,-0.3333438 0.0582,-0.5401506 0.0571,-0.6445362 -0.002,-0.1521819 -0.0727,-0.1777637 -0.0938,-0.1831531 v 0 c -0.0187,-0.00479 -0.0999,-0.01745 -0.165,0.128082 -0.0444,0.099278 -0.10631,0.3083375 -0.15347,0.6610716 -0.0271,0.2025532 -0.0488,0.4672963 -0.0336,0.7337061 0.007,0.1198469 0.0213,0.2442844 0.0479,0.3652168 0.0251,0.1143894 0.0619,0.2295687 0.11581,0.335926 0.12709,0.2520818 0.26523,0.4641569 0.4156,0.6355378 0.14562,0.16597 0.30255,0.2935707 0.47116,0.3820762 0.16464,0.086418 0.33584,0.1331324 0.5112,0.1448748 0.17108,0.011456 0.34198,-0.010616 0.51064,-0.05704 0.16579,-0.045635 0.32994,-0.1149333 0.49118,-0.1996495 0.15957,-0.083835 0.31737,-0.183343 0.47218,-0.2912082 0.30656,-0.2135887 0.60572,-0.4631091 0.88252,-0.6896807 0.15033,-0.1228853 0.27069,-0.2545842 0.36455,-0.3950788 0.0945,-0.1413966 0.16067,-0.2895982 0.20412,-0.4432869 0.0438,-0.1549369 0.0642,-0.3141781 0.0678,-0.4759546 0.004,-0.1639671 -0.01,-0.3317112 -0.0339,-0.5012261 -0.0492,-0.3455577 -0.14676,-0.719574 -0.24389,-1.0866062 -0.10822,-0.4089165 -0.21181,-0.79429122 -0.29197,-1.21320956 -0.0786,-0.41093857 -0.14407,-0.78020527 -0.18047,-1.10698609 -0.0344,-0.30837878 -0.0438,-0.58446115 -0.0175,-0.85417375 0.0252,-0.2590879 0.0834,-0.5149052 0.18661,-0.7995739 0.10151,-0.2800068 0.24604,-0.5868206 0.44566,-0.9550958 0.10663,-0.1969934 0.17718,-0.3874226 0.21439,-0.5690579 0.0373,-0.182216 0.041,-0.355094 0.0142,-0.515424 -0.027,-0.161505 -0.0846,-0.3080769 -0.1671,-0.4363843 -0.0833,-0.1295949 -0.1907,-0.2387131 -0.31454,-0.3257081 -0.2545,-0.1787903 -0.57384,-0.2618203 -0.90275,-0.2495255 -0.34936,0.013059 -0.70536,0.1324673 -1.02825,0.3505975 -0.1804,0.1219219 -0.32952,0.2835711 -0.45302,0.460738 -0.13033,0.186976 -0.23601,0.3968154 -0.3221,0.6087698 -0.19117,0.4706946 -0.30094,0.9897771 -0.36418,1.3985942 -0.084,0.542842 -0.10282,0.9932677 -0.10273,1.2217243 3e-5,0.069892 0.002,0.1288931 0.004,0.1778372 0.0185,0.33119422 0.10504,0.34852599 0.12258,0.34851513 z"
             id="path50156"
             sodipodi:nodetypes="csssssc"
             inkscape:path-effect="#path-effect1252"
             inkscape:original-d="m 179.7631,-0.74070437 c 0,0 -0.002,-3.22974053 1.22122,-4.05968133 1.22339,-0.829941 2.72853,0.027878 1.9376,1.5143639 -0.79094,1.4864855 -0.75463,2.0869928 -0.42391,3.81533369 0.33072,1.72833981 1.08388,3.06638531 -0.0363,3.96664071 -1.12019,0.9002553 -2.49664,2.0829955 -3.48596,0.1140433 -0.34988,-0.6963401 0.0194,-2.139098 0.0194,-2.139098" /><path
             style="fill:#000000;fill-rule:nonzero;stroke:none;stroke-width:0.264583px;stroke-linecap:butt;stroke-linejoin:miter;stroke-opacity:1"
             d="m 178.04691,2.8230558 c 0.0102,0.021269 0.38964,-0.063185 0.71852,-0.2007754 0.15824,-0.066206 0.30473,-0.1329773 0.44507,-0.2031313 0.0697,-0.034858 0.14031,-0.071717 0.21326,-0.1115337 0.21536,-0.1175338 0.42472,-0.2393268 0.61341,-0.3849211 0.1041,-0.080382 0.21533,-0.1837632 0.30204,-0.2826021 0.0434,-0.049455 0.0777,-0.094337 0.1045,-0.1343727 0.0379,-0.056641 0.0556,-0.096132 0.0659,-0.1201007 -0.0226,0.013074 -0.0602,0.031677 -0.11902,0.058348 -0.042,0.019057 -0.0904,0.040258 -0.14798,0.065356 -0.10701,0.046609 -0.2551,0.1103963 -0.36104,0.1621895 -0.21805,0.1066414 -0.40249,0.2111766 -0.62398,0.3341666 -0.0721,0.040059 -0.13903,0.07773 -0.2064,0.1164476 -0.1355,0.077879 -0.26933,0.158033 -0.4152,0.2483507 -0.3004,0.1859879 -0.59926,0.4313093 -0.58904,0.4525786 z"
             id="path50158"
             inkscape:path-effect="#path-effect1258"
             inkscape:original-d="m 178.04691,2.8230558 c 0,0 2.06955,-0.9939689 2.46266,-1.437437"
             sodipodi:nodetypes="cc" /><path
             style="fill:#000000;fill-rule:nonzero;stroke:none;stroke-width:0.264583px;stroke-linecap:butt;stroke-linejoin:miter;stroke-opacity:1"
             d="m 178.84383,3.4784503 v 0 c -0.006,0.021361 -0.0189,0.1027719 0.0659,0.1532625 0.0133,0.00791 0.0297,0.015621 0.0495,0.023168 0.0747,0.028414 0.20328,0.056366 0.37,0.070372 0.14419,0.012113 0.31017,0.012339 0.47169,-0.012169 0.083,-0.012588 0.16234,-0.031316 0.23669,-0.056998 0.0825,-0.028514 0.15506,-0.064266 0.21871,-0.1065107 0.25533,-0.1696568 0.44856,-0.3682947 0.54832,-0.5237664 0.008,-0.012942 0.0161,-0.025769 0.0234,-0.038461 0.11642,-0.2032741 0.0735,-0.299841 0.0547,-0.3098827 -0.0267,-0.014263 -0.10707,0.010214 -0.25437,0.1608822 -0.009,0.0095 -0.0187,0.019341 -0.0282,0.029484 -0.10962,0.1167353 -0.27141,0.3187797 -0.48929,0.4607706 -0.0415,0.026974 -0.093,0.050025 -0.15559,0.067537 -0.0567,0.01584 -0.11975,0.026406 -0.1885,0.032028 -0.13531,0.011065 -0.27701,0.00184 -0.40708,-0.012971 -0.14851,-0.016905 -0.26642,-0.038342 -0.33953,-0.041885 -0.0195,-9.428e-4 -0.036,-7.417e-4 -0.0502,7.55e-4 -0.0892,0.0094 -0.11954,0.081778 -0.1261,0.104385 z"
             id="path50160"
             inkscape:path-effect="#path-effect1256"
             inkscape:original-d="m 178.84383,3.4784503 c 0,0 0.88842,0.2578506 1.33976,-0.039363 0.45133,-0.297217 0.69911,-0.7616231 0.69911,-0.7616231"
             sodipodi:nodetypes="csc" /><path
             style="fill:#000000;fill-rule:nonzero;stroke:none;stroke-width:0.264583px;stroke-linecap:butt;stroke-linejoin:miter;stroke-opacity:1"
             d="m 179.24822,4.9883766 c -0.002,0.022409 -0.001,0.1037837 0.0802,0.1392489 0.0588,0.025535 0.19164,0.039521 0.39026,0.035402 0.13364,-0.00277 0.28665,-0.014128 0.43635,-0.036805 0.16716,-0.025324 0.30757,-0.061141 0.42558,-0.1053223 0.13918,-0.052115 0.26138,-0.1298003 0.35711,-0.2073348 0.10466,-0.084763 0.19169,-0.1804447 0.25329,-0.2766099 0.003,-0.00535 0.007,-0.01071 0.0101,-0.016075 0.15012,-0.2457885 0.10047,-0.376788 0.0816,-0.3861167 -0.0207,-0.010286 -0.16757,0.07604 -0.30322,0.2183674 -0.004,0.00401 -0.008,0.00804 -0.0115,0.012099 -0.0665,0.070618 -0.1413,0.1580355 -0.2188,0.2313349 -0.0739,0.06994 -0.16114,0.1379551 -0.26235,0.176907 -0.0902,0.034687 -0.21326,0.058263 -0.3651,0.070501 -0.1375,0.011082 -0.2776,0.011355 -0.40425,0.00952 -0.1914,-0.00278 -0.30739,-0.00858 -0.37069,0.010194 -0.0804,0.023849 -0.0963,0.1016739 -0.0987,0.1246919 z"
             id="path50162"
             inkscape:path-effect="#path-effect1254"
             inkscape:original-d="m 179.24822,4.9883766 c 0,0 0.82459,0.083417 1.28556,-0.091191 0.45678,-0.1730192 0.74897,-0.7624224 0.74897,-0.7624224"
             sodipodi:nodetypes="csc" /></g></g></g></g></svg>
