<?xml version="1.0" encoding="UTF-8" standalone="no"?>
<!-- Created with Inkscape (http://www.inkscape.org/) -->

<svg
   width="74.488655mm"
   height="21.68745mm"
   viewBox="0 0 74.488655 21.68745"
   version="1.1"
   id="svg5"
   inkscape:version="1.2.2 (b0a8486541, 2022-12-01)"
   sodipodi:docname="LOGO1.svg"
   xmlns:inkscape="http://www.inkscape.org/namespaces/inkscape"
   xmlns:sodipodi="http://sodipodi.sourceforge.net/DTD/sodipodi-0.dtd"
   xmlns="http://www.w3.org/2000/svg"
   xmlns:svg="http://www.w3.org/2000/svg">
  <sodipodi:namedview
     id="namedview7"
     pagecolor="#505050"
     bordercolor="#ffffff"
     borderopacity="1"
     inkscape:showpageshadow="0"
     inkscape:pageopacity="0"
     inkscape:pagecheckerboard="1"
     inkscape:deskcolor="#505050"
     inkscape:document-units="mm"
     showgrid="false"
     inkscape:zoom="1.2467353"
     inkscape:cx="255.46721"
     inkscape:cy="135.15298"
     inkscape:window-width="1499"
     inkscape:window-height="1236"
     inkscape:window-x="1184"
     inkscape:window-y="48"
     inkscape:window-maximized="0"
     inkscape:current-layer="g1942"
     showguides="true">
    <sodipodi:guide
       position="48.531387,18.670945"
       orientation="0,-1"
       id="guide9285"
       inkscape:locked="false" />
    <sodipodi:guide
       position="48.106946,2.4360437"
       orientation="0,-1"
       id="guide9287"
       inkscape:locked="false" />
    <sodipodi:guide
       position="24.444312,-7.0077884"
       orientation="1,0"
       id="guide9339"
       inkscape:locked="false" />
    <sodipodi:guide
       position="21.68544,3.3910377"
       orientation="1,0"
       id="guide9551"
       inkscape:locked="false" />
    <sodipodi:guide
       position="34.524806,21.695093"
       orientation="0,-1"
       id="guide9584"
       inkscape:locked="false" />
    <sodipodi:guide
       position="32.933149,0.10161269"
       orientation="0,-1"
       id="guide9626"
       inkscape:locked="false" />
  </sodipodi:namedview>
  <defs
     id="defs2">
    <clipPath
       clipPathUnits="userSpaceOnUse"
       id="clipPath32765">
      <circle
         style="fill:#aad0ee;fill-opacity:1;stroke-width:0.704227;stroke-linecap:round;stroke-linejoin:round;stroke-dashoffset:1.13386;paint-order:fill markers stroke"
         id="circle32767"
         cx="124.65418"
         cy="64.330193"
         r="58.631721" />
    </clipPath>
  </defs>
  <g
     inkscape:label="Layer 1"
     inkscape:groupmode="layer"
     id="layer1"
     transform="translate(-2.8260787,-39.003239)">
    <g
       id="g290338"
       transform="matrix(0.68319911,0,0,0.68319911,250.35252,-178.60135)"
       inkscape:export-filename="DEI-logo.png"
       inkscape:export-xdpi="400"
       inkscape:export-ydpi="400">
      <text
         xml:space="preserve"
         style="font-style:normal;font-weight:normal;font-size:15.3966px;line-height:1.25;font-family:sans-serif;letter-spacing:0px;word-spacing:0px;fill:#294172;fill-opacity:1;stroke:none;stroke-width:0.384915"
         x="-327.97559"
         y="347.0199"
         id="text23493"
         inkscape:export-filename="DEI-logo.png"
         inkscape:export-xdpi="400"
         inkscape:export-ydpi="400"><tspan
           sodipodi:role="line"
           id="tspan23491"
           x="-327.97559"
           y="347.0199"
           style="font-style:normal;font-variant:normal;font-weight:600;font-stretch:normal;font-family:Montserrat;-inkscape-font-specification:'Montserrat Semi-Bold';letter-spacing:-0.264583px;fill:#294172;fill-opacity:1;stroke-width:0.384915">DEI TEAM</tspan></text>
      <g
         id="g1942"
         transform="translate(-242.90995,62.568535)">
        <g
           id="g1918"
           style="fill:#51a2da;fill-opacity:1;stroke-width:1.15021"
           transform="matrix(0.30191176,0,0,0.30191176,-107.89451,225.34162)">
          <path
             d="m 96.729167,125.3578 c -3.595373,1.38954 -6.03555,4.80292 -6.045574,9.01632 -0.0105,4.41352 3.082522,10.10943 9.487987,10.15149 4.30838,0.0283 6.46291,-1.58283 7.62603,-2.6768 0.77153,-0.68369 0.8255,-1.87009 0.11854,-2.61974 -0.70838,-0.75106 -1.89761,-0.76906 -2.6268,-0.0385 -0.86818,0.81562 -2.14666,2.02425 -5.772524,1.62173 -1.555755,-0.17216 -3.227339,-1.43528 -3.785318,-2.40173 l 11.879842,-5.05073 c 0.9084,-0.40358 1.32573,-1.45803 0.94121,-2.37421 -2.12076,-4.1731 -5.88103,-7.92444 -11.823393,-5.62783 z m 7.456683,5.48995 -9.885684,4.22249 c -0.705852,-2.63428 2.187448,-5.73353 3.76568,-6.31024 2.366314,-0.86468 4.977204,0.10837 6.120004,2.08775 z"
             style="fill:#51a2da;fill-opacity:1;fill-rule:evenodd;stroke:none;stroke-width:1.16848"
             id="path1902"
             sodipodi:nodetypes="ssscccccccsccsc" />
          <path
             id="path1904"
             style="fill:#51a2da;fill-opacity:1;stroke-width:34.1782;stroke-linecap:round;stroke-linejoin:round"
             d="m 142.75841,124.51519 a 10.043481,9.9623653 0 0 0 -10.04462,9.9635 10.043481,9.9623653 0 0 0 10.04462,9.96093 10.043481,9.9623653 0 0 0 10.04204,-9.96093 10.043481,9.9623653 0 0 0 -10.04204,-9.9635 z m 0,3.73185 a 6.2822799,6.2315417 0 0 1 6.28239,6.23165 6.2822799,6.2315417 0 0 1 -6.28239,6.23165 6.2822799,6.2315417 0 0 1 -6.2824,-6.23165 6.2822799,6.2315417 0 0 1 6.2824,-6.23165 z" />
          <path
             style="color:#000000;font-style:normal;font-variant:normal;font-weight:normal;font-stretch:normal;font-size:medium;line-height:normal;font-family:sans-serif;font-variant-ligatures:normal;font-variant-position:normal;font-variant-caps:normal;font-variant-numeric:normal;font-variant-alternates:normal;font-feature-settings:normal;text-indent:0;text-align:start;text-decoration:none;text-decoration-line:none;text-decoration-style:solid;text-decoration-color:#000000;letter-spacing:normal;word-spacing:normal;text-transform:none;writing-mode:lr-tb;direction:ltr;text-orientation:mixed;dominant-baseline:auto;baseline-shift:baseline;text-anchor:start;white-space:normal;shape-padding:0;clip-rule:nonzero;display:inline;overflow:visible;visibility:visible;isolation:auto;mix-blend-mode:normal;color-interpolation:sRGB;color-interpolation-filters:linearRGB;solid-color:#000000;solid-opacity:1;fill:#51a2da;fill-opacity:1;fill-rule:nonzero;stroke:none;stroke-width:7.01083;stroke-linecap:round;stroke-linejoin:round;stroke-miterlimit:4;stroke-dasharray:none;stroke-dashoffset:0;stroke-opacity:1;color-rendering:auto;image-rendering:auto;shape-rendering:auto;text-rendering:auto;enable-background:accumulate"
             d="m 157.27615,124.6433 c -1.59548,0 -1.86142,1.31669 -1.85308,1.84776 v 15.98997 c -0.0436,1.03365 0.81202,1.89464 1.88299,1.89464 1.07096,0 1.92667,-0.86099 1.88297,-1.89464 0,0 0.0284,-5.94671 0,-9.75342 -0.0284,-3.80671 3.06985,-4.63179 4.14789,-4.63179 0.80054,0 1.44015,0.44589 2.0745,0.42206 0.94151,-0.0354 1.71459,-0.6668 1.71459,-1.77397 -0.0283,-1.78855 -2.22269,-2.04245 -3.84053,-2.00941 -1.61785,0.0331 -2.9842,0.52982 -4.16721,1.2363 0,0 -0.24663,-1.3275 -1.84212,-1.3275 z"
             id="path1906"
             inkscape:connector-curvature="0"
             sodipodi:nodetypes="zccsczcsczcz" />
          <g
             style="fill:#51a2da;fill-opacity:1;stroke-width:1.87303"
             transform="matrix(1.7992734,0,0,1.7380239,67.446745,-121.99926)"
             id="g1910">
            <path
               style="color:#000000;font-style:normal;font-variant:normal;font-weight:normal;font-stretch:normal;font-size:medium;line-height:normal;font-family:sans-serif;font-variant-ligatures:normal;font-variant-position:normal;font-variant-caps:normal;font-variant-numeric:normal;font-variant-alternates:normal;font-feature-settings:normal;text-indent:0;text-align:start;text-decoration:none;text-decoration-line:none;text-decoration-style:solid;text-decoration-color:#000000;letter-spacing:normal;word-spacing:normal;text-transform:none;writing-mode:lr-tb;direction:ltr;text-orientation:mixed;dominant-baseline:auto;baseline-shift:baseline;text-anchor:start;white-space:normal;shape-padding:0;clip-rule:nonzero;display:inline;overflow:visible;visibility:visible;opacity:1;isolation:auto;mix-blend-mode:normal;color-interpolation:sRGB;color-interpolation-filters:linearRGB;solid-color:#000000;solid-opacity:1;fill:#51a2da;fill-opacity:1;fill-rule:nonzero;stroke:none;stroke-width:3.96453;stroke-linecap:butt;stroke-linejoin:miter;stroke-miterlimit:4;stroke-dasharray:none;stroke-dashoffset:0;stroke-opacity:1;color-rendering:auto;image-rendering:auto;shape-rendering:auto;text-rendering:auto;enable-background:accumulate"
               d="m 60.088341,141.88715 c -1.393394,0 -2.398273,0.42786 -3.13079,0.97048 -1.110459,0.82303 0.08453,2.54386 1.19499,1.72083 0.505399,-0.37438 0.881229,-0.57413 1.9358,-0.57413 1.312636,0.0273 2.368475,0.53812 2.368475,1.55443 -0.703746,0.461 -3.763534,0.84205 -5.406566,1.8093 -1.643032,0.96724 -1.555977,2.18804 -1.555977,2.98017 0,1.73757 1.769154,2.90976 3.301505,2.90976 1.532352,0 2.182891,-0.33275 3.682046,-1.39626 v 0.30438 c -0.04845,1.45961 2.09629,1.45961 2.047845,0 v -6.23787 c 0.0066,-2.58701 -1.787667,-4.00169 -4.437328,-4.04109 z m 2.439505,5.75572 c -5.12e-4,0.68595 0.0092,0.8837 -0.009,1.56941 -0.004,0.8235 -0.503683,1.20524 -1.026925,1.52032 -0.523236,0.31508 -1.586095,0.59147 -2.201906,0.62167 -0.710308,0.0243 -1.65271,-0.1418 -1.702203,-1.01389 5.12e-4,-0.5264 0.246817,-0.85289 0.65127,-1.21646 0.957742,-0.74385 2.255423,-0.99358 4.288768,-1.48105 z"
               id="path1908"
               inkscape:connector-curvature="0"
               sodipodi:nodetypes="ccccczszcccccscscccss" />
          </g>
          <path
             style="font-style:normal;font-variant:normal;font-weight:bold;font-stretch:normal;font-size:medium;line-height:25px;font-family:Comfortaa;-inkscape-font-specification:Comfortaa;letter-spacing:0px;word-spacing:0px;fill:#51a2da;fill-opacity:1;stroke:none;stroke-width:1.76496px;stroke-linecap:butt;stroke-linejoin:miter;stroke-opacity:1"
             d="m 128.56291,116.32562 c -1.15198,-0.0687 -2.00005,1.07152 -1.82333,2.15483 v 8.36367 c -3.63641,-3.04884 -9.55863,-2.83682 -12.91558,0.5392 -3.39481,3.02498 -4.03972,8.51062 -1.57068,12.28835 1.81366,2.85198 5.13136,4.88571 8.55043,4.72423 2.14993,-0.0196 4.2827,-0.9455 5.93583,-2.31651 -0.16962,1.08236 0.66623,2.22553 1.82333,2.15604 1.13581,0.0506 2.01523,-1.07045 1.84088,-2.15482 -0.0197,-8.04418 0.0197,-16.08885 -0.0197,-24.13274 -0.0591,-0.90718 -0.92676,-1.65309 -1.83241,-1.62225 z m -7.9771,12.01866 c 3.28298,-0.0857 6.21551,2.86987 6.15377,6.12271 0.069,3.25587 -2.87355,6.20634 -6.15377,6.12273 -3.11889,0.0827 -5.97784,-2.55935 -6.1372,-5.65665 -0.33212,-3.1928 2.28898,-6.30485 5.49957,-6.55826 0.21182,-0.0207 0.42464,-0.0306 0.63763,-0.0306 z"
             id="path1912"
             inkscape:connector-curvature="0"
             sodipodi:nodetypes="ccccccccccccccccccc" />
          <g
             style="fill:#51a2da;fill-opacity:1;stroke-width:1.92126"
             transform="matrix(1.7361841,0,0,1.7118711,84.821887,-122.89238)"
             id="g1916">
            <path
               style="font-style:normal;font-variant:normal;font-weight:bold;font-stretch:normal;font-size:medium;line-height:25px;font-family:Comfortaa;-inkscape-font-specification:Comfortaa;letter-spacing:0px;word-spacing:0px;fill:#51a2da;fill-opacity:1;stroke:none;stroke-width:4.06665;stroke-linecap:butt;stroke-linejoin:miter;stroke-miterlimit:4;stroke-dasharray:none;stroke-opacity:1"
               d="m -2.5312666,143.62929 v 11.47421 c -0.003,1.4145 2.12023294,1.4145 2.11718234,0 v -7.65727 H 1.7635608 c 0.5092674,0 0.9446445,-0.37386 0.9446445,-0.9741 0,-0.60024 -0.4664127,-0.9648 -0.9446445,-0.9648 h -2.17764176 v -1.76487 c 0,-1.1293 0.8711995,-2.06801 2.62476896,-2.04625 0.6099425,0.008 0.8261384,0.1567 1.048907,0.29442 1.2161282,0.81695 2.3869012,-1.07509 1.1131122,-1.79886 -0.7812122,-0.48483 -1.5111158,-0.65571 -2.3819993,-0.65571 -2.74449516,0 -4.5059235,2.11423 -4.5219745,4.09323 z"
               id="path1914"
               inkscape:connector-curvature="0"
               sodipodi:nodetypes="ccccczcccscccc" />
          </g>
        </g>
      </g>
    </g>
    <g
       id="g32791"
       transform="matrix(0.2710931,0,0,0.2710931,-88.257174,32.108322)"
       inkscape:export-filename="DEI-logo-mark.svg"
       inkscape:export-xdpi="400"
       inkscape:export-ydpi="400">
      <circle
         style="fill:#aad0ee;fill-opacity:1;stroke-width:0.480442;stroke-linecap:round;stroke-linejoin:round;stroke-dashoffset:1.13386;paint-order:fill markers stroke"
         id="circle24982"
         cx="375.98514"
         cy="65.433769"
         r="40" />
      <g
         id="g88153"
         transform="matrix(0.68222457,0,0,0.68222457,290.943,21.546129)"
         clip-path="url(#clipPath32765)">
        <g
           id="g88151"
           transform="translate(8.2459065,-147.49892)"
           style="display:inline;mix-blend-mode:normal"
           clip-path="none">
          <g
             id="g88149"
             clip-path="none"
             transform="translate(11.402812,115.29849)"
             style="display:inline;fill:#4c4c4c">
            <path
               style="fill:#294172;fill-opacity:1;stroke-width:0.7;stroke-linecap:round;stroke-linejoin:round;stroke-dashoffset:1.13386;paint-order:fill markers stroke"
               d="m 71.978891,135.47645 c 0,0 -0.380513,-7.64517 -1.246839,-11.66538 -0.866327,-4.02022 -2.600269,-11.60593 -3.814124,-13.80371 -1.926398,-3.4879 -2.800066,-4.59744 -3.542133,-6.41166 -0.547411,-1.33832 -0.25826,-3.06284 1.44886,-1.79032 2.083441,1.55304 5.08053,6.96584 5.08053,6.96584 0,0 1.306684,1.71589 0.520051,-1.14568 -0.786632,-2.86157 -2.826557,-8.568759 -2.838923,-9.736614 -0.01236,-1.167853 0.01675,-3.051466 1.275429,-2.722912 1.258676,0.328554 2.240031,2.807642 3.08152,5.246796 0.841486,2.43915 1.963251,5.89655 1.963251,5.89655 0,0 0.55473,1.82473 0.253367,-1.01414 -0.301363,-2.83887 -0.406571,-5.522485 -0.614066,-7.006274 -0.207494,-1.483791 -0.447711,-3.305897 -0.289697,-4.492086 0.128719,-0.966278 2.212574,-3.086325 3.115734,1.715832 0.822116,4.371243 0.954568,7.073188 1.159157,8.278858 0.204589,1.20567 0.695964,3.57575 0.930718,1.25183 0.234757,-2.32391 0.949389,-7.425024 1.149251,-8.294434 0.390762,-1.699835 1.160731,-2.887997 2.339936,-1.817488 1.179206,1.07051 0.617885,8.605372 0.617885,8.605372 0,0 -0.416494,5.40304 -0.131525,6.65458 0.284967,1.25153 0.319485,4.10465 2.053733,2.31646 1.734246,-1.78818 3.298583,-4.60389 4.067847,-5.25108 0.710935,-0.59813 2.079046,-1.18553 2.88159,-0.41322 0.802542,0.77232 -1.727414,6.20856 -2.721932,8.68811 -0.994519,2.47955 -4.285454,5.61225 -4.623938,8.07489 -0.338482,2.46266 -0.624292,3.11774 0.317717,8.97022 0.942006,5.85248 1.81745,34.17514 1.81745,34.17514 l -4.316558,-0.10065 -10.002954,-6.46085 z"
               id="path88143"
               sodipodi:nodetypes="csssscsssscszsszssscssssssscccc" />
            <path
               style="fill:#3c6eb4;fill-opacity:1;stroke-width:0.7;stroke-linecap:round;stroke-linejoin:round;stroke-dashoffset:1.13386;paint-order:fill markers stroke"
               d="m 111.78189,121.01036 c 0.0538,-6.83438 0.38051,-7.64517 1.24684,-11.66538 0.86633,-4.02022 2.60027,-11.605923 3.81412,-13.803703 1.9264,-3.4879 2.80007,-4.597439 3.54214,-6.411659 0.54741,-1.33832 0.25826,-3.06284 -1.44886,-1.79032 -2.08344,1.55304 -5.08053,6.965839 -5.08053,6.965839 0,0 -1.30669,1.71589 -0.52005,-1.14568 0.78663,-2.861569 2.82655,-8.568758 2.83892,-9.736613 0.0124,-1.167853 -0.0168,-3.051466 -1.27543,-2.722912 -1.25868,0.328554 -2.24003,2.807642 -3.08152,5.246796 -0.84148,2.43915 -1.96325,5.89655 -1.96325,5.89655 0,0 -0.55473,1.824729 -0.25337,-1.01414 0.30137,-2.83887 0.40657,-5.522485 0.61407,-7.006274 0.20749,-1.483791 0.44771,-3.305897 0.2897,-4.492086 -0.12872,-0.966278 -2.21258,-3.086325 -3.11574,1.715832 -0.82211,4.371243 -0.95457,7.073188 -1.15915,8.278858 -0.20459,1.20567 -0.69597,3.575749 -0.93072,1.25183 -0.23476,-2.32391 -0.94939,-7.425024 -1.14925,-8.294434 -0.39077,-1.699835 -1.16073,-2.887997 -2.33994,-1.817488 -1.17921,1.07051 -0.61788,8.605372 -0.61788,8.605372 0,0 0.41649,5.403039 0.13152,6.654579 -0.28497,1.25153 -0.31948,4.10465 -2.053728,2.31646 -1.73425,-1.78818 -3.29859,-4.60389 -4.06785,-5.25108 -0.71093,-0.59813 -2.07905,-1.185529 -2.88159,-0.41322 -0.80254,0.77232 1.72741,6.20856 2.72193,8.688103 0.99452,2.47955 4.28546,5.61225 4.62394,8.07489 0.338478,2.46266 0.905518,3.17 -0.31772,8.97022 -1.713888,8.12671 -2.627289,46.55288 -2.627289,46.55288 l 7.979297,6.48307 10.00295,-6.46085 c 0,0 -2.97537,-36.84106 -2.92156,-43.67544 z"
               id="path88145"
               sodipodi:nodetypes="zsssscsssscszsszssscssssssscccz" />
            <path
               style="fill:#ffffff;fill-opacity:1;stroke-width:0.7;stroke-linecap:round;stroke-linejoin:round;stroke-dashoffset:1.13386;paint-order:fill markers stroke"
               d="m 140.88132,134.53681 c 0.0538,-6.83438 0.38051,-7.64517 1.24684,-11.66538 0.86633,-4.02022 2.60027,-11.60593 3.81412,-13.80371 1.9264,-3.4879 2.80007,-4.59744 3.54214,-6.41166 0.54741,-1.33832 0.25826,-3.062836 -1.44886,-1.79032 -2.08344,1.55304 -5.08053,6.96584 -5.08053,6.96584 0,0 -1.30669,1.71589 -0.52005,-1.14568 0.78663,-2.86157 2.82655,-8.568755 2.83892,-9.73661 0.0124,-1.167853 -0.0168,-3.051466 -1.27543,-2.722912 -1.25868,0.328554 -2.24003,2.807642 -3.08152,5.246796 -0.84148,2.439146 -1.96325,5.896546 -1.96325,5.896546 0,0 -0.55473,1.82473 -0.25337,-1.01414 0.30137,-2.83887 0.40657,-5.522481 0.61407,-7.00627 0.20749,-1.483791 0.44771,-3.305897 0.2897,-4.492086 -0.12872,-0.966278 -2.21258,-3.086325 -3.11574,1.715832 -0.82211,4.371243 -0.95457,7.073184 -1.15915,8.278854 -0.20459,1.20567 -0.69597,3.57575 -0.93072,1.25183 -0.23476,-2.32391 -0.94939,-7.42502 -1.14925,-8.29443 -0.39077,-1.699835 -1.16073,-2.887997 -2.33994,-1.817488 -1.17921,1.07051 -0.61788,8.605368 -0.61788,8.605368 0,0 0.41649,5.40304 0.13152,6.65458 -0.28497,1.25153 -0.31948,4.10465 -2.05373,2.31646 -1.73425,-1.78818 -3.29859,-4.60389 -4.06785,-5.25108 -0.71093,-0.59813 -2.07905,-1.18553 -2.88159,-0.41322 -0.80254,0.77232 1.72741,6.20856 2.72193,8.68811 0.99452,2.47955 4.28546,5.61225 4.62394,8.07489 0.33848,2.46266 0.90552,3.17 -0.31772,8.97022 -1.71388,8.12671 -2.89625,32.03274 -2.89625,32.03274 l 7.97929,6.48307 10.00295,-6.46085 c 0,0 -2.7064,-22.32092 -2.65259,-29.1553 z"
               id="path88147"
               sodipodi:nodetypes="zsssscsssscszsszssscssssssscccz" />
          </g>
        </g>
      </g>
    </g>
  </g>
</svg>
