<?xml version="1.0" encoding="UTF-8" standalone="no"?>
<!-- Created with Inkscape (http://www.inkscape.org/) -->

<svg
   width="512"
   height="512"
   viewBox="0 0 512 512"
   version="1.1"
   id="svg1"
   xml:space="preserve"
   inkscape:version="1.3.2 (091e20ef0f, 2023-11-25)"
   sodipodi:docname="CommOps2.0-Project.svg"
   xmlns:inkscape="http://www.inkscape.org/namespaces/inkscape"
   xmlns:sodipodi="http://sodipodi.sourceforge.net/DTD/sodipodi-0.dtd"
   xmlns="http://www.w3.org/2000/svg"
   xmlns:svg="http://www.w3.org/2000/svg"><sodipodi:namedview
     id="namedview1"
     pagecolor="#505050"
     bordercolor="#eeeeee"
     borderopacity="1"
     inkscape:showpageshadow="0"
     inkscape:pageopacity="0"
     inkscape:pagecheckerboard="0"
     inkscape:deskcolor="#505050"
     inkscape:document-units="px"
     inkscape:zoom="1"
     inkscape:cx="158.5"
     inkscape:cy="233.5"
     inkscape:window-width="1920"
     inkscape:window-height="1011"
     inkscape:window-x="0"
     inkscape:window-y="0"
     inkscape:window-maximized="1"
     inkscape:current-layer="g71"
     showguides="false" /><defs
     id="defs1" /><g
     inkscape:label="Camada 1"
     inkscape:groupmode="layer"
     id="layer1"><path
       style="fill:#000000"
       id="path8" /><g
       id="g71"
       transform="matrix(0.92834038,0,0,0.92834038,-498.95031,-86.36763)"><g
         id="text47"
         style="font-weight:bold;font-size:46.1647px;line-height:0.9;font-family:Montserrat;-inkscape-font-specification:'Montserrat Bold';text-align:center;letter-spacing:-2px;text-anchor:middle;fill:#294172;stroke-width:0;stroke-linecap:round;stroke-linejoin:round;paint-order:stroke fill markers"
         aria-label="COMMUNITY&#10;OPERATIONS"
         inkscape:export-filename="1.png"
         inkscape:export-xdpi="304.45969"
         inkscape:export-ydpi="304.45969"><path
           style="font-weight:600;-inkscape-font-specification:'Montserrat Semi-Bold';text-align:start;text-anchor:start"
           d="m 754.39218,294.20899 c 5.30894,0 9.83308,-1.89275 12.83379,-5.40127 l -3.87784,-3.69317 c -2.3544,2.58522 -5.26277,3.83167 -8.6328,3.83167 -6.69388,0 -11.54117,-4.7088 -11.54117,-11.35652 0,-6.64772 4.84729,-11.35652 11.54117,-11.35652 3.37003,0 6.2784,1.24645 8.6328,3.78551 l 3.87784,-3.64701 c -3.00071,-3.50852 -7.52485,-5.40127 -12.78762,-5.40127 -9.92541,0 -17.31177,6.97087 -17.31177,16.61929 0,9.64842 7.38636,16.61929 17.2656,16.61929 z m 31.00776,0 c 10.01774,0 17.40409,-7.01703 17.40409,-16.61929 0,-9.60226 -7.38635,-16.61929 -17.40409,-16.61929 -10.01774,0 -17.40409,7.0632 -17.40409,16.61929 0,9.55609 7.38635,16.61929 17.40409,16.61929 z m 0,-5.26277 c -6.50922,0 -11.35652,-4.75497 -11.35652,-11.35652 0,-6.60155 4.8473,-11.35652 11.35652,-11.35652 6.50922,0 11.35651,4.75497 11.35651,11.35652 0,6.60155 -4.84729,11.35652 -11.35651,11.35652 z m 57.09086,-27.51416 h -4.93963 l -12.60296,21.42042 -12.83379,-21.42042 h -4.93962 v 32.31528 h 5.72442 v -21.14343 l 10.61788,17.45026 h 2.67756 l 10.61788,-17.72725 0.0462,21.42042 h 5.67826 z m 42.08728,0 h -4.93962 l -12.60296,21.42042 -12.83379,-21.42042 h -4.93962 v 32.31528 h 5.72442 v -21.14343 l 10.61788,17.45026 h 2.67756 l 10.61788,-17.72725 0.0462,21.42042 h 5.67826 z m 20.66686,32.77693 c 8.81746,0 14.1264,-5.12428 14.1264,-14.54188 v -18.23505 h -5.90908 v 18.00423 c 0,6.64771 -2.95454,9.50993 -8.17115,9.50993 -5.21661,0 -8.21732,-2.86222 -8.21732,-9.50993 v -18.00423 h -6.00141 v 18.23505 c 0,9.4176 5.30894,14.54188 14.17256,14.54188 z m 43.28755,-10.89487 -17.81958,-21.88206 h -4.93962 v 32.31528 h 5.95525 v -21.88206 l 17.81957,21.88206 h 4.93962 v -32.31528 h -5.95524 z m 18.6356,10.43322 v -32.31528 h -6.00141 v 32.31528 z"
           id="path124" /><path
           style="font-weight:600;-inkscape-font-specification:'Montserrat Semi-Bold';text-align:start;letter-spacing:1px;text-anchor:start"
           d="m 986.45002,293.74734 v -27.23717 h 10.71021 v -5.07811 H 969.7384 v 5.07811 h 10.71021 v 27.23717 z"
           id="path125" /><path
           style="font-weight:600;-inkscape-font-specification:'Montserrat Semi-Bold';text-align:start;text-anchor:start"
           d="m 1023.3661,261.43206 -9.556,15.74216 -9.4638,-15.74216 h -6.4169 l 12.6953,21.00493 v 11.31035 h 6.0014 v -11.40268 l 12.6491,-20.9126 z"
           id="path126" /><path
           style="font-weight:600;-inkscape-font-specification:'Montserrat Semi-Bold';text-align:start;text-anchor:start"
           d="m 754.53068,335.75722 c 10.01774,0 17.40409,-7.01703 17.40409,-16.61929 0,-9.60226 -7.38635,-16.61929 -17.40409,-16.61929 -10.01774,0 -17.4041,7.0632 -17.4041,16.61929 0,9.55609 7.38636,16.61929 17.4041,16.61929 z m 0,-5.26278 c -6.50923,0 -11.35652,-4.75496 -11.35652,-11.35651 0,-6.60155 4.84729,-11.35652 11.35652,-11.35652 6.50922,0 11.35651,4.75497 11.35651,11.35652 0,6.60155 -4.84729,11.35651 -11.35651,11.35651 z m 21.77486,-27.51416 v 32.31529 h 6.00141 v -9.32527 h 7.29402 c 8.49431,0 13.75708,-4.38564 13.75708,-11.49501 0,-7.15552 -5.26277,-11.49501 -13.75708,-11.49501 z m 6.00141,17.91191 V 308.0584 h 7.01703 c 5.26278,0 7.9865,2.3544 7.9865,6.41689 0,4.0625 -2.72372,6.4169 -7.9865,6.4169 z m 31.0539,0.46164 h 15.60367 v -4.93962 h -15.60367 v -8.40197 h 17.58875 v -5.03196 h -23.59016 v 32.31529 h 24.23647 v -5.03195 h -18.23506 z m 43.10292,3.32386 c 4.38565,-1.70809 6.87854,-5.30894 6.87854,-10.2024 0,-7.15552 -5.26277,-11.49501 -13.75708,-11.49501 H 836.2898 v 32.31529 h 6.00141 v -9.4176 h 7.29402 c 0.41548,0 0.83097,0 1.24645,-0.0462 l 6.60155,9.46376 h 6.46306 z m 0.83097,-10.2024 c 0,4.0625 -2.72372,6.46306 -7.9865,6.46306 h -7.01703 V 308.0584 h 7.01703 c 5.26278,0 7.9865,2.3544 7.9865,6.41689 z m 41.21019,20.82028 -14.58804,-32.31529 h -5.90909 l -14.54188,32.31529 h 6.18607 l 3.18537,-7.47868 H 888.995 l 3.23153,7.47868 z m -17.58875,-26.31388 6.09374,14.1264 H 874.8686 Z m 30.63849,26.31388 V 308.0584 h 10.71021 v -5.07812 h -27.42183 v 5.07812 h 10.71021 v 27.23717 z m 19.23572,0 v -32.31529 h -6.00141 v 32.31529 z m 21.82099,0.46165 c 10.01774,0 17.40409,-7.01703 17.40409,-16.61929 0,-9.60226 -7.38635,-16.61929 -17.40409,-16.61929 -10.01774,0 -17.40409,7.0632 -17.40409,16.61929 0,9.55609 7.38635,16.61929 17.40409,16.61929 z m 0,-5.26278 c -6.50922,0 -11.35652,-4.75496 -11.35652,-11.35651 0,-6.60155 4.8473,-11.35652 11.35652,-11.35652 6.50922,0 11.35652,4.75497 11.35652,11.35652 0,6.60155 -4.8473,11.35651 -11.35652,11.35651 z m 44.53407,-5.63209 -17.81958,-21.88207 h -4.93962 v 32.31529 h 5.95525 v -21.88206 l 17.81957,21.88206 h 4.93963 v -32.31529 h -5.95525 z m 22.65195,10.89487 c 8.8636,0 13.0646,-4.43181 13.0646,-9.60226 0,-11.86432 -19.1584,-7.38635 -19.1584,-14.26489 0,-2.44673 2.0313,-4.38565 7.0171,-4.38565 2.816,0 6.0014,0.83097 8.9098,2.53906 l 1.8927,-4.66263 c -2.816,-1.84659 -6.8785,-2.86221 -10.7564,-2.86221 -8.8636,0 -13.0184,4.43181 -13.0184,9.64842 0,12.00282 19.2045,7.43252 19.2045,14.40339 0,2.40056 -2.1236,4.20098 -7.1555,4.20098 -3.9702,0 -8.0788,-1.47727 -10.6641,-3.55468 l -2.0774,4.66264 c 2.6776,2.30823 7.7095,3.87783 12.7415,3.87783 z"
           id="path127" /></g><g
         style="fill:#51a2da;fill-opacity:1;-webkit-print-color-adjust:exact"
         id="g63"
         transform="translate(180.08729,165.24262)"><g
           id="g62"
           rx="0"
           ry="0"
           style="fill:#51a2da;fill-opacity:1"><g
             id="g61"
             rx="0"
             ry="0"
             style="fill:#51a2da;fill-opacity:1"
             transform="matrix(0.10913285,0,0,0.10913285,512.09962,51.620517)"><g
               id="g48"
               style="fill:#51a2da;fill-opacity:1"><g
                 id="g47"
                 style="fill:#51a2da;fill-opacity:1"><path
                   rx="0"
                   ry="0"
                   d="m 557.997,146.523 c -28.544,10.981 -47.917,37.956 -47.997,71.253 -0.083,34.879 24.473,79.892 75.327,80.224 34.205,0.224 51.31,-12.509 60.545,-21.154 6.125,-5.403 6.554,-14.779 0.941,-20.703 -5.624,-5.935 -15.066,-6.078 -20.855,-0.304 -6.893,6.445 -17.043,15.997 -45.829,12.816 -12.352,-1.361 -25.623,-11.343 -30.053,-18.98 l 94.317,-39.915 c 7.212,-3.189 10.525,-11.522 7.472,-18.762 -16.837,-32.979 -46.69,-62.625 -93.868,-44.475 z m 59.2,43.385 -78.484,33.369 c -5.604,-20.818 17.366,-45.31 29.896,-49.868 18.787,-6.833 39.515,0.857 48.588,16.499 z"
                   style="fill:#51a2da;fill-opacity:1;fill-rule:evenodd;stroke:none"
                   id="path47" /></g></g><g
               id="g50"
               style="fill:#51a2da;fill-opacity:1"><g
                 id="g49"
                 style="fill:#51a2da;fill-opacity:1"><path
                   rx="0"
                   ry="0"
                   d="m 921.51,140 c -21.088,-0.002 -41.313,8.321 -56.225,23.139 -14.911,14.818 -23.287,34.916 -23.285,55.871 0.006,43.63 35.604,78.995 79.51,78.99 43.899,-0.006 79.484,-35.368 79.49,-78.99 0,-43.63 -35.583,-79.004 -79.49,-79.01 z m 0,29.593 c 13.189,0 25.838,5.207 35.165,14.474 9.326,9.268 14.565,21.837 14.565,34.943 0,13.106 -5.239,25.676 -14.565,34.943 -9.327,9.268 -21.976,14.474 -35.165,14.474 -13.189,0 -25.838,-5.206 -35.164,-14.474 -9.326,-9.267 -14.566,-21.837 -14.565,-34.943 -10e-4,-13.106 5.239,-25.676 14.565,-34.943 9.326,-9.268 21.975,-14.474 35.164,-14.474 z"
                   style="fill:#51a2da;fill-opacity:1;stroke-linejoin:round"
                   id="path48" /></g></g><g
               id="g52"
               style="fill:#51a2da;fill-opacity:1"><g
                 id="g51"
                 style="fill:#51a2da;fill-opacity:1"><path
                   rx="0"
                   ry="0"
                   d="m 1036.737,141 c -12.678,0 -14.791,10.409 -14.724,14.608 v 126.413 c -0.347,8.172 6.452,14.979 14.961,14.979 8.51,0 15.309,-6.807 14.962,-14.979 0,0 0.225,-47.013 0,-77.108 -0.226,-30.095 24.392,-36.618 32.957,-36.618 6.361,0 11.443,3.525 16.483,3.337 7.481,-0.28 13.624,-5.272 13.624,-14.025 -0.225,-14.14 -17.661,-16.147 -30.515,-15.886 -12.855,0.262 -23.712,4.189 -33.112,9.774 0,0 -1.959,-10.495 -14.636,-10.495 z"
                   style="color:#000000;font-style:normal;font-variant:normal;font-weight:normal;font-stretch:normal;font-size:medium;line-height:normal;font-family:sans-serif;font-feature-settings:normal;text-indent:0px;text-align:start;text-decoration:none;text-decoration-line:none;text-decoration-style:solid;text-decoration-color:#000000;letter-spacing:normal;word-spacing:normal;text-transform:none;writing-mode:lr-tb;direction:ltr;text-orientation:mixed;dominant-baseline:auto;baseline-shift:baseline;text-anchor:start;white-space:normal;clip-rule:nonzero;display:inline;overflow:visible;visibility:visible;isolation:auto;mix-blend-mode:normal;vector-effect:none;fill:#51a2da;fill-opacity:1;fill-rule:nonzero;stroke:none;stroke-linejoin:round;stroke-miterlimit:4;stroke-dasharray:none;stroke-dashoffset:0;color-rendering:auto;image-rendering:auto;shape-rendering:auto;text-rendering:auto"
                   id="path50" /></g></g><g
               id="g55"
               rx="0"
               ry="0"
               style="fill:#51a2da;fill-opacity:1"><g
                 id="g54"
                 style="fill:#51a2da;fill-opacity:1"><g
                   id="g53"
                   style="fill:#51a2da;fill-opacity:1"><path
                     rx="0"
                     ry="0"
                     d="m 1181.619,140 c -19.899,0 -34.25,5.906 -44.711,13.396 -15.858,11.361 1.208,35.115 17.066,23.754 7.218,-5.168 12.585,-7.925 27.645,-7.925 18.746,0.377 33.824,7.428 33.824,21.457 -10.05,6.364 -53.747,11.624 -77.211,24.975 -23.464,13.352 -22.221,30.204 -22.221,41.138 0,23.985 25.266,40.166 47.149,40.166 21.884,0 31.174,-4.593 52.583,-19.274 v 4.202 c -0.692,20.148 29.937,20.148 29.245,0 v -86.107 c 0.095,-35.71 -25.529,-55.238 -63.369,-55.782 z m 34.839,79.451 c -0.01,9.469 0.131,12.198 -0.129,21.664 -0.057,11.367 -7.193,16.637 -14.665,20.986 -7.473,4.349 -22.651,8.164 -31.446,8.581 -10.144,0.336 -23.602,-1.957 -24.309,-13.995 0.01,-7.267 3.525,-11.773 9.301,-16.792 13.677,-10.268 32.21,-13.715 61.248,-20.444 z"
                     style="color:#000000;font-style:normal;font-variant:normal;font-weight:normal;font-stretch:normal;font-size:medium;line-height:normal;font-family:sans-serif;font-feature-settings:normal;text-indent:0px;text-align:start;text-decoration:none;text-decoration-line:none;text-decoration-style:solid;text-decoration-color:#000000;letter-spacing:normal;word-spacing:normal;text-transform:none;writing-mode:lr-tb;direction:ltr;text-orientation:mixed;dominant-baseline:auto;baseline-shift:baseline;text-anchor:start;white-space:normal;clip-rule:nonzero;display:inline;overflow:visible;visibility:visible;opacity:1;isolation:auto;mix-blend-mode:normal;vector-effect:none;fill:#51a2da;fill-opacity:1;fill-rule:nonzero;stroke:none;stroke-linejoin:miter;stroke-miterlimit:4;stroke-dasharray:none;stroke-dashoffset:0;color-rendering:auto;image-rendering:auto;shape-rendering:auto;text-rendering:auto"
                     id="path52" /></g></g></g><g
               id="g57"
               style="fill:#51a2da;fill-opacity:1"><g
                 id="g56"
                 style="fill:#51a2da;fill-opacity:1"><path
                   rx="0"
                   ry="0"
                   d="m 810.221,75.023 c -9.139,-0.543 -15.867,8.471 -14.465,17.035 v 66.118 c -28.848,-24.102 -75.83,-22.426 -102.461,4.262 -26.932,23.914 -32.048,67.28 -12.461,97.144 14.389,22.546 40.708,38.624 67.832,37.347 17.056,-0.155 33.975,-7.474 47.09,-18.313 -1.346,8.557 5.285,17.594 14.465,17.044 9.01,0.4 15.987,-8.462 14.604,-17.034 -0.157,-63.592 0.156,-127.188 -0.157,-190.778 -0.469,-7.172 -7.352,-13.068 -14.447,-12.825 z m -63.284,95.012 c 26.045,-0.677 49.309,22.688 48.819,48.402 0.547,25.739 -22.796,49.064 -48.819,48.403 -24.742,0.654 -47.423,-20.233 -48.687,-44.718 -2.635,-25.24 18.159,-49.842 43.629,-51.845 1.68,-0.164 3.369,-0.242 5.058,-0.242 z"
                   style="font-style:normal;font-variant:normal;font-weight:bold;font-stretch:normal;font-size:medium;line-height:25px;font-family:Comfortaa;letter-spacing:0px;word-spacing:0px;fill:#51a2da;fill-opacity:1;stroke:none;stroke-linejoin:miter"
                   id="path55" /></g></g><g
               id="g60"
               rx="0"
               ry="0"
               style="fill:#51a2da;fill-opacity:1"><g
                 id="g59"
                 style="fill:#51a2da;fill-opacity:1"><g
                   id="g58"
                   style="fill:#51a2da;fill-opacity:1"><path
                     rx="0"
                     ry="0"
                     d="m 428,127.386 v 155.259 c -0.041,19.14 29.008,19.14 28.966,0 V 179.034 h 29.793 c 6.968,0 12.924,-5.059 12.924,-13.181 0,-8.122 -6.381,-13.055 -12.924,-13.055 h -29.793 v -23.881 c 0,-15.28 11.919,-27.982 35.911,-27.688 8.345,0.109 11.302,2.121 14.35,3.984 16.639,11.054 32.656,-14.547 15.229,-24.34 C 511.768,74.312 501.782,72 489.867,72 452.318,72 428.22,100.608 428,127.386 Z"
                     style="font-style:normal;font-variant:normal;font-weight:bold;font-stretch:normal;font-size:medium;line-height:25px;font-family:Comfortaa;letter-spacing:0px;word-spacing:0px;fill:#51a2da;fill-opacity:1;stroke:none;stroke-linejoin:miter;stroke-miterlimit:4;stroke-dasharray:none"
                     id="path57" /></g></g></g></g></g></g><path
         style="fill:#51a2da;stroke-width:1.05695"
         d="m 611.08621,343.16695 c -6.29134,-0.55925 -11.193,-4.87968 -12.64427,-11.14492 -0.27248,-1.17627 -0.27553,-1.41475 -0.32126,-25.07111 -0.0487,-25.19412 0.0194,-29.79354 0.49736,-33.58211 1.2256,-9.7151 4.62422,-18.83228 10.05461,-26.97263 5.06578,-7.59378 12.28547,-14.39673 20.21166,-19.04498 13.57658,-7.9619 29.85883,-10.47987 45.31985,-7.00852 9.83181,2.20747 19.54643,7.17376 27.20405,13.90721 1.90032,1.67097 5.21753,5.07849 6.80312,6.98831 11.10111,13.37111 16.07262,30.60585 13.83592,47.965 -1.69762,13.17531 -7.84131,25.79164 -17.18311,35.28622 -3.88699,3.95057 -7.95452,7.18148 -12.4084,9.85623 -6.97732,4.19016 -15.00921,7.08085 -22.84827,8.2231 -4.60143,0.67049 -3.63269,0.64959 -31.40487,0.67761 -14.26085,0.0144 -26.46323,-0.0213 -27.11639,-0.0794 z"
         id="path63"
         sodipodi:nodetypes="ssscssssssssssss"
         inkscape:export-filename="3.png"
         inkscape:export-xdpi="425.39124"
         inkscape:export-ydpi="425.39124" /><path
         style="color:#000000;fill:none;stroke-width:1.07719111;stroke-linecap:round;stroke-linejoin:round;paint-order:stroke fill markers;stroke-dasharray:none;stroke:#ffffff;stroke-opacity:1"
         d="m 660.33945,230.68996 c -27.79836,0 -50.34567,22.5473 -50.34567,50.34567 0,27.79838 22.54731,50.34362 50.34567,50.34362 27.79838,0 50.34569,-22.54524 50.34569,-50.34362 0,-27.79837 -22.54731,-50.34567 -50.34569,-50.34567 z m 0,1.07759 c 27.21622,0 49.2681,22.05187 49.26809,49.26808 0,27.21622 -22.05187,49.26603 -49.26809,49.26603 -27.2162,0 -49.26808,-22.04981 -49.26808,-49.26603 0,-27.21621 22.05188,-49.26808 49.26808,-49.26808 z"
         id="path1" /><path
         style="color:#000000;fill:none;stroke-width:1.07719111;stroke-linecap:round;stroke-linejoin:round;paint-order:stroke fill markers;stroke:#ffffff;stroke-opacity:1;stroke-dasharray:none"
         d="m 660.33945,242.52907 c -21.25986,0 -38.50655,17.2467 -38.50655,38.50656 0,21.25987 17.24669,38.5045 38.50655,38.5045 21.25987,0 38.50656,-17.24463 38.50656,-38.5045 0,-21.25986 -17.24669,-38.50656 -38.50656,-38.50656 z m 0,1.0776 c 20.67772,0 37.42897,16.75126 37.42897,37.42896 0,20.67771 -16.75125,37.42897 -37.42897,37.42897 -20.6777,0 -37.42896,-16.75126 -37.42896,-37.42897 0,-20.6777 16.75126,-37.42896 37.42896,-37.42896 z"
         id="circle1" /><path
         style="fill:#ffffff;stroke-width:0.104482"
         d="m 690.45238,299.64024 c -0.62191,-0.0553 -1.10645,-0.48236 -1.24991,-1.1017 -0.0269,-0.11628 -0.0273,-0.13985 -0.0318,-2.47834 -0.005,-2.4905 0.002,-2.94516 0.0491,-3.31967 0.12115,-0.96036 0.45712,-1.86161 0.99392,-2.6663 0.50076,-0.75067 1.21445,-1.42316 1.99797,-1.88265 1.34208,-0.78705 2.95162,-1.03596 4.47997,-0.69281 0.9719,0.21822 1.93222,0.70914 2.68919,1.37476 0.18785,0.16518 0.51577,0.50202 0.67251,0.69081 1.09737,1.32177 1.58881,3.02547 1.36771,4.74145 -0.16782,1.30241 -0.77513,2.54957 -1.69859,3.48813 -0.38424,0.39053 -0.78632,0.7099 -1.2266,0.97431 -0.68972,0.41421 -1.48369,0.69996 -2.25861,0.81287 -0.45486,0.0663 -0.35909,0.0643 -3.10444,0.067 -1.40972,10e-4 -2.61595,-0.002 -2.68052,-0.007 z"
         id="path3" /><path
         style="fill:#ffffff;stroke-width:0.104482"
         d="m 620.54536,275.65237 c -0.62191,-0.0553 -1.10645,-0.48236 -1.24991,-1.10171 -0.027,-0.11627 -0.0273,-0.13984 -0.0318,-2.47833 -0.005,-2.4905 0.002,-2.94516 0.0492,-3.31967 0.12114,-0.96036 0.45711,-1.86162 0.99391,-2.66631 0.50077,-0.75067 1.21445,-1.42315 1.99797,-1.88264 1.34208,-0.78705 2.95162,-1.03596 4.47998,-0.69281 0.9719,0.21821 1.93221,0.70914 2.68918,1.37475 0.18785,0.16519 0.51577,0.50203 0.67251,0.69082 1.09737,1.32176 1.58881,3.02547 1.36771,4.74145 -0.16781,1.30241 -0.77513,2.54956 -1.69859,3.48813 -0.38423,0.39052 -0.78632,0.7099 -1.22659,0.97431 -0.68973,0.41421 -1.4837,0.69996 -2.25862,0.81287 -0.45486,0.0663 -0.35909,0.0643 -3.10444,0.067 -1.40971,10e-4 -2.61595,-0.002 -2.68052,-0.007 z"
         id="path6" /><path
         style="fill:#ffffff;stroke-width:0.104482"
         d="m 626.62487,327.76962 c -0.62191,-0.0553 -1.10645,-0.48236 -1.24991,-1.10171 -0.027,-0.11627 -0.0273,-0.13984 -0.0318,-2.47833 -0.005,-2.4905 0.002,-2.94516 0.0492,-3.31967 0.12114,-0.96036 0.45711,-1.86162 0.99391,-2.66631 0.50077,-0.75067 1.21445,-1.42315 1.99797,-1.88264 1.34208,-0.78705 2.95162,-1.03596 4.47998,-0.69281 0.9719,0.21821 1.93221,0.70914 2.68918,1.37475 0.18785,0.16519 0.51577,0.50203 0.67251,0.69082 1.09737,1.32176 1.58881,3.02547 1.36771,4.74145 -0.16781,1.30241 -0.77513,2.54956 -1.69859,3.48813 -0.38423,0.39052 -0.78632,0.7099 -1.22659,0.97431 -0.68973,0.41421 -1.4837,0.69996 -2.25862,0.81287 -0.45486,0.0663 -0.35909,0.0643 -3.10444,0.067 -1.40971,10e-4 -2.61595,-0.002 -2.68052,-0.007 z"
         id="path18" /><path
         style="fill:#ffffff;stroke-width:0.104482"
         d="m 673.31689,240.80991 c -0.62191,-0.0553 -1.10645,-0.48236 -1.24991,-1.10171 -0.027,-0.11627 -0.0273,-0.13984 -0.0318,-2.47833 -0.005,-2.4905 0.002,-2.94516 0.0492,-3.31967 0.12114,-0.96036 0.45711,-1.86162 0.99391,-2.66631 0.50077,-0.75067 1.21445,-1.42315 1.99797,-1.88264 1.34208,-0.78705 2.95162,-1.03596 4.47998,-0.69281 0.9719,0.21821 1.93221,0.70914 2.68918,1.37475 0.18785,0.16519 0.51577,0.50203 0.67251,0.69082 1.09737,1.32176 1.58881,3.02547 1.36771,4.74145 -0.16781,1.30241 -0.77513,2.54956 -1.69859,3.48813 -0.38423,0.39052 -0.78632,0.7099 -1.22659,0.97431 -0.68973,0.41421 -1.4837,0.69996 -2.25862,0.81287 -0.45486,0.0663 -0.35909,0.0643 -3.10444,0.067 -1.40971,0.001 -2.61595,-0.002 -2.68052,-0.007 z"
         id="path19" /><g
         id="g28"
         transform="translate(-210.97076,-3.0750223)"><path
           style="fill:#ffffff;stroke-width:1.05695"
           d="m 611.08621,343.16695 c -6.29134,-0.55925 -11.193,-4.87968 -12.64427,-11.14492 -0.27248,-1.17627 -0.27553,-1.41475 -0.32126,-25.07111 -0.0487,-25.19412 0.0194,-29.79354 0.49736,-33.58211 1.2256,-9.7151 4.62422,-18.83228 10.05461,-26.97263 5.06578,-7.59378 12.28547,-14.39673 20.21166,-19.04498 13.57658,-7.9619 29.85883,-10.47987 45.31985,-7.00852 9.83181,2.20747 19.54643,7.17376 27.20405,13.90721 1.90032,1.67097 5.21753,5.07849 6.80312,6.98831 11.10111,13.37111 16.07262,30.60585 13.83592,47.965 -1.69762,13.17531 -7.84131,25.79164 -17.18311,35.28622 -3.88699,3.95057 -7.95452,7.18148 -12.4084,9.85623 -6.97732,4.19016 -15.00921,7.08085 -22.84827,8.2231 -4.60143,0.67049 -3.63269,0.64959 -31.40487,0.67761 -14.26085,0.0144 -26.46323,-0.0213 -27.11639,-0.0794 z"
           id="path20" /><path
           style="fill:#51a2da;stroke-width:1.05695"
           d="m 611.08621,343.16695 c -6.29134,-0.55925 -11.193,-4.87968 -12.64427,-11.14492 -0.27248,-1.17627 -0.27553,-1.41475 -0.32126,-25.07111 -0.0487,-25.19412 0.0194,-29.79354 0.49736,-33.58211 1.2256,-9.7151 4.62422,-18.83228 10.05461,-26.97263 5.06578,-7.59378 12.28547,-14.39673 20.21166,-19.04498 13.57658,-7.9619 29.85883,-10.47987 45.31985,-7.00852 9.83181,2.20747 19.54643,7.17376 27.20405,13.90721 1.90032,1.67097 5.21753,5.07849 6.80312,6.98831 11.10111,13.37111 16.07262,30.60585 13.83592,47.965 -1.69762,13.17531 -7.84131,25.79164 -17.18311,35.28622 -3.88699,3.95057 -7.95452,7.18148 -12.4084,9.85623 -6.97732,4.19016 -15.00921,7.08085 -22.84827,8.2231 -4.60143,0.67049 -3.63269,0.64959 -31.40487,0.67761 -14.26085,0.0144 -26.46323,-0.0213 -27.11639,-0.0794 z"
           id="path21"
           sodipodi:nodetypes="ssscssssssssssss" /><path
           style="color:#000000;fill:#ffffff;stroke-width:1.05695;stroke-linecap:round;stroke-linejoin:round;-inkscape-stroke:none;paint-order:stroke fill markers"
           d="m 660.33945,230.68996 c -27.79836,0 -50.34567,22.5473 -50.34567,50.34567 0,27.79838 22.54731,50.34362 50.34567,50.34362 27.79838,0 50.34569,-22.54524 50.34569,-50.34362 0,-27.79837 -22.54731,-50.34567 -50.34569,-50.34567 z m 0,1.07759 c 27.21622,0 49.2681,22.05187 49.26809,49.26808 0,27.21622 -22.05187,49.26603 -49.26809,49.26603 -27.2162,0 -49.26808,-22.04981 -49.26808,-49.26603 0,-27.21621 22.05188,-49.26808 49.26808,-49.26808 z"
           id="path22" /><path
           style="color:#000000;fill:#ffffff;stroke-width:1.05695;stroke-linecap:round;stroke-linejoin:round;-inkscape-stroke:none;paint-order:stroke fill markers"
           d="m 660.33945,242.52907 c -21.25986,0 -38.50655,17.2467 -38.50655,38.50656 0,21.25987 17.24669,38.5045 38.50655,38.5045 21.25987,0 38.50656,-17.24463 38.50656,-38.5045 0,-21.25986 -17.24669,-38.50656 -38.50656,-38.50656 z m 0,1.0776 c 20.67772,0 37.42897,16.75126 37.42897,37.42896 0,20.67771 -16.75125,37.42897 -37.42897,37.42897 -20.6777,0 -37.42896,-16.75126 -37.42896,-37.42897 0,-20.6777 16.75126,-37.42896 37.42896,-37.42896 z"
           id="path23" /><path
           style="fill:#ffffff;stroke-width:0.104482"
           d="m 692.60676,293.1771 c -0.62191,-0.0553 -1.10645,-0.48236 -1.24991,-1.1017 -0.0269,-0.11628 -0.0273,-0.13985 -0.0318,-2.47834 -0.005,-2.4905 0.002,-2.94516 0.0491,-3.31967 0.12115,-0.96036 0.45712,-1.86161 0.99392,-2.6663 0.50076,-0.75067 1.21445,-1.42316 1.99797,-1.88265 1.34208,-0.78705 2.95162,-1.03596 4.47997,-0.69281 0.9719,0.21822 1.93222,0.70914 2.68919,1.37476 0.18785,0.16518 0.51577,0.50202 0.67251,0.69081 1.09737,1.32177 1.58881,3.02547 1.36771,4.74145 -0.16782,1.30241 -0.77513,2.54957 -1.69859,3.48813 -0.38424,0.39053 -0.78632,0.7099 -1.2266,0.97431 -0.68972,0.41421 -1.48369,0.69996 -2.25861,0.81287 -0.45486,0.0663 -0.35909,0.0643 -3.10444,0.067 -1.40972,0.001 -2.61595,-0.002 -2.68052,-0.007 z"
           id="path24" /><path
           style="fill:#ffffff;stroke-width:0.104482"
           d="m 624.85412,264.88047 c -0.62191,-0.0553 -1.10645,-0.48236 -1.24991,-1.10171 -0.027,-0.11627 -0.0273,-0.13984 -0.0318,-2.47833 -0.005,-2.4905 0.002,-2.94516 0.0492,-3.31967 0.12114,-0.96036 0.45711,-1.86162 0.99391,-2.66631 0.50077,-0.75067 1.21445,-1.42315 1.99797,-1.88264 1.34208,-0.78705 2.95162,-1.03596 4.47998,-0.69281 0.9719,0.21821 1.93221,0.70914 2.68918,1.37475 0.18785,0.16519 0.51577,0.50203 0.67251,0.69082 1.09737,1.32176 1.58881,3.02547 1.36771,4.74145 -0.16781,1.30241 -0.77513,2.54956 -1.69859,3.48813 -0.38423,0.39052 -0.78632,0.7099 -1.22659,0.97431 -0.68973,0.41421 -1.4837,0.69996 -2.25862,0.81287 -0.45486,0.0663 -0.35909,0.0643 -3.10444,0.067 -1.40971,10e-4 -2.61595,-0.002 -2.68052,-0.007 z"
           id="path25" /><path
           id="path26"
           style="color:#000000;fill:#ffffff;fill-opacity:1;stroke:none;stroke-width:0.732834;stroke-linecap:round;stroke-linejoin:bevel;stroke-opacity:1;-inkscape-stroke:none;paint-order:stroke fill markers"
           d="m 655.84063,258.73919 -0.78308,0.78307 v 0.6033 l 0.78308,0.78308 h 4.33371 l -0.72603,0.003 c -0.20715,1.72581 -0.0847,3.37725 -0.19188,4.89551 -0.0937,0.20329 -0.20319,0.43017 -0.25411,0.5549 -0.0628,0.15384 -0.0718,0.14902 -0.057,0.14175 -0.48973,0.21912 -0.94804,0.33254 -1.43305,0.28177 -0.0327,-0.003 -0.0657,-0.005 -0.0985,-0.005 -4.18111,0.0388 -8.38155,-0.007 -12.5949,0.10373 -0.53843,0.0136 -0.94002,0.50089 -0.85049,1.032 0.14658,0.87501 0.39301,1.82377 0.57217,2.54111 5.6e-4,0.002 8.3e-4,0.005 0.002,0.007 0.93605,3.63052 1.91576,7.24085 2.84189,10.85762 -0.0776,0.3957 -0.12982,0.70883 -0.16422,0.86086 -0.35012,0.25978 -0.64425,0.49637 -0.83494,0.47365 -0.0482,-0.007 -0.0967,-0.009 -0.1452,-0.007 -1.63209,0.0776 -3.32931,0.002 -5.08049,0.12101 -0.49746,0.0329 -0.86964,0.46995 -0.82284,0.96631 0.10399,1.11594 0.35827,2.18094 0.53761,3.09081 8.2e-4,0.004 0.002,0.008 0.003,0.0121 0.75828,3.57373 1.50054,7.09351 2.36825,10.64672 0.0857,0.34828 0.37309,0.61041 0.72776,0.6638 1.39581,0.21243 2.68597,0.0656 3.81512,0.14348 0.20762,0.093 0.43708,0.20105 0.56354,0.25065 0.14692,0.0576 0.13503,0.0588 0.13137,0.0484 0.20935,0.50236 0.35192,0.90609 0.30079,1.255 -0.006,0.043 -0.009,0.0863 -0.009,0.12965 0.0278,10.06879 -0.18455,7.64308 -0.17379,17.72493 1.03141,0.32866 3.32166,1.04809 6.18228,1.43958 3.02131,0.41348 6.18635,0.54059 9.79572,0.16719 3.52728,-0.3649 6.49585,-1.28655 7.08318,-1.46193 0.008,-0.36493 -0.0111,-1.39885 -0.004,-1.76378 0.20268,-9.93609 0.24665,-6.80077 0.22818,-16.73346 0.17521,-0.36519 0.30242,-0.65441 0.37166,-0.79171 0.47078,-0.18468 0.88251,-0.34934 1.20141,-0.30078 0.0486,0.007 0.0978,0.011 0.14693,0.0103 0.94898,-0.0131 1.98459,0.0442 3.08045,-0.11754 0.35581,-0.053 0.64416,-0.31606 0.72949,-0.66553 0.91116,-3.73749 1.69351,-7.44671 2.48752,-11.20854 0.002,-0.007 0.002,-0.015 0.003,-0.0225 0.0883,-0.47468 0.2483,-1.21831 0.344,-1.87903 0.0815,-0.22499 0.13795,-0.476 0.0518,-0.78653 -0.1079,-0.38921 -0.47146,-0.67121 -0.72085,-0.76234 -0.49877,-0.18224 -0.79177,-0.0998 -0.98187,-0.10026 -1.66796,-0.0891 -3.22728,0.0306 -4.65697,-0.16768 -0.25203,-0.21808 -0.47773,-0.41536 -0.57737,-0.50995 -0.0578,-0.49849 -0.0876,-0.94565 0.057,-1.30858 0.0132,-0.035 0.0241,-0.0708 0.0329,-0.10718 0.87057,-3.3887 1.82356,-6.90144 2.68113,-10.22493 5.9e-4,-0.002 8.2e-4,-0.006 0.002,-0.009 0.19365,-0.79267 0.41073,-1.61576 0.55662,-2.48233 0.0895,-0.53112 -0.31205,-1.0184 -0.85049,-1.032 -4.48303,-0.11278 -8.95427,-0.0691 -13.40736,-0.10717 -0.36489,-0.17713 -0.65317,-0.30486 -0.78999,-0.37513 -0.18269,-0.46782 -0.34558,-0.87941 -0.29733,-1.19794 0.007,-0.0481 0.01,-0.0967 0.009,-0.14521 -0.0192,-1.31953 0.0473,-2.72143 -0.0968,-4.15048 h 3.60596 l 0.78307,-0.78307 v -0.6033 l -0.78307,-0.78308 z m 4.48929,9.9812 c 0.003,10e-6 0.007,-1e-5 0.0104,0 4.24865,0.0214 8.48514,-0.0119 12.70381,0.0899 0.41305,0.53345 0.80536,1.01763 1.08731,1.45378 -0.18384,0.74893 -0.35905,1.48799 -0.58601,2.15217 -0.18783,0.22893 -0.3742,0.47523 -0.47192,0.58773 -0.13429,0.15459 -0.0907,0.12437 -0.14866,0.12447 -0.0242,1.5e-4 -0.0485,0.002 -0.0726,0.003 -1.44759,0.12027 -2.99318,0.0237 -4.59128,0.0622 -6.60085,-0.007 -13.18804,0.0866 -19.76013,-0.0294 -0.29828,-0.01 -0.57934,-0.0397 -0.74678,-0.0951 -0.16744,-0.0554 -0.19204,-0.0783 -0.23336,-0.16248 -0.0454,-0.0936 -0.10676,-0.17841 -0.18151,-0.25066 -0.38496,-0.36764 -0.42799,-1.14618 -0.77098,-2.21093 -0.0157,-0.0435 -0.0348,-0.0857 -0.057,-0.1262 0.0281,-0.0541 0.12707,-0.19622 0.28695,-0.41487 l -0.0277,0.0329 c 0.44636,-0.55035 0.62994,-0.92126 0.80728,-1.12708 4.23525,-0.10175 8.4878,-0.0694 12.7522,-0.0899 z m -14.39961,4.96639 c 0.0168,0.0344 0.0592,0.0311 0.0778,0.0639 0.0534,0.0595 0.0468,0.12909 0.10719,0.1867 z m 1.5748,1.10806 c 0.0104,0.002 0.0191,0.002 0.0294,0.005 -0.007,0.0102 -0.0138,0.0192 -0.0208,0.0294 -0.003,-0.0112 -0.006,-0.0234 -0.009,-0.0346 z m 25.64271,0.0415 c -0.002,0.006 -0.003,0.0131 -0.005,0.019 -0.004,-0.004 -0.007,-0.01 -0.0104,-0.0138 0.006,-8.1e-4 0.01,-0.004 0.0155,-0.005 z m -0.14866,0.0588 -0.0726,0.003 c 0.003,-1e-5 0.006,-0.002 0.009,-0.002 0.0222,-0.002 0.0417,7e-5 0.064,-0.002 z m -12.66405,0.42006 h 0.002 0.002 c 3.63647,0.005 7.27308,0.0198 10.90948,0.0432 0.42208,0.48049 0.83289,0.92711 1.15127,1.34316 0.003,0.11413 0.004,0.23132 -0.064,0.45982 -0.0883,0.29569 -0.24377,0.66949 -0.31634,1.15128 l 0.0241,-0.10717 c -0.3571,1.26493 -0.63177,2.51196 -1.00261,3.66126 -0.18571,0.22858 -0.37006,0.47384 -0.46673,0.58601 -0.13339,0.15477 -0.0893,0.12429 -0.14693,0.12446 -0.0254,6e-5 -0.0508,8.2e-4 -0.0761,0.003 -1.39566,0.12467 -2.89564,0.0254 -4.45299,0.0674 l 0.026,-0.002 c -5.06244,-0.0104 -10.10869,0.0921 -15.1291,-0.038 h -0.002 c -0.47954,-0.0115 -0.81223,-0.16182 -0.91445,-0.39413 -0.0299,-0.0679 -0.0683,-0.1318 -0.11409,-0.19015 -0.32784,-0.41647 -0.38298,-1.26001 -0.73468,-2.27836 -0.25815,-0.95687 -0.51043,-1.91925 -0.76578,-2.88338 0.35366,-0.53317 0.67889,-1.04638 0.99742,-1.46243 0.10948,-0.0329 0.21808,-0.0648 0.45637,-0.0587 0.30851,0.008 0.71402,0.0594 1.19794,0.003 l -0.0968,0.007 c 3.17027,-0.0227 6.34249,-0.0298 9.51619,-0.0363 z m -12.07805,7.61122 c 0.0109,0.0248 0.0385,0.0279 0.0501,0.0519 0.004,0.006 0.005,0.0101 0.009,0.0155 -0.006,-8e-5 -0.0118,-0.002 -0.0172,-0.002 z m 23.72911,0.58947 c -0.0739,0.10494 -0.12398,0.22467 -0.14693,0.35091 v -0.19534 c 0.02,-0.0214 0.0564,-0.0412 0.0744,-0.0622 0.0367,-0.0426 0.0396,-0.0527 0.0726,-0.0934 z m -1.47799,0.82802 -0.0778,0.003 c 0.003,-10e-6 0.006,-0.002 0.009,-0.002 0.0239,-0.002 0.045,3.7e-4 0.0692,-0.002 z m -22.58301,0.40796 c 0.004,1.4e-4 0.008,-1.3e-4 0.0121,0 1.63696,0.053 3.17595,-0.0802 4.56881,0.15212 0.16716,0.0462 0.38619,0.30454 0.60676,0.63268 0.21662,1.1907 0.19463,2.50702 0.34053,3.91711 0.11839,1.92534 0.30676,3.8332 0.39586,5.69761 -0.0707,0.21258 -0.15754,0.45189 -0.1936,0.5791 -0.0399,0.14087 -0.0302,0.1133 -0.019,0.10717 -0.54724,0.23917 -0.94502,0.43628 -1.21351,0.38722 -0.049,-0.009 -0.0988,-0.0134 -0.14867,-0.0138 -2.20375,-0.0223 -4.39234,0.0364 -6.52563,-0.0329 -0.26866,-0.12084 -0.55592,-0.23489 -0.688,-0.29905 -0.18247,-0.0886 -0.13622,-0.0505 -0.1504,-0.10545 -0.01,-0.0382 -0.0217,-0.0758 -0.0363,-0.11236 -0.33353,-0.82091 -0.438,-1.87613 -0.72776,-3.00439 -0.46257,-2.24669 -0.99931,-4.46303 -1.37773,-6.65183 0.0458,-0.21339 0.10171,-0.45418 0.12447,-0.58601 0.0287,-0.16629 0.043,-0.17403 0.0346,-0.1694 0.38559,-0.30441 0.68595,-0.47337 0.98705,-0.44253 0.0431,0.004 0.0864,0.006 0.12966,0.003 1.27729,-0.055 2.57131,-0.0521 3.88081,-0.0587 z m 8.48937,0 h 7.83594 c 0.41654,0.46678 0.83327,0.93132 1.24463,1.39501 -0.2924,3.05063 -0.4218,6.0859 -0.69664,9.07366 -0.20739,0.3497 -0.36586,0.63769 -0.45464,0.7727 -0.46379,0.17696 -0.95123,0.25946 -1.52985,0.21954 -0.0167,-8.2e-4 -0.0334,-0.002 -0.0501,-0.002 -2.00192,-0.0224 -3.98715,0.0365 -5.91196,-0.0329 -0.25608,-0.1136 -0.54238,-0.23445 -0.66208,-0.28868 -0.0698,-0.0316 -0.0753,-0.0256 -0.0813,-0.0208 -0.0149,-0.0743 -0.0394,-0.1463 -0.0726,-0.21435 -0.29343,-0.58379 -0.19422,-1.52141 -0.35091,-2.66729 -0.17172,-2.25495 -0.29146,-4.54245 -0.51513,-6.83852 0.41606,-0.46734 0.83014,-0.9328 1.24462,-1.39675 z m 16.28037,0 h 0.002 c 1.60602,0.0492 3.12092,-0.0391 4.52213,0.15903 0.259,0.2219 0.49357,0.42142 0.59639,0.52032 0.0783,0.48996 0.0838,0.96791 -0.0639,1.4659 -0.007,0.0228 -0.0125,0.0458 -0.0172,0.0692 -0.59591,2.81821 -1.18867,5.62998 -1.82373,8.42888 -0.17701,0.22634 -0.36833,0.47681 -0.46154,0.59638 -0.13614,0.17463 -0.0968,0.13519 -0.1262,0.13656 -0.0371,0.002 -0.074,0.006 -0.11063,0.0121 -0.8811,0.15465 -1.95161,0.0224 -3.13576,0.0709 -1.48566,-0.0223 -2.94043,0.0352 -4.3268,-0.0311 -0.20256,-0.0889 -0.43116,-0.19808 -0.55316,-0.24547 -0.13686,-0.0532 -0.10944,-0.0385 -0.10372,-0.026 -0.18028,-0.5527 -0.33883,-0.95893 -0.27659,-1.20141 0.0122,-0.0488 0.0205,-0.0985 0.0242,-0.14867 0.24353,-3.0047 0.39936,-6.00204 0.66207,-8.96301 0.007,-0.0748 0.22623,-0.32282 0.48921,-0.58428 0.74011,-0.30744 1.78077,-0.18039 3.03722,-0.25584 z m -18.32017,11.46436 c 0.005,0.028 0.0313,0.042 0.038,0.0692 0.0253,0.057 0.0127,0.107 0.0415,0.16422 z m -11.17742,0.002 c 0.002,0.0111 0.0125,0.015 0.0155,0.026 0.0118,0.0303 0.008,0.0561 0.0207,0.0864 z m 32.31874,1.66468 -0.11063,0.0138 c 0.0125,-5.8e-4 0.0205,-0.0112 0.0329,-0.0121 0.029,-0.005 0.0486,0.003 0.0778,-0.002 z m -23.36609,0.37684 c 0.0908,-0.0113 0.17626,-0.0122 0.25585,0 0.0446,0.007 0.0897,0.009 0.13483,0.009 h 7.791 8.4185 c 0.3638,0.17446 0.65421,0.3012 0.78998,0.36993 0.18522,0.47119 0.34973,0.88473 0.30079,1.20314 -0.007,0.0452 -0.0104,0.0908 -0.0103,0.13656 0.0277,9.38898 -0.0926,5.71185 -0.15213,15.1137 -2.67851,2.78215 -15.97295,3.39499 -19.00471,-0.1522 0.0726,-3.96928 0.1677,-10.95221 0.15903,-15.59248 0.17438,-0.36365 0.30292,-0.65248 0.37165,-0.78826 0.35327,-0.13886 0.67315,-0.26493 0.94558,-0.29906 z"
           sodipodi:nodetypes="cccccccscccccccccccccsccccsccccssccccsccccccssccccccccccccccccccccccccsccccscccccccccccccccccccccccccccccsccccccsscccccsccccccccccccccccccccccccccccccsccccsccccscccccccccccccsccccsccccccccsccccsccccccccccccccccccccscccccccccccsscc" /><path
           style="fill:#ffffff;stroke-width:0.104482"
           d="m 626.62487,327.76962 c -0.62191,-0.0553 -1.10645,-0.48236 -1.24991,-1.10171 -0.027,-0.11627 -0.0273,-0.13984 -0.0318,-2.47833 -0.005,-2.4905 0.002,-2.94516 0.0492,-3.31967 0.12114,-0.96036 0.45711,-1.86162 0.99391,-2.66631 0.50077,-0.75067 1.21445,-1.42315 1.99797,-1.88264 1.34208,-0.78705 2.95162,-1.03596 4.47998,-0.69281 0.9719,0.21821 1.93221,0.70914 2.68918,1.37475 0.18785,0.16519 0.51577,0.50203 0.67251,0.69082 1.09737,1.32176 1.58881,3.02547 1.36771,4.74145 -0.16781,1.30241 -0.77513,2.54956 -1.69859,3.48813 -0.38423,0.39052 -0.78632,0.7099 -1.22659,0.97431 -0.68973,0.41421 -1.4837,0.69996 -2.25862,0.81287 -0.45486,0.0663 -0.35909,0.0643 -3.10444,0.067 -1.40971,10e-4 -2.61595,-0.002 -2.68052,-0.007 z"
           id="path27" /><path
           style="fill:#ffffff;stroke-width:0.104482"
           d="m 673.31689,240.80991 c -0.62191,-0.0553 -1.10645,-0.48236 -1.24991,-1.10171 -0.027,-0.11627 -0.0273,-0.13984 -0.0318,-2.47833 -0.005,-2.4905 0.002,-2.94516 0.0492,-3.31967 0.12114,-0.96036 0.45711,-1.86162 0.99391,-2.66631 0.50077,-0.75067 1.21445,-1.42315 1.99797,-1.88264 1.34208,-0.78705 2.95162,-1.03596 4.47998,-0.69281 0.9719,0.21821 1.93221,0.70914 2.68918,1.37475 0.18785,0.16519 0.51577,0.50203 0.67251,0.69082 1.09737,1.32176 1.58881,3.02547 1.36771,4.74145 -0.16781,1.30241 -0.77513,2.54956 -1.69859,3.48813 -0.38423,0.39052 -0.78632,0.7099 -1.22659,0.97431 -0.68973,0.41421 -1.4837,0.69996 -2.25862,0.81287 -0.45486,0.0663 -0.35909,0.0643 -3.10444,0.067 -1.40971,0.001 -2.61595,-0.002 -2.68052,-0.007 z"
           id="path28" /></g><g
         id="shape-6602943a-1cd1-803b-8001-e288761c61b1"
         style="fill:#000000;-webkit-print-color-adjust:exact"
         transform="matrix(0.11469429,0,0,0.11469429,640.89477,260.4122)"><g
           id="fills-6602943a-1cd1-803b-8001-e288761c61b1"><path
             rx="0"
             ry="0"
             d="M 178.519,0 C 79.968,0 0.098,79.84 0.033,178.367 H 0 V 316.526 H 0.033 C 0.087,338.894 18.205,357 40.584,357 h 0.191 0.034 137.782 C 277.153,356.933 357,277.071 357,178.519 357,79.926 277.11,0 178.519,0 Z m 36.176,73.454 c 29.976,0 58.278,22.968 58.278,54.625 0,2.936 -0.014,5.876 -0.495,9.205 -0.83,8.423 -8.509,14.463 -16.89,13.276 -8.381,-1.201 -14.066,-9.135 -12.515,-17.46 0.142,-0.95 0.191,-2.457 0.191,-5.021 0,-17.949 -14.679,-24.878 -28.569,-24.878 -13.881,0 -26.405,11.673 -26.438,24.878 0.24,15.275 0,30.441 0,45.685 l 25.754,-0.194 c 20.114,-0.416 20.339,29.901 0.228,29.747 l -25.982,0.194 c -0.067,12.286 0.101,10.055 0.034,16.243 0,0 0.221,15.007 -0.228,26.399 -3.11,33.459 -31.588,60.217 -65.81,60.217 -36.273,0 -66.19,-29.676 -66.19,-66.037 1.089,-37.406 30.947,-66.804 68.51,-66.455 l 20.922,-0.156 v 29.709 l -20.922,0.194 h -0.152 c -20.645,0.61 -38.311,14.6 -38.649,36.708 0,20.145 16.28,36.29 36.481,36.29 20.167,0 36.29,-14.688 36.29,-36.252 0.23,-35.76 -0.159,-75.263 -0.033,-112.406 0.013,-2.087 0.113,-3.747 0.343,-6.048 3.405,-27.5 28.004,-48.463 55.842,-48.463 z"
             style="fill:#ffffff;fill-opacity:1;fill-rule:nonzero;stroke:none"
             id="path1-0"
             sodipodi:nodetypes="sccccscccsssscccsscccccccscccccccscccs" /></g></g><g
         id="text31"
         style="font-weight:bold;font-size:46.1647px;line-height:0.9;font-family:Montserrat;-inkscape-font-specification:'Montserrat Bold';text-align:center;letter-spacing:-2px;text-anchor:middle;fill:#ffffff;stroke-width:0;stroke-linecap:round;stroke-linejoin:round;paint-order:stroke fill markers"
         aria-label="COMMUNITY&#10;OPERATIONS"
         inkscape:export-filename="2.png"
         inkscape:export-xdpi="304.45923"
         inkscape:export-ydpi="304.45923"><path
           style="font-weight:600;-inkscape-font-specification:'Montserrat Semi-Bold';text-align:start;text-anchor:start"
           d="m 754.39218,455.83393 c 5.30894,0 9.83308,-1.89275 12.83379,-5.40127 l -3.87784,-3.69317 c -2.3544,2.58522 -5.26277,3.83167 -8.6328,3.83167 -6.69388,0 -11.54117,-4.7088 -11.54117,-11.35652 0,-6.64772 4.84729,-11.35652 11.54117,-11.35652 3.37003,0 6.2784,1.24645 8.6328,3.78551 l 3.87784,-3.64701 c -3.00071,-3.50852 -7.52485,-5.40127 -12.78762,-5.40127 -9.92541,0 -17.31177,6.97087 -17.31177,16.61929 0,9.64842 7.38636,16.61929 17.2656,16.61929 z m 31.00776,0 c 10.01774,0 17.40409,-7.01703 17.40409,-16.61929 0,-9.60226 -7.38635,-16.61929 -17.40409,-16.61929 -10.01774,0 -17.40409,7.0632 -17.40409,16.61929 0,9.55609 7.38635,16.61929 17.40409,16.61929 z m 0,-5.26277 c -6.50922,0 -11.35652,-4.75497 -11.35652,-11.35652 0,-6.60155 4.8473,-11.35652 11.35652,-11.35652 6.50922,0 11.35651,4.75497 11.35651,11.35652 0,6.60155 -4.84729,11.35652 -11.35651,11.35652 z m 57.09086,-27.51417 h -4.93963 l -12.60296,21.42042 -12.83379,-21.42042 h -4.93962 v 32.31529 h 5.72442 v -21.14343 l 10.61788,17.45026 h 2.67756 l 10.61788,-17.72725 0.0462,21.42042 h 5.67826 z m 42.08728,0 h -4.93962 l -12.60296,21.42042 -12.83379,-21.42042 h -4.93962 v 32.31529 h 5.72442 v -21.14343 l 10.61788,17.45026 h 2.67756 l 10.61788,-17.72725 0.0462,21.42042 h 5.67826 z m 20.66686,32.77694 c 8.81746,0 14.1264,-5.12428 14.1264,-14.54188 v -18.23506 h -5.90908 v 18.00424 c 0,6.64771 -2.95454,9.50993 -8.17115,9.50993 -5.21661,0 -8.21732,-2.86222 -8.21732,-9.50993 v -18.00424 h -6.00141 v 18.23506 c 0,9.4176 5.30894,14.54188 14.17256,14.54188 z m 43.28755,-10.89487 -17.81958,-21.88207 h -4.93962 v 32.31529 h 5.95525 v -21.88206 l 17.81957,21.88206 h 4.93962 v -32.31529 h -5.95524 z m 18.6356,10.43322 v -32.31529 h -6.00141 v 32.31529 z"
           id="path128" /><path
           style="font-weight:600;-inkscape-font-specification:'Montserrat Semi-Bold';text-align:start;letter-spacing:1px;text-anchor:start"
           d="m 986.45002,455.37228 v -27.23717 h 10.71021 v -5.07812 H 969.7384 v 5.07812 h 10.71021 v 27.23717 z"
           id="path129" /><path
           style="font-weight:600;-inkscape-font-specification:'Montserrat Semi-Bold';text-align:start;text-anchor:start"
           d="m 1023.3661,423.05699 -9.556,15.74217 -9.4638,-15.74217 h -6.4169 l 12.6953,21.00494 v 11.31035 h 6.0014 V 443.9696 l 12.6491,-20.91261 z"
           id="path130" /><path
           style="font-weight:600;-inkscape-font-specification:'Montserrat Semi-Bold';text-align:start;text-anchor:start"
           d="m 754.53068,497.38216 c 10.01774,0 17.40409,-7.01703 17.40409,-16.61929 0,-9.60226 -7.38635,-16.61929 -17.40409,-16.61929 -10.01774,0 -17.4041,7.06319 -17.4041,16.61929 0,9.55609 7.38636,16.61929 17.4041,16.61929 z m 0,-5.26278 c -6.50923,0 -11.35652,-4.75496 -11.35652,-11.35651 0,-6.60155 4.84729,-11.35652 11.35652,-11.35652 6.50922,0 11.35651,4.75497 11.35651,11.35652 0,6.60155 -4.84729,11.35651 -11.35651,11.35651 z m 21.77486,-27.51416 v 32.31529 h 6.00141 v -9.32527 h 7.29402 c 8.49431,0 13.75708,-4.38564 13.75708,-11.49501 0,-7.15553 -5.26277,-11.49501 -13.75708,-11.49501 z m 6.00141,17.91191 v -12.83379 h 7.01703 c 5.26278,0 7.9865,2.3544 7.9865,6.41689 0,4.0625 -2.72372,6.4169 -7.9865,6.4169 z m 31.0539,0.46164 h 15.60367 v -4.93962 h -15.60367 v -8.40198 h 17.58875 v -5.03195 h -23.59016 v 32.31529 h 24.23647 v -5.03195 h -18.23506 z m 43.10292,3.32386 c 4.38565,-1.70809 6.87854,-5.30894 6.87854,-10.2024 0,-7.15553 -5.26277,-11.49501 -13.75708,-11.49501 H 836.2898 v 32.31529 h 6.00141 v -9.4176 h 7.29402 c 0.41548,0 0.83097,0 1.24645,-0.0462 l 6.60155,9.46376 h 6.46306 z m 0.83097,-10.2024 c 0,4.0625 -2.72372,6.46306 -7.9865,6.46306 h -7.01703 v -12.87995 h 7.01703 c 5.26278,0 7.9865,2.3544 7.9865,6.41689 z m 41.21019,20.82028 -14.58804,-32.31529 h -5.90909 l -14.54188,32.31529 h 6.18607 l 3.18537,-7.47868 H 888.995 l 3.23153,7.47868 z m -17.58875,-26.31388 6.09374,14.1264 H 874.8686 Z m 30.63849,26.31388 v -27.23717 h 10.71021 v -5.07812 h -27.42183 v 5.07812 h 10.71021 v 27.23717 z m 19.23572,0 v -32.31529 h -6.00141 v 32.31529 z m 21.82099,0.46165 c 10.01774,0 17.40409,-7.01703 17.40409,-16.61929 0,-9.60226 -7.38635,-16.61929 -17.40409,-16.61929 -10.01774,0 -17.40409,7.06319 -17.40409,16.61929 0,9.55609 7.38635,16.61929 17.40409,16.61929 z m 0,-5.26278 c -6.50922,0 -11.35652,-4.75496 -11.35652,-11.35651 0,-6.60155 4.8473,-11.35652 11.35652,-11.35652 6.50922,0 11.35652,4.75497 11.35652,11.35652 0,6.60155 -4.8473,11.35651 -11.35652,11.35651 z m 44.53407,-5.63209 -17.81958,-21.88207 h -4.93962 v 32.31529 h 5.95525 v -21.88207 l 17.81957,21.88207 h 4.93963 v -32.31529 h -5.95525 z m 22.65195,10.89487 c 8.8636,0 13.0646,-4.43181 13.0646,-9.60226 0,-11.86433 -19.1584,-7.38635 -19.1584,-14.26489 0,-2.44673 2.0313,-4.38565 7.0171,-4.38565 2.816,0 6.0014,0.83097 8.9098,2.53906 l 1.8927,-4.66263 c -2.816,-1.84659 -6.8785,-2.86221 -10.7564,-2.86221 -8.8636,0 -13.0184,4.43181 -13.0184,9.64842 0,12.00282 19.2045,7.43251 19.2045,14.40338 0,2.40057 -2.1236,4.20099 -7.1555,4.20099 -3.9702,0 -8.0788,-1.47727 -10.6641,-3.55468 l -2.0774,4.66263 c 2.6776,2.30824 7.7095,3.87784 12.7415,3.87784 z"
           id="path131" /></g><g
         style="fill:#ffffff;fill-opacity:1;-webkit-print-color-adjust:exact"
         id="g64"
         transform="translate(180.08729,326.86757)"><g
           id="g46"
           rx="0"
           ry="0"
           style="fill:#ffffff;fill-opacity:1"><g
             id="g45"
             rx="0"
             ry="0"
             style="fill:#ffffff;fill-opacity:1"
             transform="matrix(0.10913285,0,0,0.10913285,512.09962,51.620517)"><g
               id="g32"
               style="fill:#ffffff;fill-opacity:1"><g
                 id="g31"
                 style="fill:#ffffff;fill-opacity:1"><path
                   rx="0"
                   ry="0"
                   d="m 557.997,146.523 c -28.544,10.981 -47.917,37.956 -47.997,71.253 -0.083,34.879 24.473,79.892 75.327,80.224 34.205,0.224 51.31,-12.509 60.545,-21.154 6.125,-5.403 6.554,-14.779 0.941,-20.703 -5.624,-5.935 -15.066,-6.078 -20.855,-0.304 -6.893,6.445 -17.043,15.997 -45.829,12.816 -12.352,-1.361 -25.623,-11.343 -30.053,-18.98 l 94.317,-39.915 c 7.212,-3.189 10.525,-11.522 7.472,-18.762 -16.837,-32.979 -46.69,-62.625 -93.868,-44.475 z m 59.2,43.385 -78.484,33.369 c -5.604,-20.818 17.366,-45.31 29.896,-49.868 18.787,-6.833 39.515,0.857 48.588,16.499 z"
                   style="fill:#ffffff;fill-opacity:1;fill-rule:evenodd;stroke:none"
                   id="path31" /></g></g><g
               id="g34"
               style="fill:#ffffff;fill-opacity:1"><g
                 id="g33"
                 style="fill:#ffffff;fill-opacity:1"><path
                   rx="0"
                   ry="0"
                   d="m 921.51,140 c -21.088,-0.002 -41.313,8.321 -56.225,23.139 -14.911,14.818 -23.287,34.916 -23.285,55.871 0.006,43.63 35.604,78.995 79.51,78.99 43.899,-0.006 79.484,-35.368 79.49,-78.99 0,-43.63 -35.583,-79.004 -79.49,-79.01 z m 0,29.593 c 13.189,0 25.838,5.207 35.165,14.474 9.326,9.268 14.565,21.837 14.565,34.943 0,13.106 -5.239,25.676 -14.565,34.943 -9.327,9.268 -21.976,14.474 -35.165,14.474 -13.189,0 -25.838,-5.206 -35.164,-14.474 -9.326,-9.267 -14.566,-21.837 -14.565,-34.943 -10e-4,-13.106 5.239,-25.676 14.565,-34.943 9.326,-9.268 21.975,-14.474 35.164,-14.474 z"
                   style="fill:#ffffff;fill-opacity:1;stroke-linejoin:round"
                   id="path32" /></g></g><g
               id="g36"
               style="fill:#ffffff;fill-opacity:1"><g
                 id="g35"
                 style="fill:#ffffff;fill-opacity:1"><path
                   rx="0"
                   ry="0"
                   d="m 1036.737,141 c -12.678,0 -14.791,10.409 -14.724,14.608 v 126.413 c -0.347,8.172 6.452,14.979 14.961,14.979 8.51,0 15.309,-6.807 14.962,-14.979 0,0 0.225,-47.013 0,-77.108 -0.226,-30.095 24.392,-36.618 32.957,-36.618 6.361,0 11.443,3.525 16.483,3.337 7.481,-0.28 13.624,-5.272 13.624,-14.025 -0.225,-14.14 -17.661,-16.147 -30.515,-15.886 -12.855,0.262 -23.712,4.189 -33.112,9.774 0,0 -1.959,-10.495 -14.636,-10.495 z"
                   style="color:#000000;font-style:normal;font-variant:normal;font-weight:normal;font-stretch:normal;font-size:medium;line-height:normal;font-family:sans-serif;font-feature-settings:normal;text-indent:0px;text-align:start;text-decoration:none;text-decoration-line:none;text-decoration-style:solid;text-decoration-color:#000000;letter-spacing:normal;word-spacing:normal;text-transform:none;writing-mode:lr-tb;direction:ltr;text-orientation:mixed;dominant-baseline:auto;baseline-shift:baseline;text-anchor:start;white-space:normal;clip-rule:nonzero;display:inline;overflow:visible;visibility:visible;isolation:auto;mix-blend-mode:normal;vector-effect:none;fill:#ffffff;fill-opacity:1;fill-rule:nonzero;stroke:none;stroke-linejoin:round;stroke-miterlimit:4;stroke-dasharray:none;stroke-dashoffset:0;color-rendering:auto;image-rendering:auto;shape-rendering:auto;text-rendering:auto"
                   id="path34" /></g></g><g
               id="g39"
               rx="0"
               ry="0"
               style="fill:#ffffff;fill-opacity:1"><g
                 id="g38"
                 style="fill:#ffffff;fill-opacity:1"><g
                   id="g37"
                   style="fill:#ffffff;fill-opacity:1"><path
                     rx="0"
                     ry="0"
                     d="m 1181.619,140 c -19.899,0 -34.25,5.906 -44.711,13.396 -15.858,11.361 1.208,35.115 17.066,23.754 7.218,-5.168 12.585,-7.925 27.645,-7.925 18.746,0.377 33.824,7.428 33.824,21.457 -10.05,6.364 -53.747,11.624 -77.211,24.975 -23.464,13.352 -22.221,30.204 -22.221,41.138 0,23.985 25.266,40.166 47.149,40.166 21.884,0 31.174,-4.593 52.583,-19.274 v 4.202 c -0.692,20.148 29.937,20.148 29.245,0 v -86.107 c 0.095,-35.71 -25.529,-55.238 -63.369,-55.782 z m 34.839,79.451 c -0.01,9.469 0.131,12.198 -0.129,21.664 -0.057,11.367 -7.193,16.637 -14.665,20.986 -7.473,4.349 -22.651,8.164 -31.446,8.581 -10.144,0.336 -23.602,-1.957 -24.309,-13.995 0.01,-7.267 3.525,-11.773 9.301,-16.792 13.677,-10.268 32.21,-13.715 61.248,-20.444 z"
                     style="color:#000000;font-style:normal;font-variant:normal;font-weight:normal;font-stretch:normal;font-size:medium;line-height:normal;font-family:sans-serif;font-feature-settings:normal;text-indent:0px;text-align:start;text-decoration:none;text-decoration-line:none;text-decoration-style:solid;text-decoration-color:#000000;letter-spacing:normal;word-spacing:normal;text-transform:none;writing-mode:lr-tb;direction:ltr;text-orientation:mixed;dominant-baseline:auto;baseline-shift:baseline;text-anchor:start;white-space:normal;clip-rule:nonzero;display:inline;overflow:visible;visibility:visible;opacity:1;isolation:auto;mix-blend-mode:normal;vector-effect:none;fill:#ffffff;fill-opacity:1;fill-rule:nonzero;stroke:none;stroke-linejoin:miter;stroke-miterlimit:4;stroke-dasharray:none;stroke-dashoffset:0;color-rendering:auto;image-rendering:auto;shape-rendering:auto;text-rendering:auto"
                     id="path36" /></g></g></g><g
               id="g41"
               style="fill:#ffffff;fill-opacity:1"><g
                 id="g40"
                 style="fill:#ffffff;fill-opacity:1"><path
                   rx="0"
                   ry="0"
                   d="m 810.221,75.023 c -9.139,-0.543 -15.867,8.471 -14.465,17.035 v 66.118 c -28.848,-24.102 -75.83,-22.426 -102.461,4.262 -26.932,23.914 -32.048,67.28 -12.461,97.144 14.389,22.546 40.708,38.624 67.832,37.347 17.056,-0.155 33.975,-7.474 47.09,-18.313 -1.346,8.557 5.285,17.594 14.465,17.044 9.01,0.4 15.987,-8.462 14.604,-17.034 -0.157,-63.592 0.156,-127.188 -0.157,-190.778 -0.469,-7.172 -7.352,-13.068 -14.447,-12.825 z m -63.284,95.012 c 26.045,-0.677 49.309,22.688 48.819,48.402 0.547,25.739 -22.796,49.064 -48.819,48.403 -24.742,0.654 -47.423,-20.233 -48.687,-44.718 -2.635,-25.24 18.159,-49.842 43.629,-51.845 1.68,-0.164 3.369,-0.242 5.058,-0.242 z"
                   style="font-style:normal;font-variant:normal;font-weight:bold;font-stretch:normal;font-size:medium;line-height:25px;font-family:Comfortaa;letter-spacing:0px;word-spacing:0px;fill:#ffffff;fill-opacity:1;stroke:none;stroke-linejoin:miter"
                   id="path39" /></g></g><g
               id="g44"
               rx="0"
               ry="0"
               style="fill:#ffffff;fill-opacity:1"><g
                 id="g43"
                 style="fill:#ffffff;fill-opacity:1"><g
                   id="g42"
                   style="fill:#ffffff;fill-opacity:1"><path
                     rx="0"
                     ry="0"
                     d="m 428,127.386 v 155.259 c -0.041,19.14 29.008,19.14 28.966,0 V 179.034 h 29.793 c 6.968,0 12.924,-5.059 12.924,-13.181 0,-8.122 -6.381,-13.055 -12.924,-13.055 h -29.793 v -23.881 c 0,-15.28 11.919,-27.982 35.911,-27.688 8.345,0.109 11.302,2.121 14.35,3.984 16.639,11.054 32.656,-14.547 15.229,-24.34 C 511.768,74.312 501.782,72 489.867,72 452.318,72 428.22,100.608 428,127.386 Z"
                     style="font-style:normal;font-variant:normal;font-weight:bold;font-stretch:normal;font-size:medium;line-height:25px;font-family:Comfortaa;letter-spacing:0px;word-spacing:0px;fill:#ffffff;fill-opacity:1;stroke:none;stroke-linejoin:miter;stroke-miterlimit:4;stroke-dasharray:none"
                     id="path41" /></g></g></g></g></g></g><path
         id="path64"
         style="fill:#fafcfe;stroke-width:1.05695;fill-opacity:1"
         d="M 659.57665 380.45091 C 648.83119 380.60128 638.21895 383.50207 628.88512 388.97587 C 620.959 393.62405 613.73877 400.42656 608.67306 408.02027 C 603.24267 416.16055 599.84417 425.2792 598.61857 434.99423 C 598.14061 438.7828 598.07125 443.38259 598.11995 468.5765 C 598.16568 492.23272 598.16937 492.47017 598.44185 493.64644 C 599.89312 499.91168 604.79495 504.2336 611.08622 504.79285 C 611.73938 504.85095 623.94253 504.88509 638.20324 504.87069 C 665.97528 504.84267 665.00663 504.86373 669.60799 504.19324 C 677.44698 503.05099 685.47891 500.1614 692.45623 495.97124 C 696.91004 493.29649 700.97804 490.06509 704.86496 486.11452 C 714.20669 476.62001 720.3498 464.00327 722.04742 450.8281 C 724.28412 433.46902 719.31329 416.23461 708.21225 402.86364 C 706.62666 400.95382 703.30859 397.54549 701.40827 395.87452 C 693.75072 389.14114 684.03673 384.17528 674.20499 381.96781 C 669.37343 380.88308 664.46098 380.38256 659.57665 380.45091 z M 678.10981 390.14353 C 678.59264 390.13677 679.07967 390.18567 679.55728 390.2929 C 680.52918 390.51111 681.48908 391.00324 682.24605 391.66885 C 682.4339 391.83404 682.76045 392.17013 682.91719 392.35892 C 684.01456 393.68068 684.50582 395.38511 684.28472 397.10109 C 684.2584 397.30534 684.22068 397.50644 684.17322 397.70701 C 700.25956 406.25821 711.22502 423.18284 711.22502 442.6608 C 711.22502 470.75018 688.42972 493.54335 660.34036 493.54335 C 651.54699 493.54335 643.27184 491.3096 636.05307 487.37896 C 636.00105 487.43614 635.9495 487.49216 635.89528 487.54727 C 635.51105 487.93779 635.10898 488.25906 634.66871 488.52347 C 633.97898 488.93768 633.18405 489.22267 632.40913 489.33558 C 631.95427 489.40188 632.0512 489.4002 629.3059 489.4029 C 627.89619 489.4039 626.69011 489.39948 626.62554 489.39448 C 626.00363 489.33918 625.51929 488.9114 625.37583 488.29205 C 625.34883 488.17578 625.34667 488.15211 625.34217 485.81367 C 625.33717 483.32317 625.34546 482.87034 625.39266 482.49583 C 625.49093 481.71681 625.73237 480.97641 626.10588 480.29516 C 615.87844 470.98652 609.45571 457.57048 609.45571 442.6608 C 609.45571 414.57143 632.251 391.77614 660.34036 391.77614 C 664.6415 391.77614 668.81592 392.3164 672.8059 393.3225 C 672.89069 393.1688 672.97894 393.01551 673.07731 392.86806 C 673.57802 392.11739 674.29248 391.44668 675.076 390.98719 C 675.99868 390.44609 677.04759 390.15839 678.10981 390.14353 z M 660.34036 393.93263 C 633.41533 393.93263 611.61009 415.73575 611.61009 442.6608 C 611.61009 456.90689 617.71736 469.71515 627.45447 478.62257 C 627.74623 478.36705 628.05807 478.13649 628.38439 477.94512 C 629.72647 477.15807 631.33521 476.90979 632.86357 477.25294 C 633.83547 477.47115 634.79748 477.96332 635.55445 478.62888 C 635.7423 478.79407 636.06885 479.13017 636.22559 479.31896 C 637.32296 480.64072 637.81422 482.34515 637.59312 484.06113 C 637.52708 484.57364 637.39222 485.07703 637.19758 485.55699 C 644.08141 489.27629 651.9625 491.38897 660.34036 491.38897 C 687.26544 491.38897 709.06853 469.58585 709.06853 442.6608 C 709.06854 424.04787 698.64672 407.88739 683.31904 399.68045 C 683.10447 400.00535 682.85991 400.31184 682.58688 400.58933 C 682.20265 400.97985 681.80059 401.29903 681.36032 401.56344 C 680.67059 401.97759 679.87776 402.26263 679.10284 402.37554 C 678.64798 402.44184 678.74285 402.44016 675.9975 402.44286 C 674.58779 402.44386 673.38172 402.44155 673.31715 402.43655 L 673.31715 402.43445 C 672.69524 402.37915 672.2109 401.95346 672.06744 401.33411 C 672.04044 401.21784 672.04038 401.19422 672.03588 398.85573 C 672.03088 396.36523 672.03707 395.9103 672.08427 395.53579 C 672.09122 395.48071 672.10116 395.42638 672.10952 395.37169 C 668.33975 394.43747 664.40023 393.93263 660.34036 393.93263 z M 660.34036 403.61473 C 681.89144 403.61473 699.38433 421.10973 699.38433 442.6608 C 699.38433 445.16211 699.14033 447.6051 698.69005 449.97602 C 698.93371 450.13476 699.16492 450.30856 699.38012 450.49779 C 699.56797 450.66297 699.89663 451.00118 700.05337 451.18997 C 701.15074 452.51172 701.642 454.21405 701.4209 455.93003 C 701.25308 457.23244 700.64652 458.47972 699.72306 459.41828 C 699.33882 459.80879 698.93677 460.12797 698.49649 460.39238 C 697.80677 460.80659 697.01183 461.09367 696.23691 461.20658 C 695.89243 461.25679 695.85144 461.26823 694.66531 461.2718 C 688.04975 473.43814 675.154 481.70267 660.34036 481.70267 C 638.78934 481.70268 621.29429 464.21187 621.29429 442.6608 C 621.29429 440.83487 621.43 439.04064 621.67299 437.28116 C 621.31156 437.28005 620.57247 437.28116 620.5453 437.27905 L 620.5453 437.27695 C 619.92339 437.22165 619.43905 436.79596 619.29559 436.17661 C 619.26859 436.06034 619.26854 436.03672 619.26404 433.69823 C 619.25904 431.20777 619.26522 430.75281 619.31242 430.3783 C 619.43356 429.41794 619.77076 428.51526 620.30756 427.71057 C 620.80833 426.9599 621.52067 426.28918 622.30415 425.82969 C 623.22683 425.28859 624.27574 425.00089 625.33796 424.98603 C 625.39902 424.98518 625.45984 425.00403 625.521 425.00496 C 631.97155 412.31874 645.14339 403.61473 660.34036 403.61473 z M 660.34036 405.76911 C 646.17789 405.76911 633.89463 413.73814 627.71115 425.43626 C 628.35139 425.69674 628.96102 426.0601 629.47421 426.51135 C 629.66206 426.67654 629.98861 427.01267 630.14535 427.20142 C 631.24272 428.52318 631.73608 430.22761 631.51498 431.94359 C 631.34717 433.246 630.7385 434.49327 629.81504 435.43184 C 629.43081 435.82236 629.02874 436.14153 628.58847 436.40594 C 627.89874 436.82015 627.10592 437.10513 626.331 437.21804 C 625.96674 437.27113 625.24435 437.26968 623.8442 437.27274 C 623.58717 439.0317 623.44867 440.83008 623.44867 442.6608 C 623.44867 463.04754 639.95363 479.55039 660.34036 479.55039 C 673.92887 479.55039 685.76096 472.19847 692.16168 461.2718 C 691.43588 461.27076 690.49448 461.26868 690.45332 461.26549 C 689.83141 461.21019 689.34497 460.78239 689.20151 460.16305 C 689.17461 460.04677 689.17445 460.02316 689.16995 457.68467 C 689.16495 455.19417 689.17334 454.73924 689.22044 454.36473 C 689.34159 453.40439 689.67668 452.5038 690.21348 451.69911 C 690.71424 450.94844 691.42867 450.27562 692.21217 449.81613 C 693.54381 449.0352 695.1379 448.78629 696.65559 449.11764 C 697.02541 447.02035 697.22995 444.86482 697.22995 442.6608 C 697.22995 422.27406 680.72712 405.76911 660.34036 405.76911 z M 661.36916 422.03638 C 672.67698 422.03638 681.84 431.20338 681.84 442.51142 C 681.84 453.81476 672.68207 462.97458 661.37758 462.98226 L 645.57527 462.98226 L 645.57106 462.98226 L 645.55002 462.98226 C 642.98328 462.98226 640.90452 460.90656 640.89832 458.34108 L 640.89412 458.34108 L 640.89412 442.49459 L 640.89832 442.49459 C 640.90578 431.19412 650.06594 422.03638 661.36916 422.03638 z M 665.51803 430.46245 C 662.32518 430.46245 659.50433 432.86684 659.11379 436.02093 C 659.08742 436.28484 659.07742 436.47374 659.07592 436.71311 C 659.06147 440.97319 659.10441 445.50427 659.07803 449.60574 C 659.07803 452.079 657.22957 453.76513 654.91654 453.76513 C 652.5996 453.76513 650.7319 451.91204 650.7319 449.60153 C 650.77067 447.06587 652.79693 445.46161 655.1648 445.39165 L 655.18163 445.39165 L 657.58216 445.36851 L 657.58216 441.96231 L 655.18163 441.97914 C 650.87337 441.93911 647.45061 445.31128 647.32571 449.60153 C 647.32571 453.77192 650.75623 457.17553 654.91654 457.17553 C 658.8416 457.17553 662.10859 454.10601 662.46529 450.26846 C 662.51679 448.96187 662.49054 447.24097 662.49054 447.24097 C 662.49822 446.53124 662.47864 446.78816 662.48633 445.37902 L 665.46754 445.35588 C 667.77415 445.37354 667.74715 441.89777 665.44019 441.94548 L 662.48633 441.96652 C 662.48633 440.21812 662.51386 438.47979 662.48633 436.72783 C 662.49011 435.2133 663.92596 433.87286 665.51803 433.87286 C 667.11113 433.87286 668.79589 434.66919 668.79589 436.72783 C 668.79589 437.02191 668.79114 437.19324 668.77485 437.3022 C 668.59696 438.25702 669.24845 439.16735 670.2097 439.3051 C 671.17096 439.44124 672.05219 438.74795 672.14739 437.78188 C 672.20255 437.40007 672.20419 437.06458 672.20419 436.72783 C 672.20419 433.09696 668.95611 430.46245 665.51803 430.46245 z "
         inkscape:export-filename="4.png"
         inkscape:export-xdpi="425.39124"
         inkscape:export-ydpi="425.39124" /><path
         style="fill:#ffffff;stroke-width:1.05695"
         d="m 55.890976,482.84926 c -6.29134,-0.55925 -11.193,-4.87968 -12.64427,-11.14492 -0.27248,-1.17627 -0.27553,-1.41475 -0.32126,-25.07111 -0.0487,-25.19412 0.0194,-29.79354 0.49736,-33.58211 1.2256,-9.7151 4.62422,-18.83228 10.05461,-26.97263 5.06578,-7.59378 12.28547,-14.39673 20.21166,-19.04498 13.57658,-7.9619 29.858834,-10.47987 45.319854,-7.00852 9.83181,2.20747 19.54643,7.17376 27.20405,13.90721 1.90032,1.67097 5.21753,5.07849 6.80312,6.98831 11.10111,13.37111 16.07262,30.60585 13.83592,47.965 -1.69762,13.17531 -7.84131,25.79164 -17.18311,35.28622 -3.88699,3.95057 -7.95452,7.18148 -12.4084,9.85623 -6.97732,4.19016 -15.00921,7.08085 -22.84827,8.2231 -4.60143,0.67049 -3.63269,0.64959 -31.404874,0.67761 -14.26085,0.0144 -26.46323,-0.0213 -27.11639,-0.0794 z"
         id="path79" /><text
         xml:space="preserve"
         style="font-style:normal;font-variant:normal;font-weight:bold;font-stretch:normal;font-size:46.1647px;line-height:0.9;font-family:Montserrat;-inkscape-font-specification:'Montserrat Bold';text-align:center;letter-spacing:-2px;text-anchor:middle;fill:#294172;fill-opacity:1;stroke-width:0;stroke-linecap:round;stroke-linejoin:round;paint-order:stroke fill markers"
         x="179.9001"
         y="433.42966"
         id="text81"
         inkscape:export-filename="CommOps 2.0.svg"
         inkscape:export-xdpi="96"
         inkscape:export-ydpi="96"><tspan
           sodipodi:role="line"
           id="tspan80"
           x="179.9001"
           y="433.42966"
           style="font-style:normal;font-variant:normal;font-weight:600;font-stretch:normal;font-family:Montserrat;-inkscape-font-specification:'Montserrat Semi-Bold';text-align:start;letter-spacing:-2px;text-anchor:start;fill:#294172;fill-opacity:1;stroke-width:0">COMMUNI<tspan
   id="tspan79"
   style="font-style:normal;font-variant:normal;font-weight:600;font-stretch:normal;font-family:Montserrat;-inkscape-font-specification:'Montserrat Semi-Bold';letter-spacing:1px">T</tspan>Y</tspan><tspan
           sodipodi:role="line"
           x="179.9001"
           y="474.97787"
           id="tspan81"
           style="font-style:normal;font-variant:normal;font-weight:600;font-stretch:normal;font-family:Montserrat;-inkscape-font-specification:'Montserrat Semi-Bold';text-align:start;letter-spacing:-2px;text-anchor:start;fill:#294172;fill-opacity:1;stroke-width:0">OPERATIONS</tspan></text><g
         style="fill:#51a2da;fill-opacity:1;-webkit-print-color-adjust:exact"
         id="g97"
         transform="translate(-375.10794,304.92493)"><g
           id="g96"
           rx="0"
           ry="0"
           style="fill:#51a2da;fill-opacity:1"><g
             id="g95"
             rx="0"
             ry="0"
             style="fill:#51a2da;fill-opacity:1"
             transform="matrix(0.10913285,0,0,0.10913285,512.09962,51.620517)"><g
               id="g82"
               style="fill:#51a2da;fill-opacity:1"><g
                 id="g81"
                 style="fill:#51a2da;fill-opacity:1"><path
                   rx="0"
                   ry="0"
                   d="m 557.997,146.523 c -28.544,10.981 -47.917,37.956 -47.997,71.253 -0.083,34.879 24.473,79.892 75.327,80.224 34.205,0.224 51.31,-12.509 60.545,-21.154 6.125,-5.403 6.554,-14.779 0.941,-20.703 -5.624,-5.935 -15.066,-6.078 -20.855,-0.304 -6.893,6.445 -17.043,15.997 -45.829,12.816 -12.352,-1.361 -25.623,-11.343 -30.053,-18.98 l 94.317,-39.915 c 7.212,-3.189 10.525,-11.522 7.472,-18.762 -16.837,-32.979 -46.69,-62.625 -93.868,-44.475 z m 59.2,43.385 -78.484,33.369 c -5.604,-20.818 17.366,-45.31 29.896,-49.868 18.787,-6.833 39.515,0.857 48.588,16.499 z"
                   style="fill:#51a2da;fill-opacity:1;fill-rule:evenodd;stroke:none"
                   id="path81" /></g></g><g
               id="g84"
               style="fill:#51a2da;fill-opacity:1"><g
                 id="g83"
                 style="fill:#51a2da;fill-opacity:1"><path
                   rx="0"
                   ry="0"
                   d="m 921.51,140 c -21.088,-0.002 -41.313,8.321 -56.225,23.139 -14.911,14.818 -23.287,34.916 -23.285,55.871 0.006,43.63 35.604,78.995 79.51,78.99 43.899,-0.006 79.484,-35.368 79.49,-78.99 0,-43.63 -35.583,-79.004 -79.49,-79.01 z m 0,29.593 c 13.189,0 25.838,5.207 35.165,14.474 9.326,9.268 14.565,21.837 14.565,34.943 0,13.106 -5.239,25.676 -14.565,34.943 -9.327,9.268 -21.976,14.474 -35.165,14.474 -13.189,0 -25.838,-5.206 -35.164,-14.474 -9.326,-9.267 -14.566,-21.837 -14.565,-34.943 -10e-4,-13.106 5.239,-25.676 14.565,-34.943 9.326,-9.268 21.975,-14.474 35.164,-14.474 z"
                   style="fill:#51a2da;fill-opacity:1;stroke-linejoin:round"
                   id="path82" /></g></g><g
               id="g86"
               style="fill:#51a2da;fill-opacity:1"><g
                 id="g85"
                 style="fill:#51a2da;fill-opacity:1"><path
                   rx="0"
                   ry="0"
                   d="m 1036.737,141 c -12.678,0 -14.791,10.409 -14.724,14.608 v 126.413 c -0.347,8.172 6.452,14.979 14.961,14.979 8.51,0 15.309,-6.807 14.962,-14.979 0,0 0.225,-47.013 0,-77.108 -0.226,-30.095 24.392,-36.618 32.957,-36.618 6.361,0 11.443,3.525 16.483,3.337 7.481,-0.28 13.624,-5.272 13.624,-14.025 -0.225,-14.14 -17.661,-16.147 -30.515,-15.886 -12.855,0.262 -23.712,4.189 -33.112,9.774 0,0 -1.959,-10.495 -14.636,-10.495 z"
                   style="color:#000000;font-style:normal;font-variant:normal;font-weight:normal;font-stretch:normal;font-size:medium;line-height:normal;font-family:sans-serif;font-feature-settings:normal;text-indent:0px;text-align:start;text-decoration:none;text-decoration-line:none;text-decoration-style:solid;text-decoration-color:#000000;letter-spacing:normal;word-spacing:normal;text-transform:none;writing-mode:lr-tb;direction:ltr;text-orientation:mixed;dominant-baseline:auto;baseline-shift:baseline;text-anchor:start;white-space:normal;clip-rule:nonzero;display:inline;overflow:visible;visibility:visible;isolation:auto;mix-blend-mode:normal;vector-effect:none;fill:#51a2da;fill-opacity:1;fill-rule:nonzero;stroke:none;stroke-linejoin:round;stroke-miterlimit:4;stroke-dasharray:none;stroke-dashoffset:0;color-rendering:auto;image-rendering:auto;shape-rendering:auto;text-rendering:auto"
                   id="path84" /></g></g><g
               id="g89"
               rx="0"
               ry="0"
               style="fill:#51a2da;fill-opacity:1"><g
                 id="g88"
                 style="fill:#51a2da;fill-opacity:1"><g
                   id="g87"
                   style="fill:#51a2da;fill-opacity:1"><path
                     rx="0"
                     ry="0"
                     d="m 1181.619,140 c -19.899,0 -34.25,5.906 -44.711,13.396 -15.858,11.361 1.208,35.115 17.066,23.754 7.218,-5.168 12.585,-7.925 27.645,-7.925 18.746,0.377 33.824,7.428 33.824,21.457 -10.05,6.364 -53.747,11.624 -77.211,24.975 -23.464,13.352 -22.221,30.204 -22.221,41.138 0,23.985 25.266,40.166 47.149,40.166 21.884,0 31.174,-4.593 52.583,-19.274 v 4.202 c -0.692,20.148 29.937,20.148 29.245,0 v -86.107 c 0.095,-35.71 -25.529,-55.238 -63.369,-55.782 z m 34.839,79.451 c -0.01,9.469 0.131,12.198 -0.129,21.664 -0.057,11.367 -7.193,16.637 -14.665,20.986 -7.473,4.349 -22.651,8.164 -31.446,8.581 -10.144,0.336 -23.602,-1.957 -24.309,-13.995 0.01,-7.267 3.525,-11.773 9.301,-16.792 13.677,-10.268 32.21,-13.715 61.248,-20.444 z"
                     style="color:#000000;font-style:normal;font-variant:normal;font-weight:normal;font-stretch:normal;font-size:medium;line-height:normal;font-family:sans-serif;font-feature-settings:normal;text-indent:0px;text-align:start;text-decoration:none;text-decoration-line:none;text-decoration-style:solid;text-decoration-color:#000000;letter-spacing:normal;word-spacing:normal;text-transform:none;writing-mode:lr-tb;direction:ltr;text-orientation:mixed;dominant-baseline:auto;baseline-shift:baseline;text-anchor:start;white-space:normal;clip-rule:nonzero;display:inline;overflow:visible;visibility:visible;opacity:1;isolation:auto;mix-blend-mode:normal;vector-effect:none;fill:#51a2da;fill-opacity:1;fill-rule:nonzero;stroke:none;stroke-linejoin:miter;stroke-miterlimit:4;stroke-dasharray:none;stroke-dashoffset:0;color-rendering:auto;image-rendering:auto;shape-rendering:auto;text-rendering:auto"
                     id="path86" /></g></g></g><g
               id="g91"
               style="fill:#51a2da;fill-opacity:1"><g
                 id="g90"
                 style="fill:#51a2da;fill-opacity:1"><path
                   rx="0"
                   ry="0"
                   d="m 810.221,75.023 c -9.139,-0.543 -15.867,8.471 -14.465,17.035 v 66.118 c -28.848,-24.102 -75.83,-22.426 -102.461,4.262 -26.932,23.914 -32.048,67.28 -12.461,97.144 14.389,22.546 40.708,38.624 67.832,37.347 17.056,-0.155 33.975,-7.474 47.09,-18.313 -1.346,8.557 5.285,17.594 14.465,17.044 9.01,0.4 15.987,-8.462 14.604,-17.034 -0.157,-63.592 0.156,-127.188 -0.157,-190.778 -0.469,-7.172 -7.352,-13.068 -14.447,-12.825 z m -63.284,95.012 c 26.045,-0.677 49.309,22.688 48.819,48.402 0.547,25.739 -22.796,49.064 -48.819,48.403 -24.742,0.654 -47.423,-20.233 -48.687,-44.718 -2.635,-25.24 18.159,-49.842 43.629,-51.845 1.68,-0.164 3.369,-0.242 5.058,-0.242 z"
                   style="font-style:normal;font-variant:normal;font-weight:bold;font-stretch:normal;font-size:medium;line-height:25px;font-family:Comfortaa;letter-spacing:0px;word-spacing:0px;fill:#51a2da;fill-opacity:1;stroke:none;stroke-linejoin:miter"
                   id="path89" /></g></g><g
               id="g94"
               rx="0"
               ry="0"
               style="fill:#51a2da;fill-opacity:1"><g
                 id="g93"
                 style="fill:#51a2da;fill-opacity:1"><g
                   id="g92"
                   style="fill:#51a2da;fill-opacity:1"><path
                     rx="0"
                     ry="0"
                     d="m 428,127.386 v 155.259 c -0.041,19.14 29.008,19.14 28.966,0 V 179.034 h 29.793 c 6.968,0 12.924,-5.059 12.924,-13.181 0,-8.122 -6.381,-13.055 -12.924,-13.055 h -29.793 v -23.881 c 0,-15.28 11.919,-27.982 35.911,-27.688 8.345,0.109 11.302,2.121 14.35,3.984 16.639,11.054 32.656,-14.547 15.229,-24.34 C 511.768,74.312 501.782,72 489.867,72 452.318,72 428.22,100.608 428,127.386 Z"
                     style="font-style:normal;font-variant:normal;font-weight:bold;font-stretch:normal;font-size:medium;line-height:25px;font-family:Comfortaa;letter-spacing:0px;word-spacing:0px;fill:#51a2da;fill-opacity:1;stroke:none;stroke-linejoin:miter;stroke-miterlimit:4;stroke-dasharray:none"
                     id="path91" /></g></g></g></g></g></g><path
         style="fill:#51a2da;stroke-width:1.05695"
         d="m 55.890976,482.84926 c -6.29134,-0.55925 -11.193,-4.87968 -12.64427,-11.14492 -0.27248,-1.17627 -0.27553,-1.41475 -0.32126,-25.07111 -0.0487,-25.19412 0.0194,-29.79354 0.49736,-33.58211 1.2256,-9.7151 4.62422,-18.83228 10.05461,-26.97263 5.06578,-7.59378 12.28547,-14.39673 20.21166,-19.04498 13.57658,-7.9619 29.858834,-10.47987 45.319854,-7.00852 9.83181,2.20747 19.54643,7.17376 27.20405,13.90721 1.90032,1.67097 5.21753,5.07849 6.80312,6.98831 11.10111,13.37111 16.07262,30.60585 13.83592,47.965 -1.69762,13.17531 -7.84131,25.79164 -17.18311,35.28622 -3.88699,3.95057 -7.95452,7.18148 -12.4084,9.85623 -6.97732,4.19016 -15.00921,7.08085 -22.84827,8.2231 -4.60143,0.67049 -3.63269,0.64959 -31.404874,0.67761 -14.26085,0.0144 -26.46323,-0.0213 -27.11639,-0.0794 z"
         id="path97"
         sodipodi:nodetypes="ssscssssssssssss" /><path
         style="color:#000000;fill:none;stroke:#ffffff;stroke-width:1.07719;stroke-linecap:round;stroke-linejoin:round;stroke-dasharray:none;stroke-opacity:1;paint-order:stroke fill markers"
         d="m 105.14422,370.37227 c -27.798364,0 -50.345674,22.5473 -50.345674,50.34567 0,27.79838 22.54731,50.34362 50.345674,50.34362 27.79838,0 50.34569,-22.54524 50.34569,-50.34362 0,-27.79837 -22.54731,-50.34567 -50.34569,-50.34567 z m 0,1.07759 c 27.21622,0 49.2681,22.05187 49.26809,49.26808 0,27.21622 -22.05187,49.26603 -49.26809,49.26603 -27.216204,0 -49.268084,-22.04981 -49.268084,-49.26603 0,-27.21621 22.05188,-49.26808 49.268084,-49.26808 z"
         id="path98" /><path
         style="color:#000000;fill:none;stroke:#ffffff;stroke-width:1.07719;stroke-linecap:round;stroke-linejoin:round;stroke-dasharray:none;stroke-opacity:1;paint-order:stroke fill markers"
         d="m 105.14422,382.21138 c -21.259864,0 -38.506554,17.2467 -38.506554,38.50656 0,21.25987 17.24669,38.5045 38.506554,38.5045 21.25987,0 38.50656,-17.24463 38.50656,-38.5045 0,-21.25986 -17.24669,-38.50656 -38.50656,-38.50656 z m 0,1.0776 c 20.67772,0 37.42897,16.75126 37.42897,37.42896 0,20.67771 -16.75125,37.42897 -37.42897,37.42897 -20.677704,0 -37.428964,-16.75126 -37.428964,-37.42897 0,-20.6777 16.75126,-37.42896 37.428964,-37.42896 z"
         id="path99" /><path
         style="fill:#ffffff;stroke-width:0.104482"
         d="m 135.25715,439.32255 c -0.62191,-0.0553 -1.10645,-0.48236 -1.24991,-1.1017 -0.0269,-0.11628 -0.0273,-0.13985 -0.0318,-2.47834 -0.005,-2.4905 0.002,-2.94516 0.0491,-3.31967 0.12115,-0.96036 0.45712,-1.86161 0.99392,-2.6663 0.50076,-0.75067 1.21445,-1.42316 1.99797,-1.88265 1.34208,-0.78705 2.95162,-1.03596 4.47997,-0.69281 0.9719,0.21822 1.93222,0.70914 2.68919,1.37476 0.18785,0.16518 0.51577,0.50202 0.67251,0.69081 1.09737,1.32177 1.58881,3.02547 1.36771,4.74145 -0.16782,1.30241 -0.77513,2.54957 -1.69859,3.48813 -0.38424,0.39053 -0.78632,0.7099 -1.2266,0.97431 -0.68972,0.41421 -1.48369,0.69996 -2.25861,0.81287 -0.45486,0.0663 -0.35909,0.0643 -3.10444,0.067 -1.40972,0.001 -2.61595,-0.002 -2.68052,-0.007 z"
         id="path100" /><path
         style="fill:#ffffff;stroke-width:0.104482"
         d="m 65.350126,415.33468 c -0.62191,-0.0553 -1.10645,-0.48236 -1.24991,-1.10171 -0.027,-0.11627 -0.0273,-0.13984 -0.0318,-2.47833 -0.005,-2.4905 0.002,-2.94516 0.0492,-3.31967 0.12114,-0.96036 0.45711,-1.86162 0.99391,-2.66631 0.50077,-0.75067 1.21445,-1.42315 1.99797,-1.88264 1.34208,-0.78705 2.95162,-1.03596 4.47998,-0.69281 0.9719,0.21821 1.93221,0.70914 2.68918,1.37475 0.18785,0.16519 0.51577,0.50203 0.67251,0.69082 1.09737,1.32176 1.58881,3.02547 1.36771,4.74145 -0.16781,1.30241 -0.77513,2.54956 -1.69859,3.48813 -0.38423,0.39052 -0.78632,0.7099 -1.22659,0.97431 -0.68973,0.41421 -1.4837,0.69996 -2.25862,0.81287 -0.45486,0.0663 -0.35909,0.0643 -3.10444,0.067 -1.40971,0.001 -2.61595,-0.002 -2.68052,-0.007 z"
         id="path101" /><path
         style="fill:#ffffff;stroke-width:0.104482"
         d="m 71.429636,467.45193 c -0.62191,-0.0553 -1.10645,-0.48236 -1.24991,-1.10171 -0.027,-0.11627 -0.0273,-0.13984 -0.0318,-2.47833 -0.005,-2.4905 0.002,-2.94516 0.0492,-3.31967 0.12114,-0.96036 0.45711,-1.86162 0.99391,-2.66631 0.50077,-0.75067 1.21445,-1.42315 1.99797,-1.88264 1.34208,-0.78705 2.95162,-1.03596 4.47998,-0.69281 0.9719,0.21821 1.93221,0.70914 2.68918,1.37475 0.18785,0.16519 0.51577,0.50203 0.67251,0.69082 1.09737,1.32176 1.58881,3.02547 1.36771,4.74145 -0.16781,1.30241 -0.77513,2.54956 -1.69859,3.48813 -0.38423,0.39052 -0.78632,0.7099 -1.22659,0.97431 -0.68973,0.41421 -1.4837,0.69996 -2.25862,0.81287 -0.45486,0.0663 -0.35909,0.0643 -3.10444,0.067 -1.40971,10e-4 -2.61595,-0.002 -2.68052,-0.007 z"
         id="path102" /><path
         style="fill:#ffffff;stroke-width:0.104482"
         d="m 118.12166,380.49222 c -0.62191,-0.0553 -1.10645,-0.48236 -1.24991,-1.10171 -0.027,-0.11627 -0.0273,-0.13984 -0.0318,-2.47833 -0.005,-2.4905 0.002,-2.94516 0.0492,-3.31967 0.12114,-0.96036 0.45711,-1.86162 0.99391,-2.66631 0.50077,-0.75067 1.21445,-1.42315 1.99797,-1.88264 1.34208,-0.78705 2.95162,-1.03596 4.47998,-0.69281 0.9719,0.21821 1.93221,0.70914 2.68918,1.37475 0.18785,0.16519 0.51577,0.50203 0.67251,0.69082 1.09737,1.32176 1.58881,3.02547 1.36771,4.74145 -0.16781,1.30241 -0.77513,2.54956 -1.69859,3.48813 -0.38423,0.39052 -0.78632,0.7099 -1.22659,0.97431 -0.68973,0.41421 -1.4837,0.69996 -2.25862,0.81287 -0.45486,0.0663 -0.35909,0.0643 -3.10444,0.067 -1.40971,10e-4 -2.61595,-0.002 -2.68052,-0.007 z"
         id="path103" /><g
         id="g105"
         style="fill:#000000;-webkit-print-color-adjust:exact"
         transform="matrix(0.11469429,0,0,0.11469429,85.699536,400.09451)"><g
           id="g104"><path
             rx="0"
             ry="0"
             d="M 178.519,0 C 79.968,0 0.098,79.84 0.033,178.367 H 0 V 316.526 H 0.033 C 0.087,338.894 18.205,357 40.584,357 h 0.191 0.034 137.782 C 277.153,356.933 357,277.071 357,178.519 357,79.926 277.11,0 178.519,0 Z m 36.176,73.454 c 29.976,0 58.278,22.968 58.278,54.625 0,2.936 -0.014,5.876 -0.495,9.205 -0.83,8.423 -8.509,14.463 -16.89,13.276 -8.381,-1.201 -14.066,-9.135 -12.515,-17.46 0.142,-0.95 0.191,-2.457 0.191,-5.021 0,-17.949 -14.679,-24.878 -28.569,-24.878 -13.881,0 -26.405,11.673 -26.438,24.878 0.24,15.275 0,30.441 0,45.685 l 25.754,-0.194 c 20.114,-0.416 20.339,29.901 0.228,29.747 l -25.982,0.194 c -0.067,12.286 0.101,10.055 0.034,16.243 0,0 0.221,15.007 -0.228,26.399 -3.11,33.459 -31.588,60.217 -65.81,60.217 -36.273,0 -66.19,-29.676 -66.19,-66.037 1.089,-37.406 30.947,-66.804 68.51,-66.455 l 20.922,-0.156 v 29.709 l -20.922,0.194 h -0.152 c -20.645,0.61 -38.311,14.6 -38.649,36.708 0,20.145 16.28,36.29 36.481,36.29 20.167,0 36.29,-14.688 36.29,-36.252 0.23,-35.76 -0.159,-75.263 -0.033,-112.406 0.013,-2.087 0.113,-3.747 0.343,-6.048 3.405,-27.5 28.004,-48.463 55.842,-48.463 z"
             style="fill:#ffffff;fill-opacity:1;fill-rule:nonzero;stroke:none"
             id="path104"
             sodipodi:nodetypes="sccccscccsssscccsscccccccscccccccscccs" /></g></g><text
         xml:space="preserve"
         style="font-style:normal;font-variant:normal;font-weight:bold;font-stretch:normal;font-size:46.1647px;line-height:0.9;font-family:Montserrat;-inkscape-font-specification:'Montserrat Bold';text-align:center;letter-spacing:-2px;text-anchor:middle;fill:#ffffff;fill-opacity:1;stroke-width:0;stroke-linecap:round;stroke-linejoin:round;paint-order:stroke fill markers"
         x="179.9001"
         y="595.05457"
         id="text107"
         inkscape:export-filename="CommOps 2.0.svg"
         inkscape:export-xdpi="96"
         inkscape:export-ydpi="96"><tspan
           sodipodi:role="line"
           id="tspan106"
           x="179.9001"
           y="595.05457"
           style="font-style:normal;font-variant:normal;font-weight:600;font-stretch:normal;font-family:Montserrat;-inkscape-font-specification:'Montserrat Semi-Bold';text-align:start;letter-spacing:-2px;text-anchor:start;fill:#ffffff;fill-opacity:1;stroke-width:0">COMMUNI<tspan
   id="tspan105"
   style="font-style:normal;font-variant:normal;font-weight:600;font-stretch:normal;font-family:Montserrat;-inkscape-font-specification:'Montserrat Semi-Bold';letter-spacing:1px;fill:#ffffff;fill-opacity:1">T</tspan>Y</tspan><tspan
           sodipodi:role="line"
           x="179.9001"
           y="636.60278"
           id="tspan107"
           style="font-style:normal;font-variant:normal;font-weight:600;font-stretch:normal;font-family:Montserrat;-inkscape-font-specification:'Montserrat Semi-Bold';text-align:start;letter-spacing:-2px;text-anchor:start;fill:#ffffff;fill-opacity:1;stroke-width:0">OPERATIONS</tspan></text><g
         style="fill:#ffffff;fill-opacity:1;-webkit-print-color-adjust:exact"
         id="g123"
         transform="translate(-375.10794,466.54988)"><g
           id="g122"
           rx="0"
           ry="0"
           style="fill:#ffffff;fill-opacity:1"><g
             id="g121"
             rx="0"
             ry="0"
             style="fill:#ffffff;fill-opacity:1"
             transform="matrix(0.10913285,0,0,0.10913285,512.09962,51.620517)"><g
               id="g108"
               style="fill:#ffffff;fill-opacity:1"><g
                 id="g107"
                 style="fill:#ffffff;fill-opacity:1"><path
                   rx="0"
                   ry="0"
                   d="m 557.997,146.523 c -28.544,10.981 -47.917,37.956 -47.997,71.253 -0.083,34.879 24.473,79.892 75.327,80.224 34.205,0.224 51.31,-12.509 60.545,-21.154 6.125,-5.403 6.554,-14.779 0.941,-20.703 -5.624,-5.935 -15.066,-6.078 -20.855,-0.304 -6.893,6.445 -17.043,15.997 -45.829,12.816 -12.352,-1.361 -25.623,-11.343 -30.053,-18.98 l 94.317,-39.915 c 7.212,-3.189 10.525,-11.522 7.472,-18.762 -16.837,-32.979 -46.69,-62.625 -93.868,-44.475 z m 59.2,43.385 -78.484,33.369 c -5.604,-20.818 17.366,-45.31 29.896,-49.868 18.787,-6.833 39.515,0.857 48.588,16.499 z"
                   style="fill:#ffffff;fill-opacity:1;fill-rule:evenodd;stroke:none"
                   id="path107" /></g></g><g
               id="g110"
               style="fill:#ffffff;fill-opacity:1"><g
                 id="g109"
                 style="fill:#ffffff;fill-opacity:1"><path
                   rx="0"
                   ry="0"
                   d="m 921.51,140 c -21.088,-0.002 -41.313,8.321 -56.225,23.139 -14.911,14.818 -23.287,34.916 -23.285,55.871 0.006,43.63 35.604,78.995 79.51,78.99 43.899,-0.006 79.484,-35.368 79.49,-78.99 0,-43.63 -35.583,-79.004 -79.49,-79.01 z m 0,29.593 c 13.189,0 25.838,5.207 35.165,14.474 9.326,9.268 14.565,21.837 14.565,34.943 0,13.106 -5.239,25.676 -14.565,34.943 -9.327,9.268 -21.976,14.474 -35.165,14.474 -13.189,0 -25.838,-5.206 -35.164,-14.474 -9.326,-9.267 -14.566,-21.837 -14.565,-34.943 -10e-4,-13.106 5.239,-25.676 14.565,-34.943 9.326,-9.268 21.975,-14.474 35.164,-14.474 z"
                   style="fill:#ffffff;fill-opacity:1;stroke-linejoin:round"
                   id="path108" /></g></g><g
               id="g112"
               style="fill:#ffffff;fill-opacity:1"><g
                 id="g111"
                 style="fill:#ffffff;fill-opacity:1"><path
                   rx="0"
                   ry="0"
                   d="m 1036.737,141 c -12.678,0 -14.791,10.409 -14.724,14.608 v 126.413 c -0.347,8.172 6.452,14.979 14.961,14.979 8.51,0 15.309,-6.807 14.962,-14.979 0,0 0.225,-47.013 0,-77.108 -0.226,-30.095 24.392,-36.618 32.957,-36.618 6.361,0 11.443,3.525 16.483,3.337 7.481,-0.28 13.624,-5.272 13.624,-14.025 -0.225,-14.14 -17.661,-16.147 -30.515,-15.886 -12.855,0.262 -23.712,4.189 -33.112,9.774 0,0 -1.959,-10.495 -14.636,-10.495 z"
                   style="color:#000000;font-style:normal;font-variant:normal;font-weight:normal;font-stretch:normal;font-size:medium;line-height:normal;font-family:sans-serif;font-feature-settings:normal;text-indent:0px;text-align:start;text-decoration:none;text-decoration-line:none;text-decoration-style:solid;text-decoration-color:#000000;letter-spacing:normal;word-spacing:normal;text-transform:none;writing-mode:lr-tb;direction:ltr;text-orientation:mixed;dominant-baseline:auto;baseline-shift:baseline;text-anchor:start;white-space:normal;clip-rule:nonzero;display:inline;overflow:visible;visibility:visible;isolation:auto;mix-blend-mode:normal;vector-effect:none;fill:#ffffff;fill-opacity:1;fill-rule:nonzero;stroke:none;stroke-linejoin:round;stroke-miterlimit:4;stroke-dasharray:none;stroke-dashoffset:0;color-rendering:auto;image-rendering:auto;shape-rendering:auto;text-rendering:auto"
                   id="path110" /></g></g><g
               id="g115"
               rx="0"
               ry="0"
               style="fill:#ffffff;fill-opacity:1"><g
                 id="g114"
                 style="fill:#ffffff;fill-opacity:1"><g
                   id="g113"
                   style="fill:#ffffff;fill-opacity:1"><path
                     rx="0"
                     ry="0"
                     d="m 1181.619,140 c -19.899,0 -34.25,5.906 -44.711,13.396 -15.858,11.361 1.208,35.115 17.066,23.754 7.218,-5.168 12.585,-7.925 27.645,-7.925 18.746,0.377 33.824,7.428 33.824,21.457 -10.05,6.364 -53.747,11.624 -77.211,24.975 -23.464,13.352 -22.221,30.204 -22.221,41.138 0,23.985 25.266,40.166 47.149,40.166 21.884,0 31.174,-4.593 52.583,-19.274 v 4.202 c -0.692,20.148 29.937,20.148 29.245,0 v -86.107 c 0.095,-35.71 -25.529,-55.238 -63.369,-55.782 z m 34.839,79.451 c -0.01,9.469 0.131,12.198 -0.129,21.664 -0.057,11.367 -7.193,16.637 -14.665,20.986 -7.473,4.349 -22.651,8.164 -31.446,8.581 -10.144,0.336 -23.602,-1.957 -24.309,-13.995 0.01,-7.267 3.525,-11.773 9.301,-16.792 13.677,-10.268 32.21,-13.715 61.248,-20.444 z"
                     style="color:#000000;font-style:normal;font-variant:normal;font-weight:normal;font-stretch:normal;font-size:medium;line-height:normal;font-family:sans-serif;font-feature-settings:normal;text-indent:0px;text-align:start;text-decoration:none;text-decoration-line:none;text-decoration-style:solid;text-decoration-color:#000000;letter-spacing:normal;word-spacing:normal;text-transform:none;writing-mode:lr-tb;direction:ltr;text-orientation:mixed;dominant-baseline:auto;baseline-shift:baseline;text-anchor:start;white-space:normal;clip-rule:nonzero;display:inline;overflow:visible;visibility:visible;opacity:1;isolation:auto;mix-blend-mode:normal;vector-effect:none;fill:#ffffff;fill-opacity:1;fill-rule:nonzero;stroke:none;stroke-linejoin:miter;stroke-miterlimit:4;stroke-dasharray:none;stroke-dashoffset:0;color-rendering:auto;image-rendering:auto;shape-rendering:auto;text-rendering:auto"
                     id="path112" /></g></g></g><g
               id="g117"
               style="fill:#ffffff;fill-opacity:1"><g
                 id="g116"
                 style="fill:#ffffff;fill-opacity:1"><path
                   rx="0"
                   ry="0"
                   d="m 810.221,75.023 c -9.139,-0.543 -15.867,8.471 -14.465,17.035 v 66.118 c -28.848,-24.102 -75.83,-22.426 -102.461,4.262 -26.932,23.914 -32.048,67.28 -12.461,97.144 14.389,22.546 40.708,38.624 67.832,37.347 17.056,-0.155 33.975,-7.474 47.09,-18.313 -1.346,8.557 5.285,17.594 14.465,17.044 9.01,0.4 15.987,-8.462 14.604,-17.034 -0.157,-63.592 0.156,-127.188 -0.157,-190.778 -0.469,-7.172 -7.352,-13.068 -14.447,-12.825 z m -63.284,95.012 c 26.045,-0.677 49.309,22.688 48.819,48.402 0.547,25.739 -22.796,49.064 -48.819,48.403 -24.742,0.654 -47.423,-20.233 -48.687,-44.718 -2.635,-25.24 18.159,-49.842 43.629,-51.845 1.68,-0.164 3.369,-0.242 5.058,-0.242 z"
                   style="font-style:normal;font-variant:normal;font-weight:bold;font-stretch:normal;font-size:medium;line-height:25px;font-family:Comfortaa;letter-spacing:0px;word-spacing:0px;fill:#ffffff;fill-opacity:1;stroke:none;stroke-linejoin:miter"
                   id="path115" /></g></g><g
               id="g120"
               rx="0"
               ry="0"
               style="fill:#ffffff;fill-opacity:1"><g
                 id="g119"
                 style="fill:#ffffff;fill-opacity:1"><g
                   id="g118"
                   style="fill:#ffffff;fill-opacity:1"><path
                     rx="0"
                     ry="0"
                     d="m 428,127.386 v 155.259 c -0.041,19.14 29.008,19.14 28.966,0 V 179.034 h 29.793 c 6.968,0 12.924,-5.059 12.924,-13.181 0,-8.122 -6.381,-13.055 -12.924,-13.055 h -29.793 v -23.881 c 0,-15.28 11.919,-27.982 35.911,-27.688 8.345,0.109 11.302,2.121 14.35,3.984 16.639,11.054 32.656,-14.547 15.229,-24.34 C 511.768,74.312 501.782,72 489.867,72 452.318,72 428.22,100.608 428,127.386 Z"
                     style="font-style:normal;font-variant:normal;font-weight:bold;font-stretch:normal;font-size:medium;line-height:25px;font-family:Comfortaa;letter-spacing:0px;word-spacing:0px;fill:#ffffff;fill-opacity:1;stroke:none;stroke-linejoin:miter;stroke-miterlimit:4;stroke-dasharray:none"
                     id="path117" /></g></g></g></g></g></g><path
         id="path123"
         style="fill:#fafcfe;fill-opacity:1;stroke-width:1.05695"
         d="m 104.38142,520.13322 c -10.745464,0.15037 -21.357704,3.05116 -30.691534,8.52496 -7.92612,4.64818 -15.14635,11.45069 -20.21206,19.0444 -5.43039,8.14028 -8.82889,17.25893 -10.05449,26.97396 -0.47796,3.78857 -0.54732,8.38836 -0.49862,33.58227 0.04573,23.65622 0.04942,23.89367 0.3219,25.06994 1.45127,6.26524 6.3531,10.58716 12.64437,11.14641 0.65316,0.0581 12.85631,0.0922 27.11702,0.0778 27.772044,-0.028 26.803394,-0.007 31.404754,-0.67745 7.83899,-1.14225 15.87092,-4.03184 22.84824,-8.222 4.45381,-2.67475 8.52181,-5.90615 12.40873,-9.85672 9.34173,-9.49451 15.48484,-22.11125 17.18246,-35.28642 2.2367,-17.35908 -2.73413,-34.59349 -13.83517,-47.96446 -1.58559,-1.90982 -4.90366,-5.31815 -6.80398,-6.98912 -7.65755,-6.73338 -17.37154,-11.69924 -27.20328,-13.90671 -4.83156,-1.08473 -9.74401,-1.58525 -14.62834,-1.5169 z m 18.53316,9.69262 c 0.48283,-0.007 0.96986,0.0421 1.44747,0.14937 0.9719,0.21821 1.9318,0.71034 2.68877,1.37595 0.18785,0.16519 0.5144,0.50128 0.67114,0.69007 1.09737,1.32176 1.58863,3.02619 1.36753,4.74217 -0.0263,0.20425 -0.064,0.40535 -0.1115,0.60592 16.08634,8.5512 27.0518,25.47583 27.0518,44.95379 0,28.08938 -22.7953,50.88255 -50.88466,50.88255 -8.793374,0 -17.068524,-2.23375 -24.287294,-6.16439 -0.05202,0.0572 -0.10357,0.1132 -0.15779,0.16831 -0.38423,0.39052 -0.7863,0.71179 -1.22657,0.9762 -0.68973,0.41421 -1.48466,0.6992 -2.25958,0.81211 -0.45486,0.0663 -0.35793,0.0646 -3.10323,0.0673 -1.40971,0.001 -2.61579,-0.003 -2.68036,-0.008 -0.62191,-0.0553 -1.10625,-0.48308 -1.24971,-1.10243 -0.027,-0.11627 -0.02916,-0.13994 -0.03366,-2.47838 -0.005,-2.4905 0.0033,-2.94333 0.05049,-3.31784 0.09827,-0.77902 0.33971,-1.51942 0.71322,-2.20067 -10.22744,-9.30864 -16.65017,-22.72468 -16.65017,-37.63436 0,-28.08937 22.79529,-50.88466 50.884654,-50.88466 4.30114,0 8.47556,0.54026 12.46554,1.54636 0.0848,-0.1537 0.17304,-0.30699 0.27141,-0.45444 0.50071,-0.75067 1.21517,-1.42138 1.99869,-1.88087 0.92268,-0.5411 1.97159,-0.8288 3.03381,-0.84366 z m -17.76945,3.7891 c -26.925034,0 -48.730274,21.80312 -48.730274,48.72817 0,14.24609 6.10727,27.05435 15.84438,35.96177 0.29176,-0.25552 0.6036,-0.48608 0.92992,-0.67745 1.34208,-0.78705 2.95082,-1.03533 4.47918,-0.69218 0.9719,0.21821 1.93391,0.71038 2.69088,1.37594 0.18785,0.16519 0.5144,0.50129 0.67114,0.69008 1.09737,1.32176 1.58863,3.02619 1.36753,4.74217 -0.06604,0.51251 -0.2009,1.0159 -0.39554,1.49586 6.88383,3.7193 14.76492,5.83198 23.142784,5.83198 26.92508,0 48.72817,-21.80312 48.72817,-48.72817 1e-5,-18.61293 -10.42181,-34.77341 -25.74949,-42.98035 -0.21457,0.3249 -0.45913,0.63139 -0.73216,0.90888 -0.38423,0.39052 -0.78629,0.7097 -1.22656,0.97411 -0.68973,0.41415 -1.48256,0.69919 -2.25748,0.8121 -0.45486,0.0663 -0.35999,0.0646 -3.10534,0.0673 -1.40971,10e-4 -2.61578,-0.001 -2.68035,-0.006 v -0.002 c -0.62191,-0.0553 -1.10625,-0.48099 -1.24971,-1.10034 -0.027,-0.11627 -0.0271,-0.13989 -0.0316,-2.47838 -0.005,-2.4905 0.001,-2.94543 0.0484,-3.31994 0.007,-0.0551 0.0169,-0.10941 0.0252,-0.1641 -3.76977,-0.93422 -7.70929,-1.43906 -11.76916,-1.43906 z m 0,9.6821 c 21.55108,0 39.04397,17.495 39.04397,39.04607 0,2.50131 -0.244,4.9443 -0.69428,7.31522 0.24366,0.15874 0.47487,0.33254 0.69007,0.52177 0.18785,0.16518 0.51651,0.50339 0.67325,0.69218 1.09737,1.32175 1.58863,3.02408 1.36753,4.74006 -0.16782,1.30241 -0.77438,2.54969 -1.69784,3.48825 -0.38424,0.39051 -0.78629,0.70969 -1.22657,0.9741 -0.68972,0.41421 -1.48466,0.70129 -2.25958,0.8142 -0.34448,0.0502 -0.38547,0.0617 -1.5716,0.0652 -6.61556,12.16634 -19.51131,20.43087 -34.32495,20.43087 -21.551024,10e-6 -39.046074,-17.4908 -39.046074,-39.04187 0,-1.82593 0.13571,-3.62016 0.3787,-5.37964 -0.36143,-0.001 -1.10052,0 -1.12769,-0.002 v -0.002 c -0.62191,-0.0553 -1.10625,-0.48099 -1.24971,-1.10034 -0.027,-0.11627 -0.02705,-0.13989 -0.03155,-2.47838 -0.005,-2.49046 0.0012,-2.94542 0.04838,-3.31993 0.12114,-0.96036 0.45834,-1.86304 0.99514,-2.66773 0.50077,-0.75067 1.21311,-1.42139 1.99659,-1.88088 0.92268,-0.5411 1.97159,-0.8288 3.03381,-0.84366 0.06106,-8.5e-4 0.12188,0.018 0.18304,0.0189 6.45055,-12.68622 19.62239,-21.39023 34.819364,-21.39023 z m 0,2.15438 c -14.162474,0 -26.445734,7.96903 -32.629214,19.66715 0.64024,0.26048 1.24987,0.62384 1.76306,1.07509 0.18785,0.16519 0.5144,0.50132 0.67114,0.69007 1.09737,1.32176 1.59073,3.02619 1.36963,4.74217 -0.16781,1.30241 -0.77648,2.54968 -1.69994,3.48825 -0.38423,0.39052 -0.7863,0.70969 -1.22657,0.9741 -0.68973,0.41421 -1.48255,0.69919 -2.25747,0.8121 -0.36426,0.0531 -1.08665,0.0516 -2.4868,0.0547 -0.25703,1.75896 -0.39553,3.55734 -0.39553,5.38806 0,20.38674 16.50496,36.88959 36.891694,36.88959 13.58851,0 25.4206,-7.35192 31.82132,-18.27859 -0.7258,-0.001 -1.6672,-0.003 -1.70836,-0.006 -0.62191,-0.0553 -1.10835,-0.4831 -1.25181,-1.10244 -0.0269,-0.11628 -0.0271,-0.13989 -0.0316,-2.47838 -0.005,-2.4905 0.003,-2.94543 0.0505,-3.31994 0.12115,-0.96034 0.45624,-1.86093 0.99304,-2.66562 0.50076,-0.75067 1.21519,-1.42349 1.99869,-1.88298 1.33164,-0.78093 2.92573,-1.02984 4.44342,-0.69849 0.36982,-2.09729 0.57436,-4.25282 0.57436,-6.45684 0,-20.38674 -16.50283,-36.89169 -36.88959,-36.89169 z m 1.0288,16.26727 c 11.30782,0 20.47084,9.167 20.47084,20.47504 0,11.30334 -9.15793,20.46316 -20.46242,20.47084 h -15.802314 -0.0042 -0.02104 c -2.56674,0 -4.6455,-2.0757 -4.6517,-4.64118 h -0.0042 V 582.1769 h 0.0042 c 0.0075,-11.30047 9.16762,-20.45821 20.470844,-20.45821 z m 4.14887,8.42607 c -3.19285,0 -6.0137,2.40439 -6.40424,5.55848 -0.0264,0.26391 -0.0364,0.45281 -0.0379,0.69218 -0.0144,4.26008 0.0285,8.79116 0.002,12.89263 0,2.47326 -1.84846,4.15939 -4.161494,4.15939 -2.31694,0 -4.18464,-1.85309 -4.18464,-4.1636 0.03877,-2.53566 2.06503,-4.13992 4.4329,-4.20988 h 0.01683 l 2.400534,-0.0231 v -3.4062 l -2.400534,0.0168 c -4.30826,-0.04 -7.73102,3.33214 -7.85592,7.62239 0,4.17039 3.43052,7.574 7.59083,7.574 3.925064,0 7.192054,-3.06952 7.548754,-6.90707 0.0515,-1.30659 0.0252,-3.02749 0.0252,-3.02749 0.008,-0.70973 -0.0119,-0.45281 -0.004,-1.86195 l 2.98121,-0.0231 c 2.30661,0.0177 2.27961,-3.45811 -0.0273,-3.4104 l -2.95386,0.021 c 0,-1.7484 0.0275,-3.48673 0,-5.23869 0.004,-1.51453 1.43963,-2.85497 3.0317,-2.85497 1.5931,0 3.27786,0.79633 3.27786,2.85497 0,0.29408 -0.005,0.46541 -0.021,0.57437 -0.17789,0.95482 0.4736,1.86515 1.43485,2.0029 0.96126,0.13614 1.84249,-0.55715 1.93769,-1.52322 0.0552,-0.38181 0.0568,-0.7173 0.0568,-1.05405 0,-3.63087 -3.24808,-6.26538 -6.68616,-6.26538 z" /></g></g></svg>
