<?xml version="1.0" encoding="UTF-8" standalone="no"?>
<!-- Created with Inkscape (http://www.inkscape.org/) -->

<svg
   width="81.160027mm"
   height="82.23317mm"
   viewBox="0 0 81.160026 82.233168"
   version="1.1"
   id="svg310393"
   xml:space="preserve"
   sodipodi:docname="badger.svg"
   inkscape:version="1.2.2 (b0a8486541, 2022-12-01)"
   xmlns:inkscape="http://www.inkscape.org/namespaces/inkscape"
   xmlns:sodipodi="http://sodipodi.sourceforge.net/DTD/sodipodi-0.dtd"
   xmlns="http://www.w3.org/2000/svg"
   xmlns:svg="http://www.w3.org/2000/svg"><sodipodi:namedview
     id="namedview310395"
     pagecolor="#ffffff"
     bordercolor="#000000"
     borderopacity="0.25"
     inkscape:showpageshadow="2"
     inkscape:pageopacity="0.0"
     inkscape:pagecheckerboard="0"
     inkscape:deskcolor="#d1d1d1"
     inkscape:document-units="mm"
     showgrid="false"
     inkscape:zoom="0.5253601"
     inkscape:cx="1435.2061"
     inkscape:cy="460.63643"
     inkscape:window-width="1920"
     inkscape:window-height="979"
     inkscape:window-x="0"
     inkscape:window-y="32"
     inkscape:window-maximized="1"
     inkscape:current-layer="layer1"
     showguides="true"><sodipodi:guide
       position="-245.38592,75.025798"
       orientation="0,-1"
       id="guide986"
       inkscape:locked="false" /><sodipodi:guide
       position="-245.67179,74.739758"
       orientation="1,0"
       id="guide988"
       inkscape:locked="false" /><sodipodi:guide
       position="-246.27231,76.223438"
       orientation="1,0"
       id="guide990"
       inkscape:locked="false" /><sodipodi:guide
       position="-247.64988,71.270388"
       orientation="1,0"
       id="guide992"
       inkscape:locked="false" /><sodipodi:guide
       position="-245.7543,67.770888"
       orientation="0,-1"
       id="guide994"
       inkscape:locked="false" /></sodipodi:namedview><defs
     id="defs310390"><inkscape:path-effect
       effect="powerstroke"
       id="path-effect3695"
       is_visible="true"
       lpeversion="1"
       offset_points="0.22516346,0.02046955 | 0.68124711,0.16303518 | 0.94048689,0.085696023"
       not_jump="false"
       sort_points="true"
       interpolator_type="CentripetalCatmullRom"
       interpolator_beta="0.2"
       start_linecap_type="zerowidth"
       linejoin_type="round"
       miter_limit="4"
       scale_width="1"
       end_linecap_type="zerowidth" /><inkscape:path-effect
       effect="powerstroke"
       id="path-effect3691"
       is_visible="true"
       lpeversion="1"
       offset_points="0.22387814,0.03075037 | 0.57916175,0.14564715 | 0.83881387,0.080190131"
       not_jump="false"
       sort_points="true"
       interpolator_type="CentripetalCatmullRom"
       interpolator_beta="0.2"
       start_linecap_type="zerowidth"
       linejoin_type="round"
       miter_limit="4"
       scale_width="1"
       end_linecap_type="zerowidth" /><inkscape:path-effect
       effect="powerstroke"
       id="path-effect3687"
       is_visible="true"
       lpeversion="1"
       offset_points="0.17992474,0.10414413 | 1.0255036,0.013703823 | 0.54403014,0.17011045 | 1.5655695,0.12848819 | 1.9419287,0.0347194"
       not_jump="false"
       sort_points="true"
       interpolator_type="CentripetalCatmullRom"
       interpolator_beta="0.2"
       start_linecap_type="zerowidth"
       linejoin_type="round"
       miter_limit="4"
       scale_width="1"
       end_linecap_type="zerowidth" /><inkscape:path-effect
       effect="powerstroke"
       id="path-effect3683"
       is_visible="true"
       lpeversion="1"
       offset_points="0.1739069,0.093802155 | 0.5,0.24631175 | 0.9204416,0.17932634"
       not_jump="false"
       sort_points="true"
       interpolator_type="CentripetalCatmullRom"
       interpolator_beta="0.2"
       start_linecap_type="zerowidth"
       linejoin_type="round"
       miter_limit="4"
       scale_width="1"
       end_linecap_type="zerowidth" /><inkscape:path-effect
       effect="powerstroke"
       id="path-effect3679"
       is_visible="true"
       lpeversion="1"
       offset_points="0.2,0.24631175 | 0.55923942,0.31708696 | 0.97053962,0.17826833"
       not_jump="false"
       sort_points="true"
       interpolator_type="CentripetalCatmullRom"
       interpolator_beta="0.2"
       start_linecap_type="zerowidth"
       linejoin_type="round"
       miter_limit="4"
       scale_width="1"
       end_linecap_type="zerowidth" /><inkscape:path-effect
       effect="powerstroke"
       id="path-effect3675"
       is_visible="true"
       lpeversion="1"
       offset_points="0.25934739,0.14800844 | 1.4788054,0.25476603 | 1,0.12564297 | 2.5605326,0.1572382 | 1.8357769,0.12404841"
       not_jump="false"
       sort_points="true"
       interpolator_type="CentripetalCatmullRom"
       interpolator_beta="0.2"
       start_linecap_type="zerowidth"
       linejoin_type="round"
       miter_limit="4"
       scale_width="1"
       end_linecap_type="zerowidth" /><inkscape:path-effect
       effect="powerstroke"
       id="path-effect3322"
       is_visible="true"
       lpeversion="1"
       offset_points="0.17905189,0.073200949 | 0.4403251,0.1133218 | 0.66549023,0.13744021"
       not_jump="false"
       sort_points="true"
       interpolator_type="CentripetalCatmullRom"
       interpolator_beta="0.2"
       start_linecap_type="zerowidth"
       linejoin_type="round"
       miter_limit="4"
       scale_width="1"
       end_linecap_type="zerowidth" /><inkscape:path-effect
       effect="powerstroke"
       id="path-effect3318"
       is_visible="true"
       lpeversion="1"
       offset_points="0.36815794,0.1249324 | 0.5832074,0.14345737 | 0.73901436,0.13229988"
       not_jump="false"
       sort_points="true"
       interpolator_type="CentripetalCatmullRom"
       interpolator_beta="0.2"
       start_linecap_type="zerowidth"
       linejoin_type="round"
       miter_limit="4"
       scale_width="1"
       end_linecap_type="zerowidth" /><inkscape:path-effect
       effect="powerstroke"
       id="path-effect3314"
       is_visible="true"
       lpeversion="1"
       offset_points="0.43614162,0.10366881 | 2.0303563,0.071011754 | 1.5571714,0.22735033 | 3.7566564,0.11664592 | 3.1284264,0.2022036"
       not_jump="false"
       sort_points="true"
       interpolator_type="CentripetalCatmullRom"
       interpolator_beta="0.2"
       start_linecap_type="zerowidth"
       linejoin_type="round"
       miter_limit="4"
       scale_width="1"
       end_linecap_type="zerowidth" /><inkscape:path-effect
       effect="powerstroke"
       id="path-effect3310"
       is_visible="true"
       lpeversion="1"
       offset_points="0.35782502,0.12302396 | 2.1318687,0.043625193 | 2.8122828,0.25084534"
       not_jump="false"
       sort_points="true"
       interpolator_type="CentripetalCatmullRom"
       interpolator_beta="0.2"
       start_linecap_type="zerowidth"
       linejoin_type="round"
       miter_limit="4"
       scale_width="1"
       end_linecap_type="zerowidth" /><inkscape:path-effect
       effect="powerstroke"
       id="path-effect3306"
       is_visible="true"
       lpeversion="1"
       offset_points="0.27581876,0.11790841 | 0.62079752,0.19487769 | 0.79787962,0.16273331"
       not_jump="false"
       sort_points="true"
       interpolator_type="CentripetalCatmullRom"
       interpolator_beta="0.2"
       start_linecap_type="zerowidth"
       linejoin_type="round"
       miter_limit="4"
       scale_width="1"
       end_linecap_type="zerowidth" /><inkscape:path-effect
       effect="powerstroke"
       id="path-effect2963"
       is_visible="true"
       lpeversion="1"
       offset_points="0.2190744,0.12431758 | 1.0733486,0.066197057 | 1.7829528,0.2335661"
       not_jump="false"
       sort_points="true"
       interpolator_type="CentripetalCatmullRom"
       interpolator_beta="0.2"
       start_linecap_type="zerowidth"
       linejoin_type="round"
       miter_limit="4"
       scale_width="1"
       end_linecap_type="zerowidth" /><inkscape:path-effect
       effect="powerstroke"
       id="path-effect2959"
       is_visible="true"
       lpeversion="1"
       offset_points="0.088514481,0.021356744 | 0.5,0.24631175 | 0.94856416,0.14917849"
       not_jump="false"
       sort_points="true"
       interpolator_type="CentripetalCatmullRom"
       interpolator_beta="0.2"
       start_linecap_type="zerowidth"
       linejoin_type="round"
       miter_limit="4"
       scale_width="1"
       end_linecap_type="zerowidth" /><inkscape:path-effect
       effect="powerstroke"
       id="path-effect2955"
       is_visible="true"
       lpeversion="1"
       offset_points="0.2145336,0.097339788 | 0.5,0.24631175 | 0.80307088,0.11192974"
       not_jump="false"
       sort_points="true"
       interpolator_type="CentripetalCatmullRom"
       interpolator_beta="0.2"
       start_linecap_type="zerowidth"
       linejoin_type="round"
       miter_limit="4"
       scale_width="1"
       end_linecap_type="zerowidth" /><inkscape:path-effect
       effect="powerstroke"
       id="path-effect2951"
       is_visible="true"
       lpeversion="1"
       offset_points="0.18995342,0.051770045 | 0.58090993,0.17232743 | 0.8797177,0.14793056"
       not_jump="false"
       sort_points="true"
       interpolator_type="CentripetalCatmullRom"
       interpolator_beta="0.2"
       start_linecap_type="zerowidth"
       linejoin_type="round"
       miter_limit="4"
       scale_width="1"
       end_linecap_type="zerowidth" /><inkscape:path-effect
       effect="powerstroke"
       id="path-effect2616"
       is_visible="true"
       lpeversion="1"
       offset_points="0.27750177,0.061493002 | 1.0151061,0.13899439 | 1.5702445,0.069846386"
       not_jump="false"
       sort_points="true"
       interpolator_type="CentripetalCatmullRom"
       interpolator_beta="0.2"
       start_linecap_type="zerowidth"
       linejoin_type="round"
       miter_limit="4"
       scale_width="1"
       end_linecap_type="zerowidth" /><inkscape:path-effect
       effect="powerstroke"
       id="path-effect2612"
       is_visible="true"
       lpeversion="1"
       offset_points="0.2811342,0.087443004 | 0.83697432,0.24897229 | 1.7776162,0.055977396"
       not_jump="false"
       sort_points="true"
       interpolator_type="CentripetalCatmullRom"
       interpolator_beta="0.2"
       start_linecap_type="zerowidth"
       linejoin_type="round"
       miter_limit="4"
       scale_width="1"
       end_linecap_type="zerowidth" /><inkscape:path-effect
       effect="powerstroke"
       id="path-effect2281"
       is_visible="true"
       lpeversion="1"
       offset_points="1.0043293,0.072370969 | 1.7714445,0.16761894 | 4.473391,0.081580175 | 7.5729589,0.10158552"
       not_jump="false"
       sort_points="true"
       interpolator_type="CentripetalCatmullRom"
       interpolator_beta="0.2"
       start_linecap_type="zerowidth"
       linejoin_type="round"
       miter_limit="4"
       scale_width="1"
       end_linecap_type="zerowidth" /><inkscape:path-effect
       effect="powerstroke"
       id="path-effect2277"
       is_visible="true"
       lpeversion="1"
       offset_points="0.44249937,0.10473674 | 1,0.24631175 | 1.5716814,0.1308693"
       not_jump="false"
       sort_points="true"
       interpolator_type="CentripetalCatmullRom"
       interpolator_beta="0.2"
       start_linecap_type="zerowidth"
       linejoin_type="round"
       miter_limit="4"
       scale_width="1"
       end_linecap_type="zerowidth" /><inkscape:path-effect
       effect="powerstroke"
       id="path-effect2273"
       is_visible="true"
       lpeversion="1"
       offset_points="0.37911313,0.11775331 | 1.0004717,0.18013163 | 1.8249409,0.10633576"
       not_jump="false"
       sort_points="true"
       interpolator_type="CentripetalCatmullRom"
       interpolator_beta="0.2"
       start_linecap_type="zerowidth"
       linejoin_type="round"
       miter_limit="4"
       scale_width="1"
       end_linecap_type="zerowidth" /><inkscape:path-effect
       effect="powerstroke"
       id="path-effect1948"
       is_visible="true"
       lpeversion="1"
       offset_points="0.35311967,0.1618876 | 2.0041457,0.14525095 | 3.6137444,0.10817402"
       not_jump="false"
       sort_points="true"
       interpolator_type="CentripetalCatmullRom"
       interpolator_beta="0.2"
       start_linecap_type="zerowidth"
       linejoin_type="round"
       miter_limit="4"
       scale_width="1"
       end_linecap_type="zerowidth" /><inkscape:path-effect
       effect="powerstroke"
       id="path-effect1944"
       is_visible="true"
       lpeversion="1"
       offset_points="0.6117251,0.091972939 | 1.9605041,0.21281377 | 3.2060605,0.15705568"
       not_jump="false"
       sort_points="true"
       interpolator_type="CentripetalCatmullRom"
       interpolator_beta="0.2"
       start_linecap_type="zerowidth"
       linejoin_type="round"
       miter_limit="4"
       scale_width="1"
       end_linecap_type="zerowidth" /><inkscape:path-effect
       effect="powerstroke"
       id="path-effect1623"
       is_visible="true"
       lpeversion="1"
       offset_points="0.21275306,0.065175459 | 0.50168968,0.14920316 | 0.93853428,0.11183249"
       not_jump="false"
       sort_points="true"
       interpolator_type="CentripetalCatmullRom"
       interpolator_beta="0.2"
       start_linecap_type="zerowidth"
       linejoin_type="round"
       miter_limit="4"
       scale_width="1"
       end_linecap_type="zerowidth" /><inkscape:path-effect
       effect="powerstroke"
       id="path-effect1619"
       is_visible="true"
       lpeversion="1"
       offset_points="0.55273706,0.11694868 | 1.0125549,0.13571171 | 1.7977807,0.10889538"
       not_jump="false"
       sort_points="true"
       interpolator_type="CentripetalCatmullRom"
       interpolator_beta="0.2"
       start_linecap_type="zerowidth"
       linejoin_type="round"
       miter_limit="4"
       scale_width="1"
       end_linecap_type="zerowidth" /><inkscape:path-effect
       effect="powerstroke"
       id="path-effect1302"
       is_visible="true"
       lpeversion="1"
       offset_points="0.14429965,0.035846186 | 0.46475122,0.084718105 | 0.7627947,0.086766917"
       not_jump="false"
       sort_points="true"
       interpolator_type="CentripetalCatmullRom"
       interpolator_beta="0.2"
       start_linecap_type="zerowidth"
       linejoin_type="round"
       miter_limit="4"
       scale_width="1"
       end_linecap_type="zerowidth" /><inkscape:path-effect
       effect="powerstroke"
       id="path-effect1298"
       is_visible="true"
       lpeversion="1"
       offset_points="0.25249132,0.10415353 | 0.95816016,0.20921689 | 1.6954449,0.097618723"
       not_jump="false"
       sort_points="true"
       interpolator_type="CentripetalCatmullRom"
       interpolator_beta="0.2"
       start_linecap_type="zerowidth"
       linejoin_type="round"
       miter_limit="4"
       scale_width="1"
       end_linecap_type="zerowidth" /><inkscape:path-effect
       effect="powerstroke"
       id="path-effect16133"
       is_visible="true"
       lpeversion="1"
       offset_points="0.43758487,0.1118203 | 1.0628217,0.197194 | 1.6182632,0.068867382"
       not_jump="false"
       sort_points="true"
       interpolator_type="CentripetalCatmullRom"
       interpolator_beta="0.2"
       start_linecap_type="zerowidth"
       linejoin_type="round"
       miter_limit="4"
       scale_width="1"
       end_linecap_type="zerowidth" /><inkscape:path-effect
       effect="powerstroke"
       id="path-effect16129"
       is_visible="true"
       lpeversion="1"
       offset_points="0.37362858,0.097716598 | 4.5,0.24631175 | 6.1831328,0.16875225 | 7.942762,0.15579333"
       not_jump="false"
       sort_points="true"
       interpolator_type="CentripetalCatmullRom"
       interpolator_beta="0.2"
       start_linecap_type="zerowidth"
       linejoin_type="round"
       miter_limit="4"
       scale_width="1"
       end_linecap_type="zerowidth" /><inkscape:path-effect
       effect="powerstroke"
       id="path-effect16125"
       is_visible="true"
       lpeversion="1"
       offset_points="0.2448703,0.12023243 | 2.0620961,0.35755621 | 1.1349358,0.166489 | 2.9305473,0.19678339 | 3.8007904,0.28320756"
       not_jump="false"
       sort_points="true"
       interpolator_type="CentripetalCatmullRom"
       interpolator_beta="0.2"
       start_linecap_type="zerowidth"
       linejoin_type="round"
       miter_limit="4"
       scale_width="1"
       end_linecap_type="zerowidth" /><inkscape:path-effect
       effect="powerstroke"
       id="path-effect15818"
       is_visible="true"
       lpeversion="1"
       offset_points="0.36285189,0.11488737 | 3.1693699,0.24734725 | 2.1095582,0.14745226 | 4.6788779,0.26448414 | 3.7379445,0.24591929"
       not_jump="false"
       sort_points="true"
       interpolator_type="CentripetalCatmullRom"
       interpolator_beta="0.2"
       start_linecap_type="zerowidth"
       linejoin_type="round"
       miter_limit="4"
       scale_width="1"
       end_linecap_type="zerowidth" /><inkscape:path-effect
       effect="powerstroke"
       id="path-effect15704"
       is_visible="true"
       lpeversion="1"
       offset_points="0.20541237,0.18521011 | 0.5,0.24631175 | 0.79257175,0.14741934"
       not_jump="false"
       sort_points="true"
       interpolator_type="CentripetalCatmullRom"
       interpolator_beta="0.2"
       start_linecap_type="zerowidth"
       linejoin_type="round"
       miter_limit="4"
       scale_width="1"
       end_linecap_type="zerowidth" /><inkscape:path-effect
       effect="powerstroke"
       id="path-effect15343"
       is_visible="true"
       lpeversion="1"
       offset_points="0.2236331,0.072196549 | 1.5014966,0.18692504 | 2.366349,0.08585954"
       not_jump="false"
       sort_points="true"
       interpolator_type="CentripetalCatmullRom"
       interpolator_beta="0.2"
       start_linecap_type="zerowidth"
       linejoin_type="round"
       miter_limit="4"
       scale_width="1"
       end_linecap_type="zerowidth" /><inkscape:path-effect
       effect="powerstroke"
       id="path-effect15339"
       is_visible="true"
       lpeversion="1"
       offset_points="0.36751824,0.090447192 | 2,0.063587019 | 1.0038404,0.22530514 | 3.8130031,0.15859483"
       not_jump="false"
       sort_points="true"
       interpolator_type="CentripetalCatmullRom"
       interpolator_beta="0.2"
       start_linecap_type="zerowidth"
       linejoin_type="round"
       miter_limit="4"
       scale_width="1"
       end_linecap_type="zerowidth" /><inkscape:path-effect
       effect="powerstroke"
       id="path-effect15335"
       is_visible="true"
       lpeversion="1"
       offset_points="0.34860451,0.13991552 | 0.58686857,0.16676448 | 0.83928461,0.097877602"
       not_jump="false"
       sort_points="true"
       interpolator_type="CentripetalCatmullRom"
       interpolator_beta="0.2"
       start_linecap_type="zerowidth"
       linejoin_type="round"
       miter_limit="4"
       scale_width="1"
       end_linecap_type="zerowidth" /><inkscape:path-effect
       effect="powerstroke"
       id="path-effect15331"
       is_visible="true"
       lpeversion="1"
       offset_points="0.4193633,0.17626986 | 0.96478125,0.1201136 | 1.9033282,0.16819882 | 3.5599335,0.096813707"
       not_jump="false"
       sort_points="true"
       interpolator_type="CentripetalCatmullRom"
       interpolator_beta="0.2"
       start_linecap_type="zerowidth"
       linejoin_type="round"
       miter_limit="4"
       scale_width="1"
       end_linecap_type="zerowidth" /></defs><g
     inkscape:label="Layer 1"
     inkscape:groupmode="layer"
     id="layer1"
     transform="translate(-569.67628,-4.212417)"><g
       id="g27934"
       transform="translate(49.358011,0.47775867)"><path
         style="fill:#000000;fill-opacity:1;stroke:none;stroke-width:0.492623;stroke-linejoin:round;stroke-opacity:1;paint-order:fill markers stroke"
         d="m 524.44121,33.539944 c 0,0 -1.31625,-2.155837 -1.77348,-2.64911 -0.45725,-0.493275 -1.68776,-1.545676 -2.15497,-0.877028 -0.46721,0.66865 -0.0617,1.614852 0.88477,2.382676 0.94646,0.767824 1.79523,1.234766 2.30717,1.294558 0.51192,0.05979 0.73651,-0.151096 0.73651,-0.151096 z"
         id="path15706" /><path
         style="fill:#c7c7c7;fill-opacity:1;stroke-width:0.492623;stroke-linejoin:round;paint-order:fill markers stroke"
         d="m 551.29682,26.276129 c 0,0 -0.27889,-0.341879 4.22337,-1.801685 4.5023,-1.459807 21.53528,-6.459648 26.72715,-7.83697 0.45112,-0.119675 -2.36935,4.114438 -3.52262,6.142714 -1.15328,2.028275 -1.84783,3.470729 -1.84783,3.470729 0,0 1.57181,0.559172 3.26861,0.987023 1.6968,0.427849 11.96941,4.52601 11.70263,4.489108 -0.26679,-0.03691 -11.38119,2.133385 -11.38119,2.133385 0,0 9.4521,7.71393 13.91737,13.812406 4.46526,6.098478 5.43466,7.794801 7.0635,11.168993 -0.95443,0.495092 -3.61012,2.002269 -4.56071,2.163596 -0.95059,0.161328 -1.71005,0.06757 -2.15024,0.35406 -0.44019,0.286486 -0.29981,0.697897 -0.53276,0.813022 -0.23293,0.115126 2.90765,4.883607 3.06276,5.865999 0.15512,0.982394 0.49033,2.635685 0.0465,2.75361 -0.44382,0.117925 -6.15085,1.506595 -8.164,1.600442 -2.01317,0.09385 -5.79006,-0.159393 -6.34307,-0.262294 -0.553,-0.102901 -0.97627,0.678273 -0.97627,0.678273 0,0 1.08209,1.86631 1.01647,2.611178 -0.0657,0.74487 1.00354,1.516376 -3.15241,0.238851 -4.15595,-1.277524 -7.19595,-3.493895 -7.49532,-3.679434 -0.29938,-0.185538 -1.68893,-1.344968 -1.68893,-1.344968 0,0 0.20898,2.287982 0.0976,2.942149 -0.15604,0.869645 -0.25539,2.487656 -0.25539,2.487656 0,0 -1.02387,-0.02721 -1.75495,-0.592681 -0.73109,-0.56548 -2.63457,-2.391986 -2.63457,-2.391986 0,0 0.95798,-3.742446 1.90835,-4.729137 0.95035,-0.98669 4.23883,-4.484982 4.70569,-6.174999 0.46686,-1.690017 1.31692,-2.610065 -0.35933,-6.782173 -1.67624,-4.172108 -4.91995,-9.150176 -5.97669,-10.147276 -1.05673,-0.9971 -9.59124,-7.774881 -10.94839,-8.78427 -1.35713,-1.009389 -7.26577,-4.855851 -7.95061,-5.192478 -0.68481,-0.33663 -2.05173,-0.998328 -2.05173,-0.998328 0,0 2.6909,-1.564477 2.80976,-1.619931 0.11886,-0.05546 -0.33635,0.340336 0.3717,-0.224018 0.70805,-0.564356 2.82544,-2.150566 2.82544,-2.150566 z"
         id="path8578"
         sodipodi:nodetypes="cssscsccccccccccccccccccccccccsscsscc" /><path
         style="fill:#c7c7c7;fill-opacity:0.662745;stroke-width:0.492623;stroke-linejoin:round;paint-order:fill markers stroke"
         d="m 543.24003,11.02572 c 0,0 2.52339,0.923542 3.27173,1.519995 0.74832,0.596453 2.21463,2.182477 2.21463,2.182477 l 1.31746,1.444386 c 0,0 2.45478,9.393517 1.29143,9.899144 -4.67549,5.481508 -14.94954,6.229415 -22.77297,7.726087 -1.1156,0.213424 -4.21186,-0.08623 -4.66557,-0.20283 -0.45373,-0.116599 0.98341,0.24133 2.58217,-1.232893 1.59877,-1.474225 3.38003,-2.05728 4.21874,-5.072759 0.83872,-3.015477 0.57068,-3.758878 0.57068,-3.758878 0,0 0.92346,-4.548948 2.95352,-7.169425 2.03008,-2.620477 3.30785,-5.206687 9.01818,-5.335304 z"
         id="path4496"
         sodipodi:nodetypes="cscccsssscsc" /><path
         style="fill:#505050;fill-opacity:1;stroke-width:0.492623;stroke-linejoin:round;paint-order:fill markers stroke"
         d="m 545.41296,30.337667 -1.08211,0.31217 0.82601,-1.399139 c 0,0 3.78196,-0.753651 6.32219,-3.0233 2.54023,-2.269649 8.90995,-7.758373 8.90995,-7.758373 0,0 -2.66335,-1.819558 -6.0139,-2.493005 -3.35053,-0.673449 -4.91639,-0.423298 -4.91639,-0.423298 l -0.93469,-1.019725 c 0,0 -4.77125,0.663906 -7.74882,5.49838 -2.97758,4.834474 -3.31223,8.28028 -3.31223,8.28028 l 4.03957,6.786974 0.2397,0.339474 c 0,0 -0.44709,2.675032 -2.10398,4.827791 -1.65686,2.152759 -4.0399,4.597588 -4.0399,4.597588 0,0 -0.71411,-2.848719 -0.70605,-3.821237 0.008,-0.972518 -0.50361,-2.588695 -0.7035,-3.016803 -0.19991,-0.428107 -0.42094,-1.151639 -0.81267,0.78011 -0.39169,1.931752 0.11152,3.606548 -0.22716,5.803548 -0.33866,2.196999 0.25235,4.634575 0.41788,4.895313 0.16553,0.260735 0.16048,0.94725 1.6676,0.04804 1.50712,-0.89921 6.73337,-4.377835 7.69492,-5.335942 0.96155,-0.958107 3.04334,-3.56054 3.04334,-3.56054 l 1.7659,2.232558 c 0,0 0.6903,3.37478 0.78032,4.726129 0.0901,1.35135 0.25573,3.960362 0.25573,3.960362 0,0 -2.21478,0.694346 -3.83631,1.638091 -1.62155,0.943746 -3.60077,1.703974 -5.33571,5.948396 -1.73495,4.244424 2.3985,9.853034 2.3985,9.853034 0,0 3.78792,5.111477 5.97401,7.005059 2.18612,1.893584 3.38757,4.01422 3.38757,4.01422 0,0 0.79536,-0.827245 -0.13235,-3.978292 -0.92771,-3.151053 -2.417,-7.315993 -2.42168,-7.772631 -0.005,-0.456637 -1.26152,-5.009612 0.62633,-6.813171 1.88784,-1.803559 3.14018,-1.271602 3.14018,-1.271602 0,0 5.768,1.473025 5.27268,2.843446 -0.49532,1.37042 -1.51416,5.39865 -1.10068,6.52845 0.41349,1.129801 2.32436,5.319795 3.66238,7.245647 1.33802,1.925842 4.50168,8.858517 4.50168,8.858517 0,0 0.80833,0.120407 0.86646,-0.616421 0.0581,-0.736838 -1.01543,-5.812506 -0.74096,-7.090864 0.27444,-1.278369 1.05005,-7.951084 2.68777,-9.514729 1.63774,-1.563645 6.36046,-6.487771 5.35873,-10.052254 -1.00171,-3.56448 -2.84523,-8.381618 -4.97318,-10.832501 -2.6931,-3.101795 -7.34764,-7.282789 -13.39897,-11.457863 -6.05133,-4.175071 -8.14522,-5.427689 -9.29816,-5.771887 z"
         id="path5715"
         sodipodi:nodetypes="cccscsccscccsccssssssccscsscscscscssscssssssc" /><path
         style="fill:#505050;fill-opacity:1;stroke-width:0.492623;stroke-linejoin:round;paint-order:fill markers stroke"
         d="m 544.5518,11.491843 c 0,0 0.4167,-0.957509 0.39256,-3.011273 -0.0239,-2.053765 -0.22093,-4.7062339 -0.22093,-4.7062339 0,0 -6.84901,5.9186179 -8.43536,8.4941589 -1.58635,2.575542 -3.76916,5.804746 -4.76305,9.312851 -0.99389,3.508106 2.65527,-5.514517 4.64387,-7.240818 1.98859,-1.7263 2.88787,-3.060365 8.38291,-2.848685 z"
         id="path5132"
         sodipodi:nodetypes="cccsszc" /><path
         style="fill:#000000;fill-opacity:1;fill-rule:nonzero;stroke:none;stroke-width:0.492623;stroke-linejoin:round;stroke-opacity:1;paint-order:fill markers stroke"
         d="m 544.74233,3.7366182 c -0.009,-0.011321 -0.10571,0.016459 -0.56248,0.3538308 -0.45105,0.3331445 -1.16607,0.9076959 -1.94815,1.6063019 -0.27102,0.2420929 -0.55531,0.5034346 -0.84966,0.7815918 -0.86832,0.8205704 -1.87561,1.8366971 -2.88019,2.9464485 -0.77854,0.8600388 -1.61616,1.8436888 -2.37336,2.8519148 -0.11768,0.156704 -0.2336,0.314429 -0.34718,0.472843 -0.65745,0.917131 -1.31097,1.975202 -1.93501,3.128918 -0.57537,1.063746 -1.11881,2.196616 -1.5961,3.327178 -0.44332,1.050119 -0.8268,2.092468 -1.10762,3.028147 -0.1335,0.444836 -0.24374,0.865553 -0.32461,1.247348 -0.018,0.08495 -0.0345,0.168034 -0.0496,0.249061 -0.0489,0.26364 -0.084,0.516142 -0.0983,0.742836 -0.0323,0.510784 -0.0481,1.062162 -0.0895,1.628057 -0.0379,0.518726 -0.099,1.051246 -0.22785,1.573137 -0.12577,0.509595 -0.31534,1.007081 -0.61023,1.486895 -0.3011,0.489927 -0.70608,0.951645 -1.24705,1.385333 -0.66447,0.531551 -1.28796,1.063469 -1.70034,1.406833 -0.54535,0.454085 -0.90885,0.737656 -1.24504,0.952539 -0.0924,0.05904 -0.17771,0.109533 -0.25761,0.153263 -0.0928,0.0508 -0.1824,0.09488 -0.26995,0.132711 -0.17909,0.07738 -0.347,0.12738 -0.51105,0.155008 -0.18993,0.03199 -0.36937,0.03294 -0.53987,0.01434 -0.24302,-0.02651 -0.4593,-0.09254 -0.60599,-0.146371 0.14005,0.06451 0.35197,0.155238 0.59537,0.209893 0.1717,0.03856 0.3598,0.05973 0.56472,0.04654 0.17755,-0.01143 0.3625,-0.04823 0.55988,-0.117052 0.0963,-0.03357 0.1944,-0.07437 0.29517,-0.122734 0.0867,-0.04163 0.17881,-0.09037 0.27764,-0.147819 0.35593,-0.206881 0.74289,-0.491445 1.29644,-0.934719 0.45913,-0.367659 1.01269,-0.829403 1.71619,-1.380708 0.56957,-0.445624 1.00384,-0.927318 1.33039,-1.445932 0.31984,-0.507954 0.52588,-1.034631 0.66265,-1.569784 0.13965,-0.546444 0.20613,-1.099303 0.24725,-1.626372 0.045,-0.576237 0.0623,-1.127859 0.0946,-1.631689 0.0134,-0.209215 0.0462,-0.447731 0.0933,-0.702986 0.0144,-0.07815 0.0303,-0.158567 0.0475,-0.241073 0.0777,-0.371236 0.18314,-0.783672 0.31149,-1.22309 0.26948,-0.922639 0.6385,-1.960141 1.06697,-3.007308 0.4611,-1.126896 0.98772,-2.258283 1.549,-3.319591 0.6088,-1.151158 1.25018,-2.204976 1.90138,-3.111415 0.11257,-0.156723 0.22769,-0.312727 0.34481,-0.467676 0.75598,-1.000149 1.60203,-1.956826 2.39676,-2.797316 1.01792,-1.0765345 2.05448,-2.0704114 2.91461,-2.8810311 0.29192,-0.2751204 0.57518,-0.5400258 0.83789,-0.7860125 0.71845,-0.6727371 1.46986,-1.3796275 1.82724,-1.7289119 0.40488,-0.3956912 0.45681,-0.4775002 0.44547,-0.4913733 z"
         id="path15329"
         sodipodi:nodetypes="csssc"
         inkscape:path-effect="#path-effect15331"
         inkscape:original-d="m 544.74233,3.7366182 c 0,0 -5.67322,4.6364878 -8.8639,9.0826258 -2.72597,3.798578 -4.90252,9.496066 -5.04047,11.664475 -0.13837,2.174893 0.011,4.379581 -2.25477,6.1736 -2.68155,2.123259 -3.52325,3.257319 -5.21763,2.55746" /><path
         style="fill:#000000;fill-opacity:1;fill-rule:nonzero;stroke:none;stroke-width:0.492623;stroke-linejoin:round;stroke-opacity:1;paint-order:fill markers stroke"
         d="m 544.71762,3.9081064 c -0.014,0.00129 -0.0322,0.054728 -0.0374,0.3746178 -0.005,0.3017775 0.002,0.8217816 0.0124,1.2531245 0.0103,0.4231425 0.0221,0.929443 0.0315,1.370716 0.006,0.2660689 0.0119,0.5705909 0.0164,0.8591254 0.009,0.5453302 0.0138,1.0793007 0.004,1.6118711 -0.006,0.3034847 -0.0156,0.5722035 -0.0293,0.8147978 -0.006,0.10088 -0.0117,0.200775 -0.0187,0.30187 -0.0321,0.462496 -0.0732,0.742631 -0.10917,0.911028 0.066,-0.155206 0.17293,-0.429166 0.2675,-0.889274 0.0206,-0.100265 0.039,-0.201939 0.055,-0.302679 0.0385,-0.2426605 0.0717,-0.5166637 0.0981,-0.8218449 0.0455,-0.5252894 0.0662,-1.0906987 0.0662,-1.6283721 4e-5,-0.3001011 -0.006,-0.589425 -0.0159,-0.8661853 -0.017,-0.4676114 -0.0472,-0.9297242 -0.0861,-1.3766272 -0.0399,-0.4580936 -0.10032,-0.9359892 -0.15508,-1.248324 -0.0554,-0.3159913 -0.0866,-0.3650136 -0.0993,-0.3638441 z"
         id="path15333"
         sodipodi:nodetypes="cc"
         inkscape:path-effect="#path-effect15335"
         inkscape:original-d="m 544.71762,3.9081064 c 0,0 0.50601,5.4839546 -0.13044,7.4971506" /><path
         style="fill:#000000;fill-opacity:1;fill-rule:nonzero;stroke:none;stroke-width:0.492623;stroke-linejoin:round;stroke-opacity:1;paint-order:fill markers stroke"
         d="m 542.59409,10.849879 c -0.003,0.01468 0.25889,0.114215 0.82591,0.334806 0.17138,0.06667 0.37321,0.150015 0.59342,0.248112 0.3754,0.167229 0.83082,0.389169 1.28725,0.656496 0.42131,0.24676 0.85523,0.53896 1.23557,0.873106 5e-5,3.7e-5 0.0176,0.01543 0.0176,0.01547 0.74693,0.656457 1.403,1.2512 1.99656,1.805691 0.49352,0.461044 0.86304,0.824327 0.86989,0.817224 a 0.03666934,0.03074311 61.536961 0 0 0.0544,0.02151 c -0.002,-0.0074 0.43861,-0.05044 1.30918,-0.02798 0.76944,0.01986 1.79069,0.100847 2.76731,0.348982 1.28213,0.322899 2.19021,0.543403 3.25402,0.917491 0.92616,0.325678 1.59187,0.640936 2.13688,0.900266 0.64305,0.30598 1.22061,0.570612 1.42838,0.68551 -0.20078,-0.166946 -0.62941,-0.574007 -1.27806,-0.964818 -0.50787,-0.305994 -1.23472,-0.661519 -2.16314,-0.978827 -1.06721,-0.364745 -2.04713,-0.570744 -3.31214,-0.842336 -1.01414,-0.216216 -2.05809,-0.253764 -2.83258,-0.239999 -0.72708,0.01292 -1.15416,0.06089 -1.2819,0.07299 -0.0654,-0.09642 -0.35874,-0.473694 -0.73898,-0.914842 -0.5095,-0.591117 -1.17618,-1.302739 -1.91376,-1.940533 0,0 -0.0181,-0.0156 -0.0181,-0.0156 -0.41738,-0.35988 -0.8953,-0.646814 -1.34954,-0.871058 -0.4946,-0.244169 -0.98044,-0.423641 -1.37938,-0.55271 -0.23384,-0.07565 -0.44645,-0.136771 -0.6263,-0.185933 -0.70181,-0.19184 -0.88009,-0.173589 -0.88257,-0.163014 z"
         id="path15337"
         sodipodi:nodetypes="cscsc"
         inkscape:path-effect="#path-effect15339"
         inkscape:original-d="m 542.59409,10.849879 c 0,0 2.54094,0.594947 4.08997,1.942618 1.54905,1.34767 2.7842,2.766531 2.7842,2.766531 0,0 2.13732,-0.218528 4.11593,0.242906 2.1758,0.507422 4.31698,0.957473 6.78631,2.644624" /><path
         style="fill:#000000;fill-opacity:1;fill-rule:nonzero;stroke:none;stroke-width:0.492623;stroke-linejoin:round;stroke-opacity:1;paint-order:fill markers stroke"
         d="m 560.46629,18.384555 0,0 c -0.008,-0.0096 -0.093,0.01469 -0.65714,0.474324 -0.36733,0.299293 -0.97635,0.808875 -1.93286,1.618461 -0.6485,0.548881 -1.36022,1.153928 -2.07361,1.760782 1.4346,-1.220364 -3.06885,2.609511 -1.63425,1.389146 -0.53782,0.455697 -0.87885,0.74869 -1.41668,1.204387 -0.60545,0.512208 -1.17507,0.98732 -1.74782,1.453565 0,2e-6 -0.011,0.0089 -0.011,0.0089 -0.62766,0.510792 -1.24461,0.999707 -1.8305,1.439575 -0.6214,0.466521 -1.19628,0.869135 -1.70377,1.180965 -0.78843,0.484251 -1.45835,0.872885 -1.97264,1.158441 -1.00268,0.556734 -1.46121,0.797766 -1.45548,0.810877 0.003,0.0072 0.30114,-0.05216 1.53505,-0.658708 0.53108,-0.26106 1.22249,-0.613196 2.03523,-1.068304 0.53133,-0.297655 1.12829,-0.688181 1.76557,-1.145326 0.60059,-0.430826 1.23025,-0.916006 1.8621,-1.427216 0,0 0.0111,-0.009 0.0111,-0.009 0.56793,-0.459741 1.156,-0.954722 1.74894,-1.466891 0.52637,-0.454677 1.00203,-0.875717 1.39895,-1.229205 0.38854,-0.346025 0.96713,-0.858066 1.60498,-1.422573 0.7044,-0.623398 1.39779,-1.237121 2.03584,-1.804259 0.93731,-0.833146 1.52653,-1.36268 1.87547,-1.684614 0.53481,-0.493427 0.57086,-0.573802 0.56253,-0.583409 z"
         id="path15341"
         inkscape:path-effect="#path-effect15343"
         inkscape:original-d="m 560.46629,18.384555 c 0,0 -4.64123,4.024816 -6.18834,5.368784 -1.54711,1.343968 -4.62001,4.033924 -6.74819,5.282513 -2.12819,1.248587 -3.4992,1.848165 -3.4992,1.848165"
         sodipodi:nodetypes="cssc" /><path
         style="fill:#0e0e0e;fill-opacity:1;stroke:none;stroke-width:0.492623;stroke-linejoin:round;stroke-opacity:1;paint-order:fill markers stroke"
         d="m 526.48296,11.551127 c 0,0 0.26919,4.967183 2.21801,8.775446 1.99358,3.895736 4.26364,4.30695 10.25789,2.772676 2.27355,-0.581932 8.05202,-5.106136 8.05202,-5.106136 0,0 0.10403,7.603569 -1.76512,11.399097 -1.86913,3.795526 -3.55068,5.744024 -4.62638,5.873259 -1.0757,0.129235 -6.84943,-4.797349 -7.72623,-5.654764 -0.87682,-0.857412 -2.29499,-2.138336 -2.29499,-2.138336 0,0 0.0831,2.078805 -4.03984,2.374801 -0.74191,-0.850915 -1.57319,-6.16763 -1.34202,-10.2983 0.18098,-3.233793 0.44172,-7.066785 1.26666,-7.997743 z"
         id="path15345"
         sodipodi:nodetypes="csscsssccsc" /><path
         style="fill:#ffffff;fill-opacity:1;stroke:none;stroke-width:0.492623;stroke-linejoin:round;stroke-opacity:1;paint-order:fill markers stroke"
         d="m 528.41245,21.574133 1.61392,1.959383 c 0,0 0.0421,1.658032 -0.5993,3.127276 -0.64154,1.469243 -1.40807,2.277022 -1.40807,2.277022 l -1.29673,0.173298 c 0,0 -0.69686,-1.968396 -0.60894,-2.213342 0.14718,-0.410073 0.77079,-1.041134 2.29912,-5.323637 z"
         id="path15401"
         sodipodi:nodetypes="ccsccsc" /><path
         style="fill:#ffffff;fill-opacity:1;stroke:none;stroke-width:0.492623;stroke-linejoin:round;stroke-opacity:1;paint-order:fill markers stroke"
         d="m 539.16095,23.658737 c 0,0 1.92177,-0.629629 2.47198,-0.957841 0.55022,-0.32821 1.73635,-1.658411 1.36558,-0.08109 -0.37074,1.577313 -1.39527,5.140092 -1.93565,6.805868 -0.55769,1.719112 -2.04828,4.356336 -2.04828,4.356336 0,0 -0.75544,-0.478274 -1.31217,-0.968188 -0.99841,-0.878588 -1.18952,-1.083496 -1.18952,-1.083496 0,0 0.77306,-2.523381 1.33176,-3.995315 0.55872,-1.471939 1.28539,-3.261358 1.3163,-4.076266 z"
         id="path15700"
         sodipodi:nodetypes="cssscscssc" /><path
         style="fill:#000000;fill-opacity:1;fill-rule:nonzero;stroke:none;stroke-width:0.492623;stroke-linejoin:round;stroke-opacity:1;paint-order:fill markers stroke"
         d="m 536.72396,32.398769 c -0.0109,-0.04058 -0.18549,-0.08505 -0.90183,0.02934 -0.72119,0.115163 -2.05504,0.379133 -3.55086,0.611876 -1.31652,0.204846 -2.72569,0.3948 -4.18896,0.496143 -0.25767,0.01785 -0.50962,0.0324 -0.75601,0.04371 -1.62673,0.07469 -2.78509,0.02272 -3.63974,-0.07598 0.81306,0.163454 2.02732,0.350273 3.64459,0.370781 0.24914,0.0032 0.50428,0.0029 0.76527,-9.12e-4 1.4609,-0.02146 2.93752,-0.153946 4.24853,-0.346659 1.55652,-0.2288 2.85031,-0.523491 3.56025,-0.737972 0.70159,-0.211958 0.8279,-0.356238 0.81876,-0.390327 z"
         id="path15702"
         inkscape:path-effect="#path-effect15704"
         inkscape:original-d="m 536.72396,32.398769 c 0,0 -7.42979,1.990992 -13.0374,1.105089"
         sodipodi:nodetypes="cc" /><path
         style="fill:#ae2020;fill-opacity:1;stroke-width:0.492623;stroke-linejoin:round;paint-order:fill markers stroke"
         d="m 568.47228,48.126677 c 0,0 2.13088,3.536941 2.41054,4.083953 0.27969,0.547015 1.1409,2.645544 1.1409,2.645544 0,0 -1.91478,0.442673 -3.6513,0.189825 -1.73652,-0.252845 -8.30007,-1.947517 -8.30007,-1.947517 0,0 0.6022,-0.667199 0.44954,-2.261763 -0.15266,-1.594564 -0.76157,-2.886286 -0.76157,-2.886286 0,0 8.05524,0.734377 8.71196,0.176244 z"
         id="path9748" /><path
         style="fill:#000000;fill-opacity:1;fill-rule:nonzero;stroke:none;stroke-width:0.492623;stroke-linejoin:round;stroke-opacity:1;paint-order:fill markers stroke"
         d="m 545.20448,30.303736 c -0.005,0.01855 -0.007,-0.06101 1.91494,1.000557 0.44866,0.247769 1.10377,0.621225 1.97449,1.159568 2.2211,1.373234 6.8567,4.434673 15.0406,11.116173 1.36136,1.111301 2.62238,2.505196 3.75521,4.054312 1.111,1.519262 2.06617,3.143494 2.84115,4.702203 0.79555,1.600076 1.3861,3.09986 1.76863,4.333919 0.20142,0.649795 0.34451,1.22326 0.43363,1.707494 0.0464,0.251947 0.078,0.47883 0.096,0.680062 0.0186,0.208429 0.0224,0.387633 0.0134,0.538282 -0.0198,0.336042 -0.0693,0.660683 -0.13815,0.96965 -0.0934,0.418716 -0.22756,0.833041 -0.3932,1.239957 -0.30462,0.748357 -0.71665,1.474324 -1.18017,2.1599 -1.00372,1.484557 -2.29026,2.838324 -3.36336,3.881648 -0.26006,0.252092 -0.49365,0.565667 -0.70228,0.908315 -0.0772,0.126713 -0.15135,0.258155 -0.22264,0.392985 -0.13642,0.258032 -0.26061,0.525308 -0.37278,0.789721 -0.38475,0.906922 -0.68751,1.920155 -0.91942,2.834368 -0.21857,0.861637 -0.41351,1.79124 -0.57982,2.731293 -0.008,0.04267 -0.015,0.08519 -0.0224,0.127555 -0.0746,0.4281 -0.13973,0.836267 -0.19483,1.211134 -0.0525,0.35744 -0.095,0.678263 -0.1264,0.945255 -0.0473,0.39295 -0.0676,0.847794 -0.0591,1.370089 0.008,0.497128 0.0421,1.050968 0.1022,1.663325 0.0417,0.425735 0.0958,0.877484 0.16186,1.354818 0.10575,0.764504 0.25171,1.659629 0.44504,2.739014 0.0305,0.09873 0.0456,0.174345 0.0504,0.232185 0.002,0.02933 0.002,0.05652 -7.6e-4,0.08266 -0.003,0.02709 -0.01,0.05355 -0.0204,0.08068 -0.0238,0.06054 -0.0653,0.117117 -0.11353,0.171954 -0.0527,0.05994 -0.15007,0.155372 -0.17884,0.183585 0.0563,-0.02416 0.14354,-0.0526 0.2426,-0.09021 0.0676,-0.02566 0.15094,-0.06076 0.22479,-0.117779 0.0349,-0.02691 0.0689,-0.05953 0.0997,-0.09984 0.0302,-0.03945 0.0563,-0.08502 0.0771,-0.137473 0.042,-0.106099 0.0583,-0.231294 0.0505,-0.374397 -0.15288,-1.098787 -0.26234,-1.961606 -0.35175,-2.736948 -0.0547,-0.474596 -0.10213,-0.920672 -0.14077,-1.340163 -0.0556,-0.603567 -0.0922,-1.142891 -0.10677,-1.623958 -0.0153,-0.505532 -0.006,-0.936618 0.0286,-1.302322 0.0256,-0.260915 0.0627,-0.577272 0.11073,-0.930371 0.0504,-0.370048 0.11201,-0.774437 0.18459,-1.197395 0.007,-0.04189 0.0145,-0.08392 0.0219,-0.126098 0.16309,-0.930532 0.35887,-1.845622 0.57737,-2.693365 0.23175,-0.899156 0.53183,-1.888699 0.89844,-2.763168 0.10682,-0.254802 0.22362,-0.510154 0.35016,-0.754852 0.0661,-0.127785 0.1342,-0.251488 0.20433,-0.370009 0.19072,-0.322299 0.39541,-0.604566 0.61355,-0.82596 1.06433,-1.072823 2.34077,-2.479763 3.33385,-4.016845 0.45902,-0.710475 0.86833,-1.464874 1.17032,-2.243339 0.1643,-0.423504 0.29748,-0.855776 0.38949,-1.293568 0.0679,-0.323038 0.11654,-0.663289 0.13486,-1.016248 0.009,-0.167901 0.003,-0.361381 -0.0176,-0.579774 -0.0198,-0.21122 -0.0535,-0.446638 -0.10174,-0.705307 -0.0927,-0.496946 -0.23932,-1.081011 -0.44346,-1.738786 -0.38763,-1.248989 -0.98474,-2.766582 -1.78322,-4.376125 -0.77961,-1.571499 -1.74107,-3.21084 -2.86145,-4.745982 -1.14213,-1.564942 -2.41843,-2.979296 -3.8028,-4.109836 -8.20072,-6.696252 -12.83222,-9.746592 -15.08641,-11.11579 -0.88273,-0.536173 -1.54065,-0.898508 -2.00286,-1.138728 -1.96448,-1.020975 -2.01873,-0.816577 -2.02346,-0.798023 z"
         id="path15816"
         sodipodi:nodetypes="csssssc"
         inkscape:path-effect="#path-effect15818"
         inkscape:original-d="m 545.20448,30.303736 c 0,0 4.21388,1.074361 19.02138,13.164421 5.59151,4.565372 9.10294,13.539055 8.9591,16.13604 -0.16729,3.020595 -2.6904,6.072761 -5.0517,8.410577 -1.8668,1.848234 -2.82773,7.737298 -3.0508,9.800922 -0.16894,1.562858 0.12719,4.028296 0.61035,7.065316 0.0786,0.494142 -0.18297,0.587061 -0.47888,0.785391" /><path
         style="fill:#c7c7c7;fill-opacity:1;stroke-width:0.492623;stroke-linejoin:round;paint-order:fill markers stroke"
         d="m 547.49934,42.476091 c 0,0 0.90396,3.170177 1.04507,5.479594 0.1411,2.309411 0.28789,8.344458 -0.24002,9.683154 -0.52793,1.338696 0.24299,1.097019 0.6326,1.051717 0.38964,-0.0453 3.22267,-0.07126 4.2102,0.240758 0.98753,0.312013 -0.66315,0.535698 -1.63738,1.100577 -0.97427,0.564877 -1.16728,0.184453 -0.28362,2.00438 0.88365,1.819929 3.10249,5.765633 3.24815,5.798542 0.14569,0.03291 0.87967,-0.636291 1.3114,-2.326145 0.43172,-1.689853 0.50252,-2.819548 0.61607,-2.801174 0.11353,0.01837 0.89526,1.649235 0.89526,1.649235 0,0 1.14887,-2.635535 1.5833,-3.669607 0.43444,-1.03407 1.25726,-1.587969 -0.085,-5.372153 -1.40207,-4.209745 -1.03769,-0.05237 -5.87076,-6.846557 -1.41482,-0.73992 -3.44805,-3.043037 -4.11515,-4.212248 -0.66712,-1.169212 -1.31011,-1.780073 -1.31011,-1.780073 z"
         id="path6299"
         sodipodi:nodetypes="cssssssssscsccscc" /><path
         style="fill:#000000;fill-opacity:1;fill-rule:nonzero;stroke:none;stroke-width:0.492623;stroke-linejoin:round;stroke-opacity:1;paint-order:fill markers stroke"
         d="m 557.92933,53.329427 c -0.0235,0.01084 -0.0347,0.123067 0.18368,0.716471 0.003,0.0087 0.006,0.0175 0.01,0.02643 0.12953,0.34962 0.35914,0.916445 0.61422,1.631531 0.20789,0.582814 0.42641,1.253682 0.56028,1.858291 0.0643,0.290248 0.10774,0.559508 0.12262,0.794222 0.007,0.117528 0.008,0.224418 1.5e-4,0.319686 -0.008,0.09662 -0.0227,0.178768 -0.0445,0.246694 -0.0681,0.216426 -0.16147,0.464182 -0.26947,0.728264 -0.009,0.0217 -0.0178,0.0435 -0.0269,0.0654 -0.10497,0.253698 -0.226,0.529544 -0.35838,0.824992 -0.2825,0.630484 -0.62215,1.361826 -0.94685,2.117492 -0.32578,0.758181 -0.643,1.555283 -0.89147,2.343528 -0.25042,0.794441 -0.43213,1.583318 -0.48197,2.318312 -0.01,0.139655 -0.0178,0.276832 -0.0233,0.412536 -0.0167,0.414714 -0.009,0.815666 0.0387,1.22838 0.0642,0.556099 0.19937,1.122287 0.43526,1.764169 0.23608,0.64241 0.57359,1.362191 1.04312,2.226922 0.33844,0.623318 0.74794,1.326462 1.2419,2.135852 0.18519,0.303462 0.38591,0.629003 0.60572,0.980985 1.53624,2.460145 2.76552,4.99557 3.61746,6.869432 0.64562,1.420035 0.94312,2.152486 1.1775,2.570016 0.2697,0.480443 0.44641,0.471226 0.49388,0.452327 0.0439,-0.01746 0.18214,-0.156234 0.0278,-0.673043 -0.12719,-0.425811 -0.48624,-1.259615 -1.15165,-2.608735 -0.92515,-1.875728 -2.25586,-4.342784 -3.83011,-6.820903 -0.22126,-0.348292 -0.42192,-0.672023 -0.60406,-0.974183 -0.48659,-0.807228 -0.87634,-1.510839 -1.18823,-2.135136 -0.43321,-0.867157 -0.71554,-1.580002 -0.89693,-2.200816 -0.18013,-0.616519 -0.26122,-1.143817 -0.29204,-1.647722 -0.023,-0.376121 -0.0184,-0.74501 -0.004,-1.139841 0.005,-0.129542 0.0108,-0.261477 0.0174,-0.397856 0.0338,-0.664434 0.17123,-1.40434 0.37708,-2.185827 0.20353,-0.772714 0.46866,-1.566257 0.74912,-2.335181 0.28003,-0.767761 0.57416,-1.507552 0.82821,-2.156961 0.11839,-0.302621 0.2282,-0.585881 0.32548,-0.846988 0.008,-0.02255 0.0167,-0.04501 0.025,-0.06736 0.10016,-0.271098 0.19035,-0.529639 0.25726,-0.758359 0.0279,-0.09576 0.0443,-0.201648 0.0516,-0.314932 0.007,-0.112113 0.006,-0.233142 -0.003,-0.361062 -0.0176,-0.255045 -0.0645,-0.539718 -0.13068,-0.838899 -0.13783,-0.622939 -0.35972,-1.307888 -0.57318,-1.894226 -0.26076,-0.716226 -0.51503,-1.305159 -0.66933,-1.62607 -0.004,-0.0087 -0.008,-0.01717 -0.0123,-0.02555 -0.27815,-0.573041 -0.3877,-0.630241 -0.40493,-0.622285 z"
         id="path16123"
         sodipodi:nodetypes="csssc"
         inkscape:path-effect="#path-effect16125"
         inkscape:original-d="m 557.92933,53.329427 c 0,0 1.9943,4.318398 1.59411,5.638177 -0.527,1.737926 -2.60019,5.558395 -2.76859,8.374335 -0.13249,2.215223 0.053,3.698051 3.15448,8.622201 3.10153,4.924141 5.12142,9.997227 5.12142,9.997227" /><path
         style="fill:#ae2020;fill-opacity:1;stroke-width:0.492623;stroke-linejoin:round;paint-order:fill markers stroke"
         d="m 543.82143,37.808584 c 0,0 4.4661,4.446661 4.73801,4.867711 0.27774,0.43008 2.3707,3.258502 2.86287,3.758341 0.0988,0.100371 1.48495,1.392514 1.20373,1.584269 -1.41882,-0.04997 -2.5027,-2.152478 -3.9326,-3.987492 -1.42994,-1.835013 -4.87201,-6.222829 -4.87201,-6.222829 z"
         id="path10233"
         sodipodi:nodetypes="csccsc" /><path
         style="fill:#000000;fill-opacity:1;fill-rule:nonzero;stroke:none;stroke-width:0.492623;stroke-linejoin:round;stroke-opacity:1;paint-order:fill markers stroke"
         d="m 547.06653,31.113575 c -0.0102,0.01273 0.0526,0.07554 1.47027,1.401015 0.26017,0.24324 0.62283,0.585435 1.04222,0.995194 1.02633,1.002754 3.20302,3.192014 5.20499,5.920225 1.63564,2.228928 2.87272,4.246332 3.75939,6.048294 0.78375,1.592797 1.22302,2.873673 1.46652,3.869267 0.11404,0.466337 0.19006,0.924147 0.23532,1.352412 0.0446,0.421793 0.0588,0.809761 0.0511,1.141209 -0.004,0.164705 -0.0129,0.314349 -0.0262,0.446189 -0.0133,0.13212 -0.0305,0.244655 -0.05,0.335505 -0.01,0.04541 -0.0198,0.08441 -0.0299,0.117052 -0.0102,0.03295 -0.0198,0.05755 -0.0279,0.07458 -0.008,0.01656 -0.0145,0.02384 -0.011,0.01875 0.002,-0.0022 0.006,-0.0085 0.0161,-0.01628 0.01,-0.0078 0.0255,-0.01818 0.0476,-0.02565 -0.0134,0.0038 -0.0318,0.0092 -0.0603,0.01714 -0.0276,0.0077 -0.0621,0.01705 -0.10285,0.02753 -0.0823,0.02117 -0.18847,0.04654 -0.31332,0.07183 -0.25709,0.05207 -0.58129,0.101377 -0.93222,0.116289 -0.36619,0.01556 -0.74398,-0.0071 -1.10018,-0.09234 -0.18442,-0.04414 -0.36001,-0.104331 -0.52394,-0.182616 -0.16945,-0.08093 -0.32532,-0.180651 -0.46564,-0.301007 -0.0805,-0.06905 -0.18101,-0.164886 -0.29878,-0.284684 -0.11988,-0.121951 -0.25532,-0.266308 -0.40272,-0.428388 -0.306,-0.336492 -0.66156,-0.74716 -1.03707,-1.19243 -0.82645,-0.979977 -1.75516,-2.133935 -2.55238,-3.144204 -0.91422,-1.158521 -1.75089,-2.247596 -2.36957,-3.074354 -0.33255,-0.444395 -0.60613,-0.818248 -0.80914,-1.105322 -0.10482,-0.148222 -0.19005,-0.272219 -0.25507,-0.370912 -0.033,-0.05008 -0.0602,-0.09272 -0.0818,-0.1282 -0.0224,-0.0367 -0.0367,-0.06211 -0.0456,-0.07934 -0.14424,-0.289087 -0.31138,-0.652587 -0.47466,-1.022537 -0.1723,-0.390365 -0.34547,-0.799503 -0.49814,-1.173188 -0.15591,-0.381605 -0.29389,-0.734627 -0.39368,-1.008984 -0.0496,-0.136431 -0.0893,-0.252129 -0.11702,-0.341561 -0.0137,-0.04434 -0.0238,-0.07992 -0.0307,-0.107657 -0.003,-0.01384 -0.006,-0.02382 -0.007,-0.03165 -0.002,-0.0075 -0.002,-0.01076 -0.002,-0.0079 -4.4e-4,-0.01385 -0.002,-0.02793 -0.003,-0.0411 -0.001,-0.01323 -0.003,-0.02711 -0.005,-0.04084 -0.004,-0.031 -0.007,-0.05567 -0.011,-0.08666 -0.003,-0.02766 -0.007,-0.05599 -0.009,-0.08426 -0.003,-0.03222 -0.004,-0.06321 -0.004,-0.09185 3.3e-4,-0.02671 0.002,-0.04931 0.005,-0.06765 0.003,-0.01861 0.007,-0.0287 0.009,-0.03319 9e-4,-0.0019 0.001,-0.0018 -1.4e-4,-5.49e-4 -0.001,0.0014 -0.003,0.0036 -0.007,0.0058 -0.006,0.0042 -0.0146,0.0051 -0.0104,0.005 0.005,-1.62e-4 0.0197,5.4e-4 0.0484,0.01028 0.0284,0.0096 0.0661,0.02671 0.1147,0.05519 0.0973,0.05701 0.2274,0.153209 0.39868,0.304993 0.17019,0.150822 0.37739,0.35324 0.62906,0.619917 0.25186,0.266892 0.5468,0.596596 0.89176,1.000642 0.59674,0.699193 1.0515,1.208296 1.41698,1.594072 0.37464,0.395451 0.65645,0.662268 0.89668,0.866384 0.24983,0.212262 0.45856,0.359614 0.66248,0.497592 0.17796,0.120418 0.32512,0.215872 0.52267,0.353995 0.0569,0.03981 0.11701,0.08246 0.18062,0.128637 0.12978,0.09396 0.28026,0.225727 0.4469,0.391219 0.16391,0.162771 0.33956,0.354287 0.52101,0.566507 0.3716,0.434631 0.75293,0.93889 1.09372,1.433386 0.38155,0.553649 0.69023,1.062196 0.90841,1.474204 0.13076,0.246914 0.22551,0.452188 0.29175,0.620038 0.0395,0.09998 0.0683,0.18538 0.0891,0.258381 0.0257,0.09047 0.0388,0.161044 0.0447,0.216381 -6e-4,-0.05567 -0.007,-0.127667 -0.0253,-0.221023 -0.0147,-0.07532 -0.037,-0.16372 -0.0694,-0.267519 -0.0546,-0.174402 -0.13663,-0.387398 -0.25433,-0.643982 -0.19668,-0.428781 -0.48197,-0.954311 -0.84287,-1.529847 -0.32167,-0.513 -0.68661,-1.03815 -1.04673,-1.495111 -0.17581,-0.223085 -0.34833,-0.427165 -0.51154,-0.603074 -0.16514,-0.178001 -0.32107,-0.327548 -0.46257,-0.439867 -0.0631,-0.05023 -0.12283,-0.09663 -0.17953,-0.139882 -0.19037,-0.14523 -0.34983,-0.257464 -0.51594,-0.376352 -0.19647,-0.140607 -0.39288,-0.283865 -0.62872,-0.486381 -0.22777,-0.19558 -0.50086,-0.45346 -0.87028,-0.841755 -0.36075,-0.379181 -0.81283,-0.882087 -1.4091,-1.577285 -0.34853,-0.406495 -0.64819,-0.739823 -0.90567,-1.011019 -0.257,-0.27068 -0.47235,-0.479869 -0.65291,-0.638564 -0.18028,-0.158457 -0.32911,-0.269461 -0.45282,-0.341125 -0.0623,-0.03611 -0.12095,-0.06379 -0.17619,-0.08224 -0.0552,-0.01844 -0.11129,-0.02907 -0.16671,-0.02687 -0.0574,0.0023 -0.11228,0.01835 -0.16042,0.0505 -0.0236,0.01573 -0.0437,0.03415 -0.0608,0.05404 -0.017,0.01986 -0.0307,0.04082 -0.0418,0.0618 -0.0219,0.04149 -0.0347,0.08505 -0.0425,0.124905 -0.008,0.04055 -0.0116,0.08169 -0.0131,0.120326 -0.002,0.04193 -6.3e-4,0.08373 0.001,0.122393 0.002,0.0341 0.004,0.06715 0.006,0.09666 0.003,0.03312 0.005,0.06095 0.006,0.08533 7.3e-4,0.01204 0.001,0.02242 0.001,0.03105 1.3e-4,0.0087 -9e-5,0.01507 -5.6e-4,0.01846 -4.3e-4,0.01989 0.001,0.0395 0.003,0.0568 0.002,0.018 0.005,0.03692 0.009,0.05626 0.007,0.03893 0.0176,0.08378 0.0304,0.133021 0.026,0.09981 0.0636,0.224277 0.10958,0.365336 0.0927,0.284586 0.22256,0.647242 0.36942,1.035886 0.14422,0.381667 0.30837,0.797774 0.47331,1.196796 0.156,0.377385 0.31741,0.750768 0.45942,1.052967 0.0163,0.0346 0.0376,0.07381 0.0623,0.116232 0.0248,0.04258 0.0547,0.09102 0.0891,0.144889 0.0678,0.106116 0.1553,0.236084 0.26069,0.387733 0.20436,0.294047 0.47883,0.673421 0.81115,1.121132 0.62278,0.839042 1.45472,1.926219 2.37164,3.089583 0.79858,1.013224 1.73047,2.171394 2.5624,3.157041 0.37744,0.447187 0.73799,0.863141 1.05016,1.205658 0.15039,0.165009 0.29062,0.314144 0.41657,0.441819 0.12267,0.124352 0.23439,0.230998 0.33027,0.312698 0.17585,0.149819 0.36899,0.271793 0.57489,0.369021 0.19883,0.0939 0.40766,0.163824 0.62153,0.21383 0.41142,0.0962 0.83616,0.117421 1.23378,0.09764 0.38184,-0.019 0.7315,-0.07548 1.00608,-0.13458 0.13382,-0.0288 0.24821,-0.05789 0.33758,-0.08278 0.0443,-0.01233 0.0823,-0.0236 0.11331,-0.03324 0.0309,-0.0096 0.0547,-0.01754 0.0716,-0.02353 0.0367,-0.01219 0.0668,-0.03047 0.0908,-0.04936 0.0237,-0.01874 0.0429,-0.0393 0.0582,-0.0587 0.0299,-0.03789 0.0523,-0.08029 0.0695,-0.120132 0.0177,-0.04077 0.0329,-0.08567 0.0461,-0.132812 0.0133,-0.04736 0.0253,-0.09917 0.036,-0.154634 0.0213,-0.110578 0.0383,-0.239746 0.0504,-0.383833 0.0121,-0.144371 0.0195,-0.305241 0.021,-0.479601 0.003,-0.350681 -0.0171,-0.756469 -0.0689,-1.194515 -0.0526,-0.444997 -0.13729,-0.919941 -0.26176,-1.403474 -0.26346,-1.023314 -0.72533,-2.325074 -1.5326,-3.932039 -0.91271,-1.816858 -2.17568,-3.842151 -3.83484,-6.070533 -2.04471,-2.746278 -4.23743,-4.903836 -5.29457,-5.901587 -0.43185,-0.407596 -0.7963,-0.736235 -1.06827,-0.975967 -1.4617,-1.288473 -1.59147,-1.269041 -1.60163,-1.256313 z"
         id="path16127"
         sodipodi:nodetypes="cssssssssc"
         inkscape:path-effect="#path-effect16129"
         inkscape:original-d="m 547.06653,31.113575 c 0,0 4.2962,3.429601 7.84098,8.225152 3.54482,4.795551 4.81525,8.042858 5.29667,9.960066 0.48142,1.917212 0.31406,3.634793 0.0819,3.710417 -0.23214,0.07562 -2.44144,0.725199 -3.72865,-0.374764 -1.3967,-1.193513 -7.5027,-9.064947 -7.90322,-9.892306 -0.55565,-1.147824 -1.4888,-3.514407 -1.4888,-3.795263 0,-0.280858 -0.42459,-1.801924 2.35343,1.444997 2.36672,2.766211 2.5435,2.596061 3.6415,3.431166 1.09795,0.835108 3.24397,4.043692 3.30413,5.080271" /><path
         style="fill:#000000;fill-opacity:1;fill-rule:nonzero;stroke:none;stroke-width:0.492623;stroke-linejoin:round;stroke-opacity:1;paint-order:fill markers stroke"
         d="m 546.78299,35.983081 c -0.0214,0.0165 0.15999,0.325275 0.82977,1.26721 0.01,0.01355 0.20867,0.293761 0.21831,0.307312 0.0263,0.03702 0.89616,1.263765 0.92244,1.300781 0.64228,0.906399 0.13579,0.191742 0.77808,1.09814 0.0523,0.07361 0.10702,0.148902 0.16345,0.224784 0.16992,0.228525 0.36592,0.474222 0.56968,0.72032 0.2816,0.340103 0.56988,0.67129 0.82927,0.965777 0.12681,0.14396 0.23496,0.265809 0.36177,0.40977 0.12169,0.138219 0.23847,0.269026 0.34507,0.384505 0.10376,0.112414 0.18711,0.198607 0.25293,0.2621 0.0381,0.03677 0.0683,0.06397 0.0925,0.0841 0.0145,0.01206 0.0265,0.02136 0.0365,0.02859 0.0129,0.0093 0.0224,0.01508 0.0294,0.01874 -0.005,-0.006 -0.012,-0.0145 -0.0219,-0.0267 -0.008,-0.0095 -0.017,-0.02117 -0.0285,-0.03574 -0.0192,-0.02424 -0.044,-0.05611 -0.0759,-0.09766 -0.0546,-0.0711 -0.12768,-0.167694 -0.21798,-0.28905 -0.0926,-0.124427 -0.19763,-0.267323 -0.30451,-0.414897 -0.0964,-0.133132 -0.20187,-0.283296 -0.31395,-0.445304 -0.22115,-0.319665 -0.46933,-0.687109 -0.71531,-1.047129 -0.17863,-0.261439 -0.35732,-0.520752 -0.52015,-0.749481 -0.0543,-0.07626 -0.10806,-0.151145 -0.1602,-0.223387 -0.20279,-0.281019 -0.49708,-0.661978 -0.82368,-1.074669 -0.33518,-0.423527 -0.68898,-0.861046 -1.00101,-1.24421 -0.0157,-0.0193 -0.22274,-0.273008 -0.23845,-0.29231 -0.73159,-0.8956 -0.98765,-1.146961 -1.0076,-1.131592 z"
         id="path16131"
         inkscape:path-effect="#path-effect16133"
         inkscape:original-d="m 546.78299,35.983081 c 0,0 2.08894,2.711861 2.90967,3.858113 0.82075,1.146253 2.28351,3.023576 2.51948,3.214016"
         sodipodi:nodetypes="csc" /><path
         style="fill:#000000;fill-rule:nonzero;stroke:none;stroke-width:0.492623;stroke-linejoin:round;paint-order:fill markers stroke"
         d="m 541.22192,34.842466 c -0.0161,0.01331 0.0973,0.229212 0.89415,1.245817 0.47914,0.611267 1.17892,1.488073 2.08917,2.61946 0.75205,0.934753 1.57581,1.953766 2.23378,2.766516 0.0221,0.02727 0.80542,0.993963 0.8275,1.021231 -0.006,-0.0074 0.28867,0.35545 0.28265,0.348029 -5.2e-4,-6.35e-4 0.0706,0.08673 0.0701,0.0861 0.0424,0.05204 0.0775,0.09491 0.10245,0.125284 0.0375,0.04561 0.0825,0.103664 0.13607,0.17518 0.0522,0.06975 0.11092,0.150064 0.17669,0.241138 0.12542,0.173668 0.33035,0.461808 0.45577,0.635477 0.36571,0.507858 0.77836,1.066321 1.23165,1.617761 0.41247,0.501773 0.79823,0.923877 1.16358,1.275992 0.11337,0.109265 0.22821,0.214512 0.34393,0.314612 0.28289,0.244691 0.55156,0.441806 0.80469,0.595309 0.36112,0.218983 0.63243,0.313573 0.79954,0.361708 -0.16223,-0.0646 -0.41745,-0.188272 -0.75054,-0.43478 -0.2338,-0.173023 -0.47942,-0.386514 -0.74031,-0.644809 -0.1067,-0.105637 -0.21271,-0.215549 -0.31805,-0.328875 -0.33917,-0.364889 -0.69739,-0.799454 -1.08067,-1.313238 -0.4225,-0.56636 -0.80442,-1.133052 -1.14863,-1.654238 -0.16251,-0.246061 -0.30744,-0.467912 -0.43181,-0.653746 -0.0631,-0.09432 -0.12081,-0.179161 -0.17302,-0.253516 -0.0533,-0.07586 -0.10125,-0.141414 -0.14389,-0.1954 -0.0254,-0.03227 -0.0602,-0.07551 -0.10303,-0.128128 -0.0213,-0.02615 -0.0448,-0.05497 -0.0706,-0.0864 -0.0763,-0.09304 -0.17228,-0.209169 -0.28616,-0.346361 -0.22086,-0.266088 -0.50961,-0.611988 -0.84269,-1.009639 -0.67296,-0.803432 -1.51408,-1.802835 -2.29063,-2.720152 -0.9351,-1.104609 -1.67033,-1.9649 -2.1769,-2.547168 -0.84784,-0.974533 -1.03872,-1.126401 -1.05475,-1.113157 z"
         id="path742"
         sodipodi:nodetypes="csc"
         inkscape:path-effect="#path-effect1298"
         inkscape:original-d="m 541.22192,34.842466 c 0,0 6.06586,7.340228 6.6623,8.081721 0.6489,0.806719 2.898,4.645928 4.94942,5.34789" /><path
         style="fill:#000000;fill-rule:nonzero;stroke:none;stroke-width:0.492623;stroke-linejoin:round;paint-order:fill markers stroke"
         d="m 541.27168,34.8233 c -0.005,0.0048 0.0304,0.06956 0.30119,0.393564 0.37086,0.44379 1.2719,1.487856 2.35141,2.685832 0.11127,0.123474 0.22408,0.248457 0.33803,0.374388 0.83589,0.923744 1.69059,1.851424 2.42402,2.593948 0.0392,0.03967 0.0779,0.07874 0.11629,0.117201 0.31998,0.320936 0.64972,0.635447 0.93974,0.896029 0.16916,0.151988 0.31365,0.275691 0.43627,0.375879 0.17284,0.141213 0.28424,0.220984 0.35157,0.268154 -0.0603,-0.05458 -0.16038,-0.150076 -0.31597,-0.307311 -0.1114,-0.112572 -0.24209,-0.247474 -0.39893,-0.41188 -0.29865,-0.313047 -0.54761,-0.58042 -0.88808,-0.94166 -0.0168,-0.01787 -0.0961,-0.101983 -0.11297,-0.11985 -0.75047,-0.796188 -1.54096,-1.636244 -2.42272,-2.588775 -0.11527,-0.124532 -0.22945,-0.248128 -0.34202,-0.370253 -1.10953,-1.203778 -2.00818,-2.180617 -2.42306,-2.61934 -0.29004,-0.306701 -0.34908,-0.35095 -0.35477,-0.345926 z"
         id="path1300"
         inkscape:path-effect="#path-effect1302"
         inkscape:original-d="m 541.27168,34.8233 c 0,0 5.72781,6.484072 7.25852,7.704995" /><path
         style="fill:#000000;fill-rule:nonzero;stroke:none;stroke-width:0.492623;stroke-linejoin:round;paint-order:fill markers stroke"
         d="m 547.42758,42.450662 c -0.0176,0.0083 0.20958,0.698527 0.47417,1.974835 0.21018,1.013857 0.47536,2.592566 0.5979,4.74044 -5e-5,-7.73e-4 0.01,0.177436 0.01,0.176662 0.11224,2.025295 0.1601,4.030716 0.0784,5.630002 -0.044,0.860778 -0.11722,1.452319 -0.18998,1.883894 -0.0177,0.104874 -0.0348,0.196976 -0.0505,0.277953 -0.0294,0.151346 -0.0565,0.280766 -0.0835,0.396171 -0.0624,0.267067 -0.11723,0.426958 -0.15676,0.511159 0.0597,-0.06724 0.18044,-0.200258 0.30264,-0.46006 0.0524,-0.111316 0.10327,-0.242266 0.14903,-0.394993 0.0246,-0.08214 0.0496,-0.176134 0.0743,-0.283189 0.10071,-0.436605 0.18701,-1.049694 0.23546,-1.915908 0.0901,-1.609985 0.0249,-3.637648 -0.0881,-5.660112 -4e-5,-5.8e-4 -0.01,-0.176506 -0.01,-0.177086 -0.12553,-2.185516 -0.38752,-3.734164 -0.64062,-4.776303 -0.31133,-1.281966 -0.68471,-1.931767 -0.70235,-1.923465 z"
         id="path1617"
         sodipodi:nodetypes="csc"
         inkscape:path-effect="#path-effect1619"
         inkscape:original-d="m 547.42758,42.450662 c 0,0 0.93756,1.991609 1.20752,6.707522 0.26996,4.715913 0.15463,7.848036 -0.52784,8.883594" /><path
         style="fill:#000000;fill-rule:nonzero;stroke:none;stroke-width:0.492623;stroke-linejoin:round;paint-order:fill markers stroke"
         d="m 548.1989,58.7055 c 4.8e-4,0.01085 0.26058,0.02904 0.80904,0.05283 0.55704,0.02416 1.71029,0.09691 3.00415,0.232232 -3e-5,-3e-6 0.022,0.0023 0.022,0.0023 0.93477,0.09816 2.17564,0.270346 3.48211,0.580427 1.25521,0.297916 2.04877,0.59364 2.67235,0.81861 0.4123,0.148748 0.71345,0.233891 0.85284,0.287109 -0.11849,-0.08374 -0.369,-0.289506 -0.76349,-0.492151 -0.55132,-0.283206 -1.46612,-0.636561 -2.68555,-0.931425 -1.31872,-0.318875 -2.59236,-0.475929 -3.52943,-0.559579 -10e-6,-2e-6 -0.0222,-0.002 -0.0222,-0.002 -1.35038,-0.119175 -2.43276,-0.08962 -3.0325,-0.0659 -0.66129,0.02615 -0.80979,0.06608 -0.80928,0.07752 z"
         id="path1621"
         inkscape:path-effect="#path-effect1623"
         inkscape:original-d="m 548.1989,58.7055 c 0,0 6.59246,-0.293237 10.84248,1.973515"
         sodipodi:nodetypes="cc" /><path
         style="fill:#000000;fill-rule:nonzero;stroke:none;stroke-width:0.492623;stroke-linejoin:round;paint-order:fill markers stroke"
         d="m 548.7566,51.541156 c -0.002,-0.0045 -0.11396,0.01864 -0.64427,0.214931 -0.49858,0.184542 -1.41191,0.542445 -2.42762,1.012346 -0.36264,0.167772 -0.73147,0.346712 -1.0929,0.533657 -0.42275,0.218667 -0.87143,0.466347 -1.29615,0.731325 -0.35346,0.220523 -0.69682,0.457069 -0.99581,0.701926 -0.28238,0.231263 -0.53139,0.474972 -0.71114,0.724435 -0.75419,1.050411 -1.57311,2.293448 -2.08796,3.671236 -0.25623,0.685702 -0.43399,1.394763 -0.50299,2.129541 -0.0606,0.645116 -0.0357,1.293616 0.082,1.946934 0.0226,0.125621 0.0488,0.252246 0.0788,0.379851 0.44021,1.874095 1.39583,3.815856 2.82858,5.870911 1.47953,2.122153 3.4256,4.303375 5.6582,6.518488 0.73004,0.721925 1.29612,1.307507 1.73593,1.778161 0.64242,0.687471 1.0727,1.186662 1.36799,1.551835 0.25016,0.309365 0.39018,0.50661 0.46002,0.605382 0.10488,0.148312 0.11439,0.151885 0.12464,0.150074 0.0102,-0.0018 0.0412,-0.02225 -0.0256,-0.201903 -0.0475,-0.127978 -0.15185,-0.340939 -0.38404,-0.683208 -0.26682,-0.393303 -0.68339,-0.928121 -1.31086,-1.633779 -0.43203,-0.485853 -0.99038,-1.084423 -1.7151,-1.819202 -2.20518,-2.228607 -4.11654,-4.403355 -5.56715,-6.504538 -1.40435,-2.034185 -2.32709,-3.926503 -2.75687,-5.730558 -0.0287,-0.120335 -0.0539,-0.239661 -0.0758,-0.357963 -0.11377,-0.614606 -0.14292,-1.224881 -0.0934,-1.83477 0.0564,-0.695156 0.21356,-1.37288 0.44749,-2.037565 0.47193,-1.340889 1.23814,-2.571787 1.96206,-3.641432 0.15321,-0.228143 0.37634,-0.461814 0.64403,-0.69311 0.28196,-0.243632 0.61038,-0.482171 0.95409,-0.70786 0.41212,-0.270606 0.8504,-0.525438 1.26539,-0.75176 0.35473,-0.193461 0.71682,-0.379815 1.07357,-0.556099 0.98317,-0.485813 1.91365,-0.888159 2.38516,-1.091094 0.50235,-0.216215 0.62203,-0.270093 0.61977,-0.276192 z"
         id="path1942"
         sodipodi:nodetypes="csssc"
         inkscape:path-effect="#path-effect1944"
         inkscape:original-d="m 548.7566,51.541156 c 0,0 -5.75077,2.126962 -7.05495,3.997368 -1.54547,2.216491 -3.07614,4.867182 -2.33522,7.999645 0.87315,3.691556 3.77232,7.672987 8.4054,12.312248 3.42371,3.428273 3.56209,4.211772 3.56209,4.211772" /><path
         style="fill:#000000;fill-rule:nonzero;stroke:none;stroke-width:0.492623;stroke-linejoin:round;paint-order:fill markers stroke"
         d="m 553.79508,59.027683 v 0 c -0.005,-0.01475 -0.1841,-0.09345 -1.08211,0.22926 -0.21934,0.07882 -0.50517,0.191305 -0.82726,0.335964 -0.43558,0.195634 -0.98814,0.473107 -1.49357,0.810051 -0.22705,0.151356 -0.44984,0.31822 -0.64894,0.498148 -0.1897,0.171432 -0.36149,0.357966 -0.49463,0.557536 -0.23805,0.357153 -0.46926,0.755326 -0.64925,1.235387 -0.17686,0.471722 -0.30204,1.015827 -0.34669,1.680815 -0.0453,0.675224 -0.007,1.459926 0.13397,2.3935 0.14902,0.989622 0.40837,2.118753 0.77899,3.402059 3e-5,8.2e-5 0.0143,0.04929 0.0143,0.04937 0.56416,1.94695 1.08169,3.500077 1.55014,4.954813 0.21368,0.663589 0.39008,1.225931 0.51575,1.684031 0.0635,0.231656 0.11307,0.432824 0.14785,0.604915 0.0357,0.176702 0.0548,0.317674 0.0588,0.426893 0.009,0.252245 0.0283,0.481503 0.0428,0.658756 0.0182,0.222702 0.0295,0.370598 0.0321,0.520938 0.001,0.07758 6e-5,0.144681 -0.003,0.206302 -0.004,0.08473 -0.0114,0.162737 -0.0235,0.239075 -0.0323,0.205325 -0.0982,0.369386 -0.15544,0.472131 0.0748,-0.0796 0.21197,-0.218689 0.30749,-0.424573 0.0363,-0.07823 0.0656,-0.163456 0.0858,-0.257264 0.0146,-0.06805 0.0254,-0.143179 0.032,-0.227846 0.0123,-0.157907 0.009,-0.327673 -0.002,-0.546837 -0.009,-0.175025 -0.0244,-0.409493 -0.0311,-0.649816 -0.004,-0.13143 -0.0254,-0.289756 -0.0623,-0.474249 -0.0362,-0.180943 -0.0873,-0.389079 -0.15184,-0.624455 -0.12746,-0.464908 -0.30611,-1.032658 -0.52012,-1.695953 -0.46681,-1.446832 -0.98943,-3.014596 -1.54386,-4.947339 10e-6,6.3e-5 -0.0141,-0.0493 -0.0141,-0.04924 -0.36553,-1.275556 -0.61573,-2.392896 -0.75456,-3.366247 -0.13098,-0.918297 -0.15878,-1.679419 -0.10652,-2.324477 0.0513,-0.633584 0.1788,-1.142233 0.35027,-1.576587 0.17467,-0.442429 0.39664,-0.811303 0.62957,-1.151196 0.11319,-0.164989 0.26336,-0.326714 0.43807,-0.482717 0.1828,-0.16323 0.39033,-0.318302 0.60619,-0.462661 0.47988,-0.320923 1.01294,-0.596653 1.43314,-0.800182 0.30181,-0.14619 0.59387,-0.278109 0.7937,-0.369048 0.85362,-0.388463 0.97371,-0.487775 0.96031,-0.529253 z"
         id="path1946"
         inkscape:path-effect="#path-effect1948"
         inkscape:original-d="m 553.79508,59.027683 c 0,0 -3.42152,1.105564 -4.38896,2.537409 -0.96747,1.431842 -1.63328,3.238429 -0.10087,8.565135 1.14183,3.969162 2.2582,6.77998 2.28951,7.755628 0.0313,0.97565 0.19648,1.492226 -0.24938,2.10177"
         sodipodi:nodetypes="csszc" /><path
         style="fill:#000000;fill-rule:nonzero;stroke:none;stroke-width:0.492623;stroke-linejoin:round;paint-order:fill markers stroke"
         d="m 545.95979,40.598765 v 0 c -0.0163,-0.011 -0.31999,0.330304 -0.96074,1.083294 -0.17357,0.203982 -0.38003,0.442963 -0.61233,0.702337 -0.86054,0.960835 -2.15176,2.292399 -3.66928,3.330969 0,1e-6 -0.004,0.0029 -0.004,0.0029 -1.31761,0.901807 -2.85747,1.967846 -4.15328,2.814596 -0.72301,0.472451 -1.25469,0.802023 -1.69735,1.065775 -0.16995,0.101264 -0.3102,0.182982 -0.43009,0.252799 -0.0943,0.05491 -0.18308,0.107227 -0.26193,0.153858 -0.29037,0.171705 -0.46607,0.277306 -0.56493,0.326699 0.10515,-0.02107 0.31614,-0.05607 0.63712,-0.174509 0.0885,-0.03265 0.18406,-0.07118 0.28645,-0.11664 0.12778,-0.05673 0.27916,-0.129071 0.45638,-0.220119 0.45341,-0.232961 1.02328,-0.561066 1.74876,-1.01514 1.29739,-0.812016 2.88794,-1.902156 4.1825,-2.790125 0,-1e-6 0.004,-0.0029 0.004,-0.0029 1.5582,-1.068799 2.84476,-2.442357 3.6773,-3.44573 0.22544,-0.271696 0.42104,-0.520859 0.58448,-0.737502 0.71201,-0.94382 0.78591,-1.224495 0.77695,-1.23056 z"
         id="path2271"
         inkscape:path-effect="#path-effect2273"
         inkscape:original-d="m 545.95979,40.598765 c 0,0 -2.19915,3.249859 -5.14054,5.265196 -2.94138,2.015338 -5.77958,3.975901 -7.21356,4.467982"
         sodipodi:nodetypes="csc" /><path
         style="fill:#000000;fill-rule:nonzero;stroke:none;stroke-width:0.492623;stroke-linejoin:round;paint-order:fill markers stroke"
         d="m 541.7044,35.413644 c -0.0174,-0.0014 -0.0945,0.439832 -0.35172,1.221801 -0.0312,0.09491 -0.0661,0.195174 -0.10487,0.30016 -0.32499,0.880415 -0.90374,2.053882 -1.85297,3.236217 -1.22087,1.521466 -2.23959,2.765634 -2.93212,3.585225 -0.6835,0.808918 -0.82978,1.016247 -0.80525,1.040463 v 0 c 0.0179,0.01771 0.24211,-0.114297 0.9975,-0.862847 0.72974,-0.723116 1.93117,-1.951722 3.12491,-3.45555 0.99291,-1.251174 1.45923,-2.552455 1.69753,-3.471717 0.0288,-0.110887 0.0543,-0.216392 0.0771,-0.315827 0.18813,-0.819361 0.1673,-1.276503 0.1499,-1.277925 z"
         id="path2275"
         sodipodi:nodetypes="csc"
         inkscape:path-effect="#path-effect2277"
         inkscape:original-d="m 541.7044,35.413644 c 0,0 -0.20576,2.517009 -2.11704,4.911824 -2.04652,2.564283 -3.92989,4.472042 -3.92989,4.472042" /><path
         style="fill:#000000;fill-rule:nonzero;stroke:none;stroke-width:0.492623;stroke-linejoin:round;paint-order:fill markers stroke"
         d="m 535.79867,47.843166 v 0 c 0.002,0.0033 0.026,0.0074 0.0808,-0.06908 0.0384,-0.05349 0.0905,-0.15418 0.1242,-0.335181 0.0323,-0.173673 0.0464,-0.413925 0.0202,-0.74374 -0.0292,-0.368175 -0.10489,-0.802428 -0.22469,-1.297197 0,-1.9e-5 -0.007,-0.0279 -0.007,-0.02792 -0.27025,-1.118201 -0.44456,-1.995688 -0.56345,-2.69264 -0.053,-0.310485 -0.10439,-0.64348 -0.13541,-0.928159 -0.002,-0.02168 -0.005,-0.04319 -0.007,-0.06452 -0.01,-0.09781 -0.0171,-0.190571 -0.0209,-0.27567 -0.004,-0.09544 -0.004,-0.178779 0.001,-0.247721 0.0223,-0.290763 0.004,-0.654512 -0.0769,-1.083233 -0.071,-0.375631 -0.18979,-0.796952 -0.36633,-1.242286 -0.0819,-0.206252 -0.1561,-0.393522 -0.22107,-0.553865 -0.0643,-0.158727 -0.12105,-0.294724 -0.17139,-0.406903 -0.0499,-0.111297 -0.0944,-0.200893 -0.13503,-0.267943 -0.0204,-0.03361 -0.0408,-0.06313 -0.0615,-0.08748 -0.0105,-0.0123 -0.0215,-0.02389 -0.0333,-0.03425 -0.0117,-0.01034 -0.0249,-0.0202 -0.0397,-0.02823 -0.023,-0.01299 -0.0474,-0.01795 -0.07,-0.01785 -0.0224,9.6e-5 -0.0433,0.0051 -0.0619,0.01208 -0.0188,0.0071 -0.0368,0.01689 -0.0538,0.02827 -0.0172,0.01151 -0.0341,0.02519 -0.0506,0.04063 -0.0334,0.03114 -0.067,0.07101 -0.0997,0.118872 -0.0263,0.0384 -0.0523,0.08239 -0.0774,0.132 -0.007,0.01346 -0.0137,0.02743 -0.0205,0.04193 -0.0609,0.129692 -0.12153,0.304943 -0.16662,0.535384 -0.0425,0.217449 -0.0719,0.487673 -0.0729,0.819037 -0.002,0.604992 9.6e-4,1.349444 -0.01,2.02776 -0.011,0.686098 -0.0365,1.342908 -0.0958,1.889043 -0.0305,0.280753 -0.0661,0.634791 -0.1005,1.016019 -0.0356,0.394197 -0.069,0.809134 -0.0948,1.20446 -0.0271,0.41591 -0.0451,0.799869 -0.0493,1.119784 -0.002,0.167945 -6.8e-4,0.317263 0.005,0.444841 0.003,0.06588 0.007,0.126178 0.0126,0.180496 0.006,0.05557 0.0125,0.105636 0.021,0.149536 0.0149,0.07657 0.0271,0.164581 0.0384,0.258827 0.0122,0.101127 0.0234,0.209288 0.0359,0.319436 0.0308,0.271214 0.0648,0.51374 0.1205,0.760758 0.0191,0.08454 0.0396,0.164353 0.0615,0.239943 0.063,0.217819 0.14114,0.411984 0.2307,0.585936 0.19767,0.383917 0.42705,0.621614 0.56855,0.76166 -0.12612,-0.158657 -0.29835,-0.428791 -0.43892,-0.818351 -0.0637,-0.176698 -0.11754,-0.367195 -0.16338,-0.579131 -0.0159,-0.07354 -0.031,-0.150702 -0.0453,-0.232694 -0.0424,-0.243795 -0.0672,-0.469828 -0.0931,-0.743201 -0.01,-0.105749 -0.0206,-0.221797 -0.0318,-0.322564 -0.0106,-0.09632 -0.0231,-0.191814 -0.0398,-0.277945 -0.007,-0.03445 -0.0127,-0.07666 -0.0178,-0.127084 -0.005,-0.04904 -0.009,-0.10487 -0.0122,-0.167438 -0.006,-0.121329 -0.008,-0.265575 -0.007,-0.43053 0.002,-0.314399 0.0171,-0.693626 0.0406,-1.107866 0.0224,-0.393545 0.0519,-0.806184 0.0832,-1.199828 0.0303,-0.380869 0.0614,-0.733043 0.0874,-1.013822 0.0515,-0.556618 0.0679,-1.221069 0.0707,-1.908413 0.003,-0.697564 -0.008,-1.408018 -0.0102,-2.029679 -0.001,-0.32189 0.0255,-0.581804 0.0652,-0.788287 0.0421,-0.218993 0.0992,-0.380912 0.15505,-0.496123 0.006,-0.01286 0.0125,-0.02515 0.0187,-0.03691 0.0229,-0.04341 0.046,-0.08041 0.0685,-0.111307 0.0283,-0.0388 0.0549,-0.06707 0.0779,-0.08609 0.0113,-0.0094 0.0214,-0.01612 0.0298,-0.0207 0.008,-0.0046 0.0146,-0.0066 0.0181,-0.0071 0.003,-4.41e-4 0.003,9.37e-4 -8.4e-4,0.0015 -0.004,6.21e-4 -0.0126,4e-5 -0.022,-0.0047 -0.001,7.4e-5 -3.1e-4,0.0015 0.002,0.0051 0.003,0.0039 0.006,0.0088 0.011,0.01659 0.01,0.01558 0.0214,0.03697 0.0357,0.06711 0.0286,0.06018 0.0622,0.14383 0.10382,0.256045 0.0415,0.111938 0.0895,0.248304 0.14592,0.409552 0.0577,0.165069 0.1222,0.350149 0.19766,0.562358 0.15453,0.435221 0.25286,0.841832 0.30884,1.199025 0.064,0.408047 0.0717,0.743035 0.0526,1.001826 -0.007,0.08886 -0.005,0.188156 0.001,0.292272 0.006,0.0937 0.0163,0.193397 0.0297,0.295755 0.003,0.02239 0.006,0.04489 0.009,0.06749 0.0426,0.299017 0.11106,0.630042 0.18353,0.943247 0.15698,0.678424 0.4072,1.57967 0.70567,2.671961 -2e-5,-7.8e-5 0.008,0.02781 0.008,0.02774 0.13284,0.485863 0.22061,0.911733 0.26321,1.271247 0.0382,0.322049 0.0359,0.55556 0.0159,0.723888 -0.0207,0.174652 -0.06,0.274201 -0.0874,0.328032 -0.0397,0.07797 -0.0549,0.08281 -0.053,0.08613 z"
         id="path2279"
         inkscape:path-effect="#path-effect2281"
         inkscape:original-d="m 535.79867,47.843166 c 0,0 0.48356,-0.28214 -0.0691,-2.427245 -0.55273,-2.145103 -0.88035,-3.659383 -0.83454,-4.267546 0.0458,-0.608163 -0.0844,-1.417515 -0.40236,-2.263191 -0.31807,-0.845675 -0.47025,-1.281967 -0.57914,-1.347728 -0.10889,-0.06576 -0.54276,0.350686 -0.54203,1.629988 0,1.279299 0.0281,2.821526 -0.0831,3.927472 -0.11118,1.105946 -0.31336,3.44594 -0.18985,4.080851 0.12351,0.63491 0.0446,1.958656 0.93391,2.950223"
         sodipodi:nodetypes="csssscssc" /><path
         style="fill:#000000;fill-rule:nonzero;stroke:none;stroke-width:0.492623;stroke-linejoin:round;paint-order:fill markers stroke"
         d="m 534.92343,19.420245 v 0 c -0.0102,0.0025 -0.0269,0.118461 0.0985,0.606929 0.0114,0.04436 0.0236,0.08995 0.0365,0.136473 0.0805,0.28931 0.20636,0.707139 0.39223,1.112742 0.0959,0.209352 0.21236,0.425338 0.35186,0.619205 0.13157,0.182846 0.29066,0.355779 0.48079,0.481151 0.0928,0.06117 0.19426,0.111877 0.3042,0.145993 0.0425,0.01319 0.0862,0.02387 0.13094,0.03169 0.0673,0.01177 0.1385,0.0173 0.21303,0.01466 0.11508,-0.0041 0.23548,-0.0275 0.35957,-0.07485 0.1165,-0.04445 0.23437,-0.109237 0.3534,-0.196677 0.19961,-0.147322 0.44151,-0.335462 0.71873,-0.55795 0.26646,-0.213857 0.56145,-0.456169 0.87224,-0.715462 0.63637,-0.530931 1.31149,-1.110074 1.90051,-1.622993 0.84385,-0.734813 1.40167,-1.237553 1.71759,-1.523331 0.47284,-0.427727 0.5221,-0.498808 0.51553,-0.506581 -0.007,-0.0085 -0.0838,0.03019 -0.58744,0.420773 -0.32925,0.25534 -0.95792,0.744906 -1.81123,1.407937 -0.61163,0.475239 -1.32269,1.025562 -1.97666,1.519987 -0.3223,0.243675 -0.62487,0.469364 -0.89883,0.66936 -0.28536,0.208322 -0.52885,0.380848 -0.72816,0.515728 -0.0913,0.06138 -0.17331,0.10103 -0.24587,0.126058 -0.0767,0.02646 -0.14518,0.03738 -0.20607,0.0392 -0.0399,0.0012 -0.0779,-0.0015 -0.11438,-0.007 -0.0243,-0.0037 -0.0486,-0.0088 -0.073,-0.01533 -0.0629,-0.01683 -0.12689,-0.04324 -0.19212,-0.07955 -0.13612,-0.07578 -0.27169,-0.19137 -0.40405,-0.336777 -0.13872,-0.152394 -0.26807,-0.331118 -0.38459,-0.515023 -0.22471,-0.354671 -0.40761,-0.738048 -0.5231,-1.010537 -0.0185,-0.0437 -0.0364,-0.08642 -0.0536,-0.128121 -0.16616,-0.402046 -0.23373,-0.560826 -0.24656,-0.557688 z"
         id="path2610"
         inkscape:path-effect="#path-effect2612"
         inkscape:original-d="m 534.92343,19.420245 c 0,0 0.93994,3.842967 2.58218,2.681058 1.64223,-1.161907 5.86346,-4.730051 5.86346,-4.730051"
         sodipodi:nodetypes="csc" /><path
         style="fill:#000000;fill-rule:nonzero;stroke:none;stroke-width:0.492623;stroke-linejoin:round;paint-order:fill markers stroke"
         d="m 530.83761,13.217438 v 0 c -0.006,-0.0016 -0.0661,0.05239 -0.16339,0.491891 -0.0462,0.208587 -0.11503,0.563724 -0.17054,1.045679 -0.11727,1.01817 -0.1499,2.389629 0.0948,3.906499 a 0.13906766,0.13906646 54.396648 0 0 0.26013,0.04305 c 0.009,-0.01628 0.0172,-0.03229 0.0256,-0.04803 0.32393,-0.60335 0.61576,-1.024116 0.78386,-1.23745 0.15918,-0.202018 0.23025,-0.298486 0.2232,-0.307753 -0.006,-0.0075 -0.0882,-0.0024 -0.32517,0.212276 -0.2149,0.194651 -0.57966,0.563027 -0.92645,1.200768 -0.009,0.01629 -0.0178,0.03288 -0.0267,0.04978 l 0.26013,0.04305 c -0.24253,-1.50319 -0.24761,-2.820269 -0.17922,-3.844872 0.0313,-0.46885 0.076,-0.841143 0.10149,-1.041922 0.0559,-0.441085 0.0592,-0.508551 0.0422,-0.512971 z"
         id="path2614"
         sodipodi:nodetypes="ccc"
         inkscape:path-effect="#path-effect2616"
         inkscape:original-d="m 530.83761,13.217438 c 0,0 -0.60293,2.315978 -0.10179,5.421917 0.57801,-1.088939 1.15553,-1.528028 1.15553,-1.528028" /><path
         style="fill:#000000;fill-rule:nonzero;stroke:none;stroke-width:0.492623;stroke-linejoin:round;paint-order:fill markers stroke"
         d="m 552.16857,25.661911 h 0 c 0.005,0.01298 0.19506,-0.04837 1.36511,-0.43877 1.65183,-0.55115 5.17093,-1.702864 10.13379,-3.23277 4.56348,-1.406787 8.28961,-2.458558 12.76437,-3.714513 2.36015,-0.662434 4.95328,-1.405182 5.98434,-1.682777 -1.21642,0.267944 -3.51916,0.755009 -6.06055,1.396899 -4.09195,1.033524 -8.64358,2.365894 -12.79067,3.671334 -4.90536,1.544135 -8.49001,2.868397 -10.06598,3.464275 -1.02834,0.388818 -1.33343,0.528238 -1.33041,0.536322 z"
         id="path2949"
         inkscape:path-effect="#path-effect2951"
         inkscape:original-d="m 552.16857,25.661911 c 0,0 13.00612,-4.851325 30.24761,-9.06883"
         sodipodi:nodetypes="cc" /><path
         style="fill:#000000;fill-rule:nonzero;stroke:none;stroke-width:0.492623;stroke-linejoin:round;paint-order:fill markers stroke"
         d="m 582.29686,16.669735 0,0 c -0.0203,-0.01228 -0.17151,0.180935 -0.7088,0.988106 -0.51005,0.766239 -1.3802,2.024512 -2.15938,3.348943 -0.66557,1.131324 -1.31302,2.378135 -1.77064,3.312022 -0.10493,0.21413 -0.19749,0.406662 -0.28067,0.581513 -0.11341,0.238379 -0.21519,0.463978 -0.29701,0.661584 -0.074,0.178817 -0.126,0.320841 -0.16007,0.431861 -0.0199,0.06481 -0.0328,0.116187 -0.0409,0.157189 -0.0111,0.05632 -0.0128,0.09084 -0.0121,0.112106 0.008,-0.01974 0.0216,-0.05036 0.0468,-0.10024 0.0183,-0.03633 0.0424,-0.0822 0.0742,-0.140582 0.0545,-0.100269 0.1274,-0.229669 0.22322,-0.395781 0.10717,-0.185778 0.22871,-0.392691 0.36358,-0.621056 0.0974,-0.164924 0.20823,-0.348481 0.33145,-0.550286 0.50096,-0.820419 1.32598,-2.131279 1.94741,-3.199579 0.78427,-1.348254 1.46425,-2.68552 1.9011,-3.497526 0.45922,-0.853578 0.56312,-1.075395 0.54187,-1.088274 z"
         id="path2953"
         inkscape:path-effect="#path-effect2955"
         inkscape:original-d="m 582.29686,16.669735 c 0,0 -5.27167,8.699357 -5.4296,9.593324" /><path
         style="fill:#000000;fill-rule:nonzero;stroke:none;stroke-width:0.492623;stroke-linejoin:round;paint-order:fill markers stroke"
         d="m 577.11614,26.451511 c -6.4e-4,0.0035 0.0132,0.0073 0.14058,0.04917 0.27462,0.09028 1.79396,0.582746 4.01062,1.288405 2.31381,0.736585 7.47428,2.771175 9.42984,3.553445 0.66759,0.26705 1.14997,0.408327 1.38439,0.495091 -0.20735,-0.128201 -0.62608,-0.427199 -1.25838,-0.765533 -2.63519,-1.410043 -6.5949,-2.918394 -9.41109,-3.753877 -2.51492,-0.746105 -3.90638,-0.840002 -4.14694,-0.859403 -0.13638,-0.011 -0.1484,-0.01069 -0.14902,-0.0073 z"
         id="path2957"
         inkscape:path-effect="#path-effect2959"
         inkscape:original-d="m 577.11614,26.451511 c 0,0 6.27441,1.143672 14.96543,5.386114"
         sodipodi:nodetypes="cc" /><path
         style="fill:#000000;fill-rule:nonzero;stroke:none;stroke-width:0.492623;stroke-linejoin:round;paint-order:fill markers stroke"
         d="m 591.60499,31.715061 c -0.41143,0.05979 -1.38191,0.169732 -2.46856,0.358753 -1.95889,0.340747 -5.74831,1.191431 -8.70233,1.773354 a 0.1234781,0.01184664 89.917448 0 0 0.0123,0.125755 c 0,-9.4e-5 0.0873,0.06816 0.23625,0.188359 l -0.0412,-0.01434 c 0.89317,0.724087 4.19588,3.500143 7.99831,7.424779 2.63585,2.720575 4.91366,5.371418 6.8841,7.952526 0.30768,0.403022 0.59908,0.792768 0.87578,1.16949 2.69304,3.666523 4.19195,6.378128 5.00345,8.12559 -0.70271,-1.7354 -2.00248,-4.684282 -4.62437,-8.398549 -0.27153,-0.384667 -0.56015,-0.781694 -0.86634,-1.190358 -1.94316,-2.593401 -4.31326,-5.281067 -6.98799,-7.939717 -3.90518,-3.881684 -7.2759,-6.529195 -8.20064,-7.247469 a 0.03042282,0.0050046 28.558281 0 0 -0.0412,-0.01434 c -0.039,-0.0304 -0.0737,-0.0574 -0.10377,-0.08071 2.93731,-0.5739 6.68977,-1.20978 8.60558,-1.630405 1.0773,-0.236528 2.01715,-0.502263 2.42058,-0.602716 z"
         id="path2961"
         sodipodi:nodetypes="ccc"
         inkscape:path-effect="#path-effect2963"
         inkscape:original-d="m 591.60499,31.715061 -11.15864,2.194388 c 0,0 15.24301,11.754734 20.95674,24.909875" /><path
         style="fill:#000000;fill-rule:nonzero;stroke:none;stroke-width:0.492623;stroke-linejoin:round;paint-order:fill markers stroke"
         d="m 593.90537,61.299661 v 0 c -0.003,0.01367 0.0642,0.117825 0.52198,0.140353 0.27702,0.01363 0.69964,-0.0015 1.27598,-0.10517 0.33316,-0.05993 0.67959,-0.142751 1.02165,-0.242806 0.6175,-0.180623 1.22765,-0.404137 1.92814,-0.725039 0.99046,-0.453739 2.04308,-1.072802 2.82517,-1.541669 -0.55863,0.271718 -2.13327,0.9371 -2.94987,1.241039 -0.65529,0.243897 -1.37066,0.490465 -1.91365,0.65182 -0.33776,0.100368 -0.66106,0.188897 -0.98438,0.265451 -0.55129,0.130533 -0.94799,0.188992 -1.21089,0.220688 -0.36216,0.04366 -0.51014,0.07609 -0.51413,0.09533 z"
         id="path3304"
         inkscape:path-effect="#path-effect3306"
         inkscape:original-d="m 593.90537,61.299661 c 0,0 2.173,0.450327 7.57292,-2.474331"
         sodipodi:nodetypes="cc" /><path
         style="fill:#000000;fill-rule:nonzero;stroke:none;stroke-width:0.492623;stroke-linejoin:round;paint-order:fill markers stroke"
         d="m 593.63814,61.513738 c -0.0248,0.01606 0.0575,0.245992 0.8229,1.539643 0.19748,0.333766 0.47067,0.788703 0.66814,1.122469 0.35528,0.599589 0.81272,1.382277 1.19552,2.100961 0.17119,0.3214 0.33037,0.635346 0.46037,0.918286 0.0626,0.136268 0.11832,0.265069 0.16522,0.383732 0.0461,0.11656 0.0833,0.222489 0.11026,0.315592 0.29776,1.05368 0.34881,1.761719 0.3232,2.209924 -0.0276,0.483424 -0.12461,0.623479 -0.1263,0.617007 l 0.0285,0.05126 c 0,0.0016 -0.15005,0.05776 -0.3727,0.133675 l -0.0132,-0.08521 c -0.82501,0.24173 -2.38519,0.613672 -4.37559,0.892468 -2.2805,0.31943 -4.32763,0.413487 -6.31679,0.422132 -2.03403,0.0088 -3.49965,-0.05634 -4.4401,-0.172245 0.85768,0.201837 2.41938,0.592331 4.43094,0.673851 1.96307,0.07955 4.16646,-0.124243 6.3866,-0.56589 1.99273,-0.396407 3.5238,-0.887362 4.34134,-1.167157 a 0.03967142,0.04631492 31.774627 0 0 -0.0132,-0.08521 c 0.22265,-0.06547 0.3727,-0.115168 0.3727,-0.113574 a 0.04325392,0.00741271 70.621056 0 0 0.0285,0.05126 c -0.002,-0.0065 0.11787,-0.145242 0.17805,-0.642641 0.0559,-0.461701 0.0391,-1.191553 -0.23337,-2.272733 -0.0254,-0.102788 -0.0614,-0.216943 -0.10566,-0.339354 -0.0452,-0.124862 -0.0992,-0.259136 -0.15988,-0.399794 -0.12597,-0.291885 -0.28179,-0.613743 -0.44941,-0.940214 -0.37672,-0.733737 -0.82717,-1.518433 -1.18676,-2.121817 -0.26608,-0.446456 -0.50376,-0.829723 -0.68694,-1.115806 -0.8127,-1.269206 -1.01958,-1.418943 -1.03242,-1.410633 z"
         id="path3308"
         sodipodi:nodetypes="cscc"
         inkscape:path-effect="#path-effect3310"
         inkscape:original-d="m 593.63814,61.513738 c 0,0 3.10662,4.800017 3.52174,6.354151 0.57394,2.148672 0.12611,2.871152 0.12611,2.871152 0,0 -7.44364,2.667698 -15.51838,1.2244" /><path
         style="fill:#000000;fill-rule:nonzero;stroke:none;stroke-width:0.492623;stroke-linejoin:round;paint-order:fill markers stroke"
         d="m 576.30839,66.086221 v 0 c -0.006,0.01038 0.0167,0.0492 0.21305,0.191205 0.18945,0.137029 0.49855,0.338519 0.77282,0.504482 0.23521,0.142326 0.47653,0.280757 0.71501,0.414014 0.16667,0.09313 0.33315,0.184383 0.49889,0.274693 0.33558,0.182839 0.60819,0.335371 0.96405,0.504819 0.0219,0.01041 0.0446,0.02111 0.0681,0.03205 0.60738,0.282642 1.12911,0.469302 1.39701,0.562384 -0.17205,-0.104054 -0.82083,-0.519794 -1.2768,-0.790281 -0.0222,-0.01317 -0.0438,-0.02589 -0.0646,-0.03806 -0.3576,-0.208869 -0.59669,-0.331051 -0.95073,-0.522999 -0.16655,-0.09029 -0.33092,-0.179842 -0.49963,-0.270829 -0.23875,-0.128754 -0.48562,-0.26005 -0.72992,-0.384201 -0.28183,-0.143223 -0.62197,-0.304538 -0.83357,-0.39377 -0.22311,-0.09408 -0.26766,-0.0941 -0.27367,-0.08351 z"
         id="path3316"
         inkscape:path-effect="#path-effect3318"
         inkscape:original-d="m 576.30839,66.086221 c 0,0 3.17441,1.800356 4.62894,2.483646" /><path
         style="fill:#000000;fill-rule:nonzero;stroke:none;stroke-width:0.492623;stroke-linejoin:round;paint-order:fill markers stroke"
         d="m 574.43713,65.501773 c 0.063,0.06471 0.23467,0.252937 0.37799,0.388238 0.17246,0.162796 0.40121,0.350519 0.59264,0.513964 0.17765,0.151681 0.31516,0.292597 0.51717,0.434694 0.24729,0.173948 0.72917,0.424377 0.875,0.509253 -0.11763,-0.120976 -0.47717,-0.527982 -0.70576,-0.725856 -0.18673,-0.161642 -0.35672,-0.260989 -0.54687,-0.396684 -0.20489,-0.146219 -0.44236,-0.322772 -0.64204,-0.450734 -0.16595,-0.10635 -0.39011,-0.227396 -0.46813,-0.272875 z"
         id="path3320"
         inkscape:path-effect="#path-effect3322"
         inkscape:original-d="m 574.43713,65.501773 2.3628,1.846149" /><path
         style="fill:#000000;fill-rule:nonzero;stroke:none;stroke-width:0.492623;stroke-linejoin:round;paint-order:fill markers stroke"
         d="m 550.6304,60.607088 c -0.0228,0.01012 -0.044,0.197669 0.31851,1.054203 0.19497,0.460715 0.54351,1.200548 1.00022,2.095327 0.40619,0.795784 0.87403,1.663981 1.32908,2.42538 0.23148,0.387315 0.45054,0.731823 0.65381,1.026201 0.22385,0.324168 0.41847,0.572977 0.58671,0.756059 a 0.12350705,0.12803741 44.207772 0 0 0.18716,-0.006 c 0.32234,-0.367968 0.60943,-0.836901 0.83962,-1.301317 0.23334,-0.470795 0.42458,-0.969283 0.55332,-1.440605 0.0126,-0.04604 0.0244,-0.09128 0.0355,-0.135712 0.13697,-0.547486 0.1831,-1.044118 0.22908,-1.472877 0.0146,-0.136149 0.0292,-0.268547 0.0456,-0.398177 0.007,-0.05282 0.0136,-0.105354 0.0203,-0.155765 0.0189,-0.140718 0.0388,-0.280422 0.0518,-0.368779 6e-4,-0.0022 0.001,-0.0032 0.001,-0.0021 1.5e-4,9.29e-4 -1.1e-4,0.0041 -0.002,0.0094 -0.002,0.0051 -0.006,0.01348 -0.0133,0.02289 -0.008,0.0097 -0.0195,0.02012 -0.0357,0.02785 -0.0162,0.0078 -0.0328,0.01083 -0.0479,0.01082 -0.0143,-9e-6 -0.0257,-0.0028 -0.0331,-0.005 -0.007,-0.0021 -0.0129,-0.0048 -0.015,-0.0056 -0.003,-0.0011 -0.004,-0.0013 -0.004,-5.72e-4 -1.7e-4,0.0013 0.003,0.0068 0.008,0.01462 0.005,0.0084 0.0113,0.01818 0.0191,0.03162 0.0155,0.02662 0.0335,0.0598 0.0549,0.101402 0.0435,0.08455 0.0937,0.190024 0.14932,0.309078 0.0584,0.125082 0.12058,0.260199 0.18156,0.388558 0.0323,0.06799 0.0642,0.133931 0.0955,0.19642 0.0983,0.196371 0.20898,0.400927 0.29996,0.555228 0.16909,0.286794 0.23081,0.334692 0.25008,0.326776 v 0 c 0.0179,-0.0073 0.0317,-0.0864 -0.0585,-0.408363 -0.0489,-0.174486 -0.12176,-0.393763 -0.20449,-0.602091 -0.0261,-0.06563 -0.0549,-0.134179 -0.0858,-0.204 -0.0583,-0.131768 -0.12412,-0.268764 -0.19024,-0.395187 -0.0621,-0.118825 -0.12464,-0.228491 -0.18176,-0.316 -0.0281,-0.04306 -0.0554,-0.08148 -0.0813,-0.113686 -0.013,-0.01616 -0.0261,-0.03127 -0.0392,-0.04492 -0.013,-0.0135 -0.0272,-0.0269 -0.0425,-0.03872 -0.008,-0.006 -0.0166,-0.01221 -0.0263,-0.01795 -0.01,-0.0057 -0.0215,-0.01173 -0.0353,-0.0165 -0.0138,-0.0048 -0.0312,-0.0089 -0.0512,-0.0092 -0.0207,-2.38e-4 -0.0426,0.0038 -0.0636,0.01369 -0.021,0.0099 -0.0371,0.0237 -0.049,0.03794 -0.0117,0.01399 -0.0192,0.02831 -0.0241,0.04043 -0.005,0.0123 -0.008,0.02418 -0.0103,0.03463 -0.002,0.01066 -0.003,0.02118 -0.004,0.0311 -0.007,0.08983 -0.024,0.217079 -0.0491,0.359664 -0.009,0.04945 -0.0184,0.10036 -0.029,0.15192 -0.0258,0.125686 -0.0573,0.254131 -0.0926,0.383796 -0.11637,0.427366 -0.26384,0.846136 -0.42527,1.395138 -0.0125,0.04267 -0.0252,0.08602 -0.038,0.130473 -0.12929,0.447324 -0.26636,0.955125 -0.43211,1.421272 -0.14954,0.420529 -0.33466,0.843497 -0.5769,1.183166 -0.13796,-0.154411 -0.29309,-0.357275 -0.46625,-0.612422 -0.19646,-0.289499 -0.40724,-0.633173 -0.62899,-1.020683 -0.43697,-0.7636 -0.8809,-1.634785 -1.27404,-2.434035 -0.44133,-0.897205 -0.78672,-1.635006 -1.01268,-2.079401 -0.41995,-0.825879 -0.5588,-0.941836 -0.58692,-0.929375 z"
         id="path3673"
         sodipodi:nodetypes="ccsc"
         inkscape:path-effect="#path-effect3675"
         inkscape:original-d="m 550.6304,60.607088 c 0,0 2.5647,5.787593 3.97924,7.270446 1.15804,-1.380037 1.67308,-4.519638 1.75213,-5.206217 0.0457,-0.397109 1.02859,1.995046 1.02859,1.995046" /><path
         style="fill:#000000;fill-rule:nonzero;stroke:none;stroke-width:0.492623;stroke-linejoin:round;paint-order:fill markers stroke"
         d="m 559.56528,47.865955 c -0.008,0.04677 0.0492,0.198168 0.48069,0.325322 0.41668,0.12278 1.24129,0.25311 2.35567,0.352138 0.20544,0.01826 0.41721,0.03508 0.6339,0.05029 1.67495,0.117554 4.17793,0.206212 5.18534,-0.09277 0.21813,-0.06474 0.31568,-0.174512 0.37664,-0.209124 -0.0675,-0.02386 -0.17922,-0.113523 -0.40244,-0.146478 -0.76091,-0.112333 -3.668,-0.06416 -5.11114,-0.183953 -0.21365,-0.01773 -0.4217,-0.03622 -0.62443,-0.05505 -1.11507,-0.10352 -1.89669,-0.200084 -2.34144,-0.202378 -0.4421,-0.0023 -0.54401,0.112131 -0.55279,0.161996 z"
         id="path3677"
         inkscape:path-effect="#path-effect3679"
         inkscape:original-d="m 559.56528,47.865955 c 0,0 4.63003,0.81517 9.03224,0.425859"
         sodipodi:nodetypes="cc" /><path
         style="fill:#000000;fill-rule:nonzero;stroke:none;stroke-width:0.492623;stroke-linejoin:round;paint-order:fill markers stroke"
         d="m 560.16931,53.087366 c -0.006,0.01753 0.0951,0.09452 0.67732,0.318096 0.66735,0.256279 2.15128,0.804387 3.96578,1.239296 1.15327,0.27642 2.60039,0.567693 3.95106,0.674376 0.72945,0.05762 1.33196,0.05342 1.81619,0.0038 0.23441,-0.02403 0.42904,-0.05756 0.58511,-0.09473 0.4649,-0.110732 0.7262,-0.3063 0.84794,-0.38216 -0.13986,0.01832 -0.45612,0.01035 -0.89749,0.02695 -0.15271,0.0057 -0.33546,0.01312 -0.56077,0.0157 -0.46884,0.0054 -1.03169,-0.01152 -1.74649,-0.07986 -1.32944,-0.127113 -2.72065,-0.389057 -3.8854,-0.644188 -1.65635,-0.362816 -3.47101,-0.802732 -4.0197,-0.938124 -0.60334,-0.148874 -0.72617,-0.160751 -0.73355,-0.139117 z"
         id="path3681"
         inkscape:path-effect="#path-effect3683"
         inkscape:original-d="m 560.16931,53.087366 c 0,0 8.58067,2.926629 11.8434,1.758642"
         sodipodi:nodetypes="cc" /><path
         style="fill:#000000;fill-rule:nonzero;stroke:none;stroke-width:0.492623;stroke-linejoin:round;paint-order:fill markers stroke"
         d="m 578.84601,48.031331 c 0.1861,0.169938 0.6704,0.631141 1.1166,1.019625 0.63388,0.551892 1.49154,1.280493 2.34965,1.949983 0.92528,0.721902 2.02144,1.438428 3.05282,2.228443 -0.0399,3.62e-4 -0.0797,5.63e-4 -0.11951,5.9e-4 -1.14091,7.89e-4 -2.45427,-0.13718 -3.52318,-0.142632 -0.89238,-0.0046 -1.99479,0.04807 -2.45659,0.07436 -0.18164,0.01034 -0.31601,0.02644 -0.37921,0.03172 0.0631,0.0063 0.1972,0.0245 0.37866,0.03771 0.46133,0.03359 1.56276,0.103622 2.45511,0.113175 1.06886,0.01144 2.38424,-0.105751 3.52499,-0.08693 0.0554,9.15e-4 0.11092,0.0022 0.1664,0.0037 a 0.01625717,0.01593576 65.02384 0 0 0.0102,-0.02873 c -1.01649,-0.833402 -1.97442,-1.751467 -2.89808,-2.497875 -0.84652,-0.684079 -1.75051,-1.354331 -2.43169,-1.846661 -0.47948,-0.34656 -1.03843,-0.713757 -1.24612,-0.856508 z"
         id="path3685"
         inkscape:path-effect="#path-effect3687"
         inkscape:original-d="m 578.84601,48.031331 6.56587,5.21366 -6.52529,-0.05157"
         sodipodi:nodetypes="ccc" /><path
         style="fill:#000000;fill-rule:nonzero;stroke:none;stroke-width:0.492623;stroke-linejoin:round;paint-order:fill markers stroke"
         d="m 569.01143,34.24125 c 0.002,0.0048 0.18078,-0.0541 0.61439,-0.147648 0.42612,-0.09193 1.17778,-0.208248 2.07787,-0.28378 0.2626,-0.02204 0.51709,-0.0391 0.77451,-0.0535 0.60997,-0.03411 1.22139,-0.04547 1.83729,-0.0099 0.35174,0.02029 0.68943,0.05508 1.01293,0.105205 0.81993,0.127041 1.43415,0.311531 1.86849,0.477072 -0.40773,-0.194383 -1.0263,-0.455123 -1.83886,-0.63469 -0.32481,-0.07178 -0.66546,-0.13109 -1.02245,-0.173798 -0.62162,-0.07437 -1.25499,-0.09361 -1.87468,-0.05464 -0.26015,0.01636 -0.5243,0.0446 -0.78717,0.08261 -0.91859,0.132794 -1.63915,0.35529 -2.06349,0.485955 -0.5003,0.154057 -0.59978,0.204411 -0.59883,0.207149 z"
         id="path3689"
         inkscape:path-effect="#path-effect3691"
         inkscape:original-d="m 569.01143,34.24125 c 0,0 4.41094,-1.528517 8.18548,0.08742"
         sodipodi:nodetypes="cc" /><path
         style="fill:#000000;fill-rule:nonzero;stroke:none;stroke-width:0.492623;stroke-linejoin:round;paint-order:fill markers stroke"
         d="m 576.87149,34.634899 c -0.003,-0.0014 -0.0375,0.09599 -0.23087,0.365689 -0.15868,0.221291 -0.51642,0.650931 -1.09002,1.183864 -0.4006,0.372198 -0.82227,0.718173 -1.29451,1.078252 -0.99303,0.75718 -1.87541,1.27367 -2.82567,1.80171 -0.36128,0.200752 -0.68095,0.393287 -0.82591,0.471243 0.16263,-0.05383 0.50982,-0.154166 0.90057,-0.316969 0.91778,-0.382384 2.01482,-0.982655 2.94889,-1.696823 0.47248,-0.361237 0.90341,-0.763078 1.26744,-1.169964 0.54099,-0.604673 0.81521,-1.084729 0.95371,-1.329273 0.16481,-0.291011 0.19949,-0.386347 0.19637,-0.387729 z"
         id="path3693"
         sodipodi:nodetypes="cc"
         inkscape:path-effect="#path-effect3695"
         inkscape:original-d="m 576.87149,34.634899 c 0,0 -1.20563,2.72182 -6.26698,4.900758" /><path
         style="fill:#000000;fill-rule:nonzero;stroke:none;stroke-width:0.492624;stroke-linejoin:round;paint-order:fill markers stroke"
         d="m 581.50727,71.738348 v 0 c -0.0147,0.009 0.10229,0.276325 0.39721,0.981405 0.033,0.07881 0.069,0.167196 0.10675,0.263105 0.12215,0.310793 0.27464,0.73418 0.39497,1.198791 0.10812,0.417506 0.18974,0.865759 0.2049,1.303984 6.9e-4,0.03472 -0.005,0.05786 -0.0115,0.0732 -0.006,0.01463 -0.0152,0.02599 -0.0271,0.03641 -0.0128,0.0112 -0.032,0.02384 -0.062,0.0362 -0.0305,0.01258 -0.0703,0.02398 -0.12141,0.03238 -0.10441,0.01717 -0.24195,0.01959 -0.4132,0.0043 -0.17326,-0.01545 -0.37301,-0.04827 -0.59477,-0.09673 -0.46486,-0.101584 -1.01062,-0.26835 -1.58746,-0.473559 -0.63672,-0.226514 -1.30068,-0.49594 -1.93739,-0.77376 -0.32624,-0.142345 -0.64429,-0.286423 -0.94919,-0.428455 -1.23084,-0.573349 -2.35341,-1.156055 -3.20917,-1.634518 -0.65139,-0.364195 -1.27832,-0.739918 -1.84041,-1.118595 -0.49473,-0.333289 -0.99695,-0.707777 -1.40696,-1.092408 a 0.07575365,0.07425492 18.102739 0 0 -0.12675,0.06271 c 0.0101,0.07344 0.0198,0.147873 0.0289,0.223286 0.11866,0.979915 0.12943,1.897185 0.0463,2.799332 -0.0733,0.796274 -0.21777,1.555037 -0.33207,2.292565 -0.013,0.0019 -0.0263,0.0035 -0.0398,0.0047 -0.0532,0.0046 -0.11028,0.0032 -0.17096,-0.0035 -0.003,-3.81e-4 -0.007,-7.79e-4 -0.0103,-0.0012 -0.1251,-0.01501 -0.26712,-0.0545 -0.42413,-0.117443 -0.34286,-0.137455 -0.72662,-0.374248 -1.10673,-0.647644 -0.44436,-0.31961 -0.88205,-0.688127 -1.23168,-0.992441 -2.4e-4,-2.05e-4 -0.0326,-0.02845 -0.0329,-0.02866 -0.52328,-0.456616 -0.9673,-0.84525 -1.16605,-1.030933 0.16241,0.209005 0.52482,0.694497 1.00458,1.199318 0.0101,0.0106 0.0202,0.02125 0.0304,0.03194 0.3253,0.340153 0.74205,0.741706 1.18631,1.096523 0.37428,0.298934 0.77903,0.573374 1.16362,0.738322 0.1775,0.07613 0.35532,0.130962 0.52723,0.152407 0.005,6e-4 0.01,0.0012 0.0145,0.0017 0.0848,0.0096 0.17208,0.011 0.25923,4.15e-4 0.0826,-0.01003 0.16507,-0.03082 0.24468,-0.06549 a 0.1879456,0.20451835 80.232866 0 0 0.12025,-0.155861 c 0.088,-0.783439 0.17189,-1.595683 0.19007,-2.461978 0.0199,-0.949295 -0.0379,-1.810416 -0.13139,-2.827089 -8e-5,-8.81e-4 -8.5e-4,-0.0092 -0.002,-0.02213 0.37525,0.354232 0.81239,0.707742 1.23591,1.025764 0.54729,0.410961 1.15923,0.828436 1.79703,1.22838 0.85577,0.536631 1.93193,1.150413 3.18779,1.753572 0.30666,0.14728 0.6274,0.295821 0.95705,0.441829 0.64284,0.284723 1.31802,0.559034 1.96908,0.787643 0.58839,0.206603 1.15647,0.375572 1.64942,0.475987 0.23546,0.04796 0.4558,0.0807 0.65393,0.09391 0.19322,0.01289 0.37198,0.0077 0.52573,-0.02363 0.0766,-0.01561 0.15,-0.0383 0.21707,-0.0704 0.067,-0.03208 0.12925,-0.07434 0.18129,-0.129429 0.0525,-0.05554 0.0915,-0.120983 0.11498,-0.194802 0.0231,-0.07262 0.0297,-0.149412 0.0235,-0.226334 -0.0408,-0.474301 -0.15587,-0.945308 -0.29406,-1.368993 -0.15483,-0.474673 -0.34029,-0.894719 -0.48896,-1.20185 -0.0458,-0.0947 -0.0894,-0.181293 -0.1294,-0.258591 -0.40674,-0.786937 -0.58179,-0.895668 -0.58507,-0.893664 z"
         id="path3312"
         sodipodi:nodetypes="csccc"
         inkscape:path-effect="#path-effect3314"
         inkscape:original-d="m 581.50727,71.738348 c 0,0 1.19102,1.950623 1.30066,3.735192 0.10965,1.784571 -9.42615,-2.494089 -12.40943,-5.369325 0.28907,2.500787 0.0668,3.772669 -0.15729,5.480466 -0.96056,0.391483 -3.00241,-1.490649 -4.35667,-2.973823" /></g></g></svg>
