<?xml version="1.0" encoding="UTF-8" standalone="no"?>
<!-- Created with Inkscape (http://www.inkscape.org/) -->

<svg
   width="100mm"
   height="100mm"
   viewBox="0 0 100 100"
   version="1.1"
   id="svg5"
   inkscape:version="1.2.2 (b0a8486541, 2022-12-01)"
   sodipodi:docname="fedora_silverblue.svg"
   inkscape:export-filename="../logo-pngs/fedora_silverblue.png"
   inkscape:export-xdpi="96"
   inkscape:export-ydpi="96"
   xmlns:inkscape="http://www.inkscape.org/namespaces/inkscape"
   xmlns:sodipodi="http://sodipodi.sourceforge.net/DTD/sodipodi-0.dtd"
   xmlns="http://www.w3.org/2000/svg"
   xmlns:svg="http://www.w3.org/2000/svg">
  <sodipodi:namedview
     id="namedview7"
     pagecolor="#505050"
     bordercolor="#ffffff"
     borderopacity="1"
     inkscape:showpageshadow="0"
     inkscape:pageopacity="0"
     inkscape:pagecheckerboard="1"
     inkscape:deskcolor="#505050"
     inkscape:document-units="mm"
     showgrid="false"
     inkscape:zoom="1.76315"
     inkscape:cx="8048.6628"
     inkscape:cy="155.97085"
     inkscape:window-width="2560"
     inkscape:window-height="1403"
     inkscape:window-x="0"
     inkscape:window-y="0"
     inkscape:window-maximized="1"
     inkscape:current-layer="g290238"
     showguides="true" />
  <defs
     id="defs2">
    <clipPath
       id="clipPath10667-36"
       clipPathUnits="userSpaceOnUse">
      <path
         sodipodi:nodetypes="ssssssssssssssssss"
         style="fill:#7bcf3e;fill-opacity:1;stroke:none"
         d="m 6926.3942,-16.111198 c -6.0323,-2.2e-5 -10.8899,3.303726 -10.8899,7.4061379 V 27.580368 c 0,4.102412 4.8576,7.401908 10.8899,7.401908 h 108.883 c 6.0324,0 10.8903,-3.299496 10.8903,-7.401908 V -8.7050601 c 0,-4.1024119 -4.8579,-7.4061379 -10.8903,-7.4061379 z m 0,57.153809 c -6.0323,0 -10.8899,3.303748 -10.8899,7.40616 v 7.406138 c 0,4.102412 4.8576,7.401886 10.8899,7.401886 h 108.883 c 6.0324,0 10.8903,-3.299474 10.8903,-7.401886 v -7.406138 c 0,-4.102412 -4.8579,-7.40616 -10.8903,-7.40616 z"
         id="path10669-7"
         inkscape:connector-curvature="0" />
    </clipPath>
    <clipPath
       id="clipPath1368-4-3"
       clipPathUnits="userSpaceOnUse">
      <path
         inkscape:connector-curvature="0"
         id="path1370-9-6"
         d="m -74.26666,269.02574 c -9.375235,0 -16.922606,7.54737 -16.922606,16.9226 0,19.33359 0.162339,54.34811 0.162339,54.34811 H -36.1905 c 9.37522,0 16.92259,-7.54739 16.92259,-16.92259 v -54.34812 z"
         style="opacity:1;vector-effect:none;fill:#db3279;fill-opacity:1;stroke:none;stroke-width:10;stroke-linecap:round;stroke-linejoin:miter;stroke-miterlimit:4;stroke-dasharray:none;stroke-dashoffset:0;stroke-opacity:0.956863;marker:none;paint-order:normal"
         sodipodi:nodetypes="sscsscs" />
    </clipPath>
    <clipPath
       id="clipPath1368-4-3-3"
       clipPathUnits="userSpaceOnUse">
      <path
         inkscape:connector-curvature="0"
         id="path1370-9-6-6"
         d="m -74.26666,269.02574 c -9.375235,0 -16.922606,7.54737 -16.922606,16.9226 0,19.33359 0.162339,54.34811 0.162339,54.34811 H -36.1905 c 9.37522,0 16.92259,-7.54739 16.92259,-16.92259 v -54.34812 z"
         style="opacity:1;vector-effect:none;fill:#db3279;fill-opacity:1;stroke:none;stroke-width:10;stroke-linecap:round;stroke-linejoin:miter;stroke-miterlimit:4;stroke-dasharray:none;stroke-dashoffset:0;stroke-opacity:0.956863;marker:none;paint-order:normal"
         sodipodi:nodetypes="sscsscs" />
    </clipPath>
    <clipPath
       id="clipPath1368-4-3-7"
       clipPathUnits="userSpaceOnUse">
      <path
         inkscape:connector-curvature="0"
         id="path1370-9-6-5"
         d="m -74.26666,269.02574 c -9.375235,0 -16.922606,7.54737 -16.922606,16.9226 0,19.33359 0.162339,54.34811 0.162339,54.34811 H -36.1905 c 9.37522,0 16.92259,-7.54739 16.92259,-16.92259 v -54.34812 z"
         style="opacity:1;vector-effect:none;fill:#db3279;fill-opacity:1;stroke:none;stroke-width:10;stroke-linecap:round;stroke-linejoin:miter;stroke-miterlimit:4;stroke-dasharray:none;stroke-dashoffset:0;stroke-opacity:0.956863;marker:none;paint-order:normal"
         sodipodi:nodetypes="sscsscs" />
    </clipPath>
  </defs>
  <g
     inkscape:label="Layer 1"
     inkscape:groupmode="layer"
     id="layer1"
     transform="translate(-1980)">
    <g
       id="g290238"
       transform="matrix(0.69218462,0,0,0.69218462,2049.1843,16.959675)">
      <g
         transform="matrix(0.50568351,0,0,0.50568351,117.69755,-474.437)"
         id="g26021"
         style="display:inline;stroke-width:0.523219">
        <g
           id="g26019"
           transform="translate(15.434597,40)"
           style="stroke-width:0.523219">
          <text
             xml:space="preserve"
             style="font-style:normal;font-weight:normal;font-size:18.1899px;line-height:0%;font-family:sans-serif;letter-spacing:0px;word-spacing:0px;fill:#294172;fill-opacity:1;stroke:none;stroke-width:0.558102"
             x="-396.92352"
             y="1063.8689"
             id="text26017"><tspan
               sodipodi:role="line"
               id="tspan26015"
               x="-396.92352"
               y="1063.8689"
               style="font-style:normal;font-variant:normal;font-weight:500;font-stretch:normal;font-size:30.8931px;line-height:125%;font-family:Montserrat;-inkscape-font-specification:'Montserrat Medium';text-align:start;writing-mode:lr-tb;text-anchor:start;fill:#294172;fill-opacity:1;stroke-width:0.558102">SILVERBLUE</tspan></text>
        </g>
      </g>
      <g
         id="g2239"
         style="fill:#51a2da;fill-opacity:1;stroke-width:1.10633"
         transform="matrix(0.31388904,0,0,0.31388904,-99.736274,22.919129)">
        <path
           d="m 96.729167,125.3578 c -3.595373,1.38954 -6.03555,4.80292 -6.045574,9.01632 -0.0105,4.41352 3.082522,10.10943 9.487987,10.15149 4.30838,0.0283 6.46291,-1.58283 7.62603,-2.6768 0.77153,-0.68369 0.8255,-1.87009 0.11854,-2.61974 -0.70838,-0.75106 -1.89761,-0.76906 -2.6268,-0.0385 -0.86818,0.81562 -2.14666,2.02425 -5.772524,1.62173 -1.555755,-0.17216 -3.227339,-1.43528 -3.785318,-2.40173 l 11.879842,-5.05073 c 0.9084,-0.40358 1.32573,-1.45803 0.94121,-2.37421 -2.12076,-4.1731 -5.88103,-7.92444 -11.823393,-5.62783 z m 7.456683,5.48995 -9.885684,4.22249 c -0.705852,-2.63428 2.187448,-5.73353 3.76568,-6.31024 2.366314,-0.86468 4.977204,0.10837 6.120004,2.08775 z"
           style="fill:#51a2da;fill-opacity:1;fill-rule:evenodd;stroke:none;stroke-width:1.1239"
           id="path2223"
           sodipodi:nodetypes="ssscccccccsccsc" />
        <path
           id="path2225"
           style="fill:#51a2da;fill-opacity:1;stroke-width:32.8741;stroke-linecap:round;stroke-linejoin:round"
           d="m 142.75841,124.51519 a 10.043481,9.9623653 0 0 0 -10.04462,9.9635 10.043481,9.9623653 0 0 0 10.04462,9.96093 10.043481,9.9623653 0 0 0 10.04204,-9.96093 10.043481,9.9623653 0 0 0 -10.04204,-9.9635 z m 0,3.73185 a 6.2822799,6.2315417 0 0 1 6.28239,6.23165 6.2822799,6.2315417 0 0 1 -6.28239,6.23165 6.2822799,6.2315417 0 0 1 -6.2824,-6.23165 6.2822799,6.2315417 0 0 1 6.2824,-6.23165 z" />
        <path
           style="color:#000000;font-style:normal;font-variant:normal;font-weight:normal;font-stretch:normal;font-size:medium;line-height:normal;font-family:sans-serif;font-variant-ligatures:normal;font-variant-position:normal;font-variant-caps:normal;font-variant-numeric:normal;font-variant-alternates:normal;font-feature-settings:normal;text-indent:0;text-align:start;text-decoration:none;text-decoration-line:none;text-decoration-style:solid;text-decoration-color:#000000;letter-spacing:normal;word-spacing:normal;text-transform:none;writing-mode:lr-tb;direction:ltr;text-orientation:mixed;dominant-baseline:auto;baseline-shift:baseline;text-anchor:start;white-space:normal;shape-padding:0;clip-rule:nonzero;display:inline;overflow:visible;visibility:visible;isolation:auto;mix-blend-mode:normal;color-interpolation:sRGB;color-interpolation-filters:linearRGB;solid-color:#000000;solid-opacity:1;vector-effect:none;fill:#51a2da;fill-opacity:1;fill-rule:nonzero;stroke:none;stroke-width:6.74328;stroke-linecap:round;stroke-linejoin:round;stroke-miterlimit:4;stroke-dasharray:none;stroke-dashoffset:0;stroke-opacity:1;color-rendering:auto;image-rendering:auto;shape-rendering:auto;text-rendering:auto;enable-background:accumulate"
           d="m 157.27615,124.6433 c -1.59548,0 -1.86142,1.31669 -1.85308,1.84776 v 15.98997 c -0.0436,1.03365 0.81202,1.89464 1.88299,1.89464 1.07096,0 1.92667,-0.86099 1.88297,-1.89464 0,0 0.0284,-5.94671 0,-9.75342 -0.0284,-3.80671 3.06985,-4.63179 4.14789,-4.63179 0.80054,0 1.44015,0.44589 2.0745,0.42206 0.94151,-0.0354 1.71459,-0.6668 1.71459,-1.77397 -0.0283,-1.78855 -2.22269,-2.04245 -3.84053,-2.00941 -1.61785,0.0331 -2.9842,0.52982 -4.16721,1.2363 0,0 -0.24663,-1.3275 -1.84212,-1.3275 z"
           id="path2227"
           inkscape:connector-curvature="0"
           sodipodi:nodetypes="zccsczcsczcz" />
        <g
           style="fill:#51a2da;fill-opacity:1;stroke-width:1.80156"
           transform="matrix(1.7992734,0,0,1.7380239,67.446745,-121.99926)"
           id="g2231">
          <path
             style="color:#000000;font-style:normal;font-variant:normal;font-weight:normal;font-stretch:normal;font-size:medium;line-height:normal;font-family:sans-serif;font-variant-ligatures:normal;font-variant-position:normal;font-variant-caps:normal;font-variant-numeric:normal;font-variant-alternates:normal;font-feature-settings:normal;text-indent:0;text-align:start;text-decoration:none;text-decoration-line:none;text-decoration-style:solid;text-decoration-color:#000000;letter-spacing:normal;word-spacing:normal;text-transform:none;writing-mode:lr-tb;direction:ltr;text-orientation:mixed;dominant-baseline:auto;baseline-shift:baseline;text-anchor:start;white-space:normal;shape-padding:0;clip-rule:nonzero;display:inline;overflow:visible;visibility:visible;opacity:1;isolation:auto;mix-blend-mode:normal;color-interpolation:sRGB;color-interpolation-filters:linearRGB;solid-color:#000000;solid-opacity:1;vector-effect:none;fill:#51a2da;fill-opacity:1;fill-rule:nonzero;stroke:none;stroke-width:3.81325;stroke-linecap:butt;stroke-linejoin:miter;stroke-miterlimit:4;stroke-dasharray:none;stroke-dashoffset:0;stroke-opacity:1;color-rendering:auto;image-rendering:auto;shape-rendering:auto;text-rendering:auto;enable-background:accumulate"
             d="m 60.088341,141.88715 c -1.393394,0 -2.398273,0.42786 -3.13079,0.97048 -1.110459,0.82303 0.08453,2.54386 1.19499,1.72083 0.505399,-0.37438 0.881229,-0.57413 1.9358,-0.57413 1.312636,0.0273 2.368475,0.53812 2.368475,1.55443 -0.703746,0.461 -3.763534,0.84205 -5.406566,1.8093 -1.643032,0.96724 -1.555977,2.18804 -1.555977,2.98017 0,1.73757 1.769154,2.90976 3.301505,2.90976 1.532352,0 2.182891,-0.33275 3.682046,-1.39626 v 0.30438 c -0.04845,1.45961 2.09629,1.45961 2.047845,0 v -6.23787 c 0.0066,-2.58701 -1.787667,-4.00169 -4.437328,-4.04109 z m 2.439505,5.75572 c -5.12e-4,0.68595 0.0092,0.8837 -0.009,1.56941 -0.004,0.8235 -0.503683,1.20524 -1.026925,1.52032 -0.523236,0.31508 -1.586095,0.59147 -2.201906,0.62167 -0.710308,0.0243 -1.65271,-0.1418 -1.702203,-1.01389 5.12e-4,-0.5264 0.246817,-0.85289 0.65127,-1.21646 0.957742,-0.74385 2.255423,-0.99358 4.288768,-1.48105 z"
             id="path2229"
             inkscape:connector-curvature="0"
             sodipodi:nodetypes="ccccczszcccccscscccss" />
        </g>
        <path
           style="font-style:normal;font-variant:normal;font-weight:bold;font-stretch:normal;font-size:medium;line-height:25px;font-family:Comfortaa;-inkscape-font-specification:Comfortaa;letter-spacing:0px;word-spacing:0px;fill:#51a2da;fill-opacity:1;stroke:none;stroke-width:1.69762px;stroke-linecap:butt;stroke-linejoin:miter;stroke-opacity:1"
           d="m 128.56291,116.32562 c -1.15198,-0.0687 -2.00005,1.07152 -1.82333,2.15483 v 8.36367 c -3.63641,-3.04884 -9.55863,-2.83682 -12.91558,0.5392 -3.39481,3.02498 -4.03972,8.51062 -1.57068,12.28835 1.81366,2.85198 5.13136,4.88571 8.55043,4.72423 2.14993,-0.0196 4.2827,-0.9455 5.93583,-2.31651 -0.16962,1.08236 0.66623,2.22553 1.82333,2.15604 1.13581,0.0506 2.01523,-1.07045 1.84088,-2.15482 -0.0197,-8.04418 0.0197,-16.08885 -0.0197,-24.13274 -0.0591,-0.90718 -0.92676,-1.65309 -1.83241,-1.62225 z m -7.9771,12.01866 c 3.28298,-0.0857 6.21551,2.86987 6.15377,6.12271 0.069,3.25587 -2.87355,6.20634 -6.15377,6.12273 -3.11889,0.0827 -5.97784,-2.55935 -6.1372,-5.65665 -0.33212,-3.1928 2.28898,-6.30485 5.49957,-6.55826 0.21182,-0.0207 0.42464,-0.0306 0.63763,-0.0306 z"
           id="path2233"
           inkscape:connector-curvature="0"
           sodipodi:nodetypes="ccccccccccccccccccc" />
        <g
           style="fill:#51a2da;fill-opacity:1;stroke-width:1.84795"
           transform="matrix(1.7361841,0,0,1.7118711,84.821887,-122.89238)"
           id="g2237">
          <path
             style="font-style:normal;font-variant:normal;font-weight:bold;font-stretch:normal;font-size:medium;line-height:25px;font-family:Comfortaa;-inkscape-font-specification:Comfortaa;letter-spacing:0px;word-spacing:0px;fill:#51a2da;fill-opacity:1;stroke:none;stroke-width:3.91148;stroke-linecap:butt;stroke-linejoin:miter;stroke-miterlimit:4;stroke-dasharray:none;stroke-opacity:1"
             d="m -2.5312666,143.62929 v 11.47421 c -0.003,1.4145 2.12023294,1.4145 2.11718234,0 v -7.65727 H 1.7635608 c 0.5092674,0 0.9446445,-0.37386 0.9446445,-0.9741 0,-0.60024 -0.4664127,-0.9648 -0.9446445,-0.9648 h -2.17764176 v -1.76487 c 0,-1.1293 0.8711995,-2.06801 2.62476896,-2.04625 0.6099425,0.008 0.8261384,0.1567 1.048907,0.29442 1.2161282,0.81695 2.3869012,-1.07509 1.1131122,-1.79886 -0.7812122,-0.48483 -1.5111158,-0.65571 -2.3819993,-0.65571 -2.74449516,0 -4.5059235,2.11423 -4.5219745,4.09323 z"
             id="path2235"
             inkscape:connector-curvature="0"
             sodipodi:nodetypes="ccccczcccscccc" />
        </g>
      </g>
      <g
         style="stroke-width:0.119482"
         clip-path="url(#clipPath1368-4-3-7)"
         id="g404-7"
         transform="matrix(0.54657083,0,0,0.54657083,-25.435517,-136.46817)">
        <g
           style="stroke-width:0.119482"
           id="g392-5">
          <rect
             y="245.25"
             x="-119.75"
             height="121"
             width="128"
             id="rect390-3"
             style="font-variation-settings:normal;opacity:1;vector-effect:none;fill:#51a2da;fill-opacity:1;stroke:none;stroke-width:0.932474;stroke-linecap:butt;stroke-linejoin:miter;stroke-miterlimit:4;stroke-dasharray:none;stroke-dashoffset:0;stroke-opacity:1;-inkscape-stroke:none;paint-order:markers fill stroke;stop-color:#000000;stop-opacity:1" />
        </g>
        <path
           inkscape:connector-curvature="0"
           id="path394-5"
           d="m -77.428193,253.67456 25.102291,54.09367 -55.507878,37.65343 -2.65165,-71.24101 z"
           style="font-variation-settings:normal;opacity:1;vector-effect:none;fill:#66abda;fill-opacity:1;stroke:none;stroke-width:0.932474;stroke-linecap:butt;stroke-linejoin:miter;stroke-miterlimit:4;stroke-dasharray:none;stroke-dashoffset:0;stroke-opacity:1;-inkscape-stroke:none;stop-color:#000000;stop-opacity:1" />
        <path
           sodipodi:nodetypes="ccccc"
           style="font-variation-settings:normal;opacity:1;vector-effect:none;fill:#4891c3;fill-opacity:1;stroke:none;stroke-width:0.932474;stroke-linecap:butt;stroke-linejoin:miter;stroke-miterlimit:4;stroke-dasharray:none;stroke-dashoffset:0;stroke-opacity:1;-inkscape-stroke:none;stop-color:#000000;stop-opacity:1"
           d="m -77.428193,253.67456 25.102291,54.09367 40.835421,-27.57717 -8.838834,-18.38478 z"
           id="path396-6"
           inkscape:connector-curvature="0" />
        <path
           inkscape:connector-curvature="0"
           id="path398-2"
           d="m -10.606602,315.01607 -41.7193,-7.24784 40.835421,-27.57717 7.424622,15.9099 z"
           style="font-variation-settings:normal;opacity:1;vector-effect:none;fill:#419cda;fill-opacity:1;stroke:none;stroke-width:0.932474;stroke-linecap:butt;stroke-linejoin:miter;stroke-miterlimit:4;stroke-dasharray:none;stroke-dashoffset:0;stroke-opacity:1;-inkscape-stroke:none;stop-color:#000000;stop-opacity:1"
           sodipodi:nodetypes="ccccc" />
        <path
           sodipodi:nodetypes="ccccc"
           style="font-variation-settings:normal;opacity:1;vector-effect:none;fill:#66abda;fill-opacity:1;stroke:none;stroke-width:0.932474;stroke-linecap:butt;stroke-linejoin:miter;stroke-miterlimit:4;stroke-dasharray:none;stroke-dashoffset:0;stroke-opacity:1;-inkscape-stroke:none;stop-color:#000000;stop-opacity:1"
           d="m -10.606602,315.01607 -41.7193,-7.24784 5.656859,17.50089 29.344932,-6.18719 z"
           id="path400-9"
           inkscape:connector-curvature="0" />
        <path
           inkscape:connector-curvature="0"
           id="path402-1"
           d="m -16.61701,343.47712 -45.078057,-9.36916 15.026024,-8.83884 29.344932,-6.18719 z"
           style="font-variation-settings:normal;opacity:1;vector-effect:none;fill:#4891c3;fill-opacity:1;stroke:none;stroke-width:0.932474;stroke-linecap:butt;stroke-linejoin:miter;stroke-miterlimit:4;stroke-dasharray:none;stroke-dashoffset:0;stroke-opacity:1;-inkscape-stroke:none;stop-color:#000000;stop-opacity:1"
           sodipodi:nodetypes="ccccc" />
      </g>
      <path
         inkscape:connector-curvature="0"
         d="m -64.269529,17.641781 c -2.318548,0 -4.228216,1.909369 -4.228216,4.227814 0,1.863065 1.234155,3.459959 2.921435,4.016348 v 14.326414 h 14.577786 c 0.556305,1.687511 2.152592,2.921686 4.015344,2.921686 2.318549,0 4.228383,-1.909918 4.228383,-4.228334 0,-2.31842 -1.909834,-4.22779 -4.228383,-4.22779 -1.79096,0 -3.33382,1.141713 -3.944887,2.729387 h -9.842519 l 11.823143,-11.741077 c 0.557808,0.273569 1.180729,0.4317 1.839045,0.4317 2.318214,2.7e-5 4.227548,-1.909889 4.227548,-4.228334 0,-2.318445 -1.909334,-4.227814 -4.227548,-4.227814 -2.318381,0 -4.227715,1.909396 -4.227715,4.227814 0,0.644542 0.151932,1.254984 0.414724,1.804075 l -11.849857,11.767394 v -9.625802 c 1.587438,-0.611041 2.729099,-2.154329 2.729099,-3.945667 0,-2.318418 -1.909167,-4.227814 -4.227382,-4.227814 z m 0,2.805028 c 0.802401,0 1.422651,0.620363 1.422651,1.422786 0,0.802423 -0.62025,1.423335 -1.422651,1.423335 -0.802401,2.7e-5 -1.423318,-0.620887 -1.423318,-1.423335 0,-0.802423 0.620917,-1.422786 1.423318,-1.422786 z m 17.161131,0 c 0.802401,0 1.42265,0.620363 1.42265,1.422786 0,0.802448 -0.620249,1.423362 -1.42265,1.423335 -0.802568,0 -1.422818,-0.620912 -1.422818,-1.423335 0,-0.802423 0.62025,-1.422786 1.422818,-1.422786 z m 0.126888,17.03611 c 0.802568,0 1.423319,0.620367 1.423319,1.42279 0,0.802419 -0.620751,1.423308 -1.423319,1.423308 -0.802401,0 -1.422651,-0.620889 -1.422651,-1.423308 0,-0.802423 0.62025,-1.42279 1.422651,-1.42279 z"
         style="color:#000000;font-style:normal;font-variant:normal;font-weight:normal;font-stretch:normal;font-size:medium;line-height:normal;font-family:sans-serif;font-variant-ligatures:normal;font-variant-position:normal;font-variant-caps:normal;font-variant-numeric:normal;font-variant-alternates:normal;font-variant-east-asian:normal;font-feature-settings:normal;font-variation-settings:normal;text-indent:0;text-align:start;text-decoration:none;text-decoration-line:none;text-decoration-style:solid;text-decoration-color:#000000;letter-spacing:normal;word-spacing:normal;text-transform:none;writing-mode:lr-tb;direction:ltr;text-orientation:mixed;dominant-baseline:auto;baseline-shift:baseline;text-anchor:start;white-space:normal;shape-padding:0;shape-margin:0;inline-size:0;clip-rule:nonzero;display:inline;overflow:visible;visibility:visible;isolation:auto;mix-blend-mode:normal;color-interpolation:sRGB;color-interpolation-filters:linearRGB;solid-color:#000000;solid-opacity:1;vector-effect:none;fill:#ffffff;fill-opacity:1;fill-rule:nonzero;stroke:none;stroke-width:3.82244;stroke-linecap:butt;stroke-linejoin:miter;stroke-miterlimit:4;stroke-dasharray:none;stroke-dashoffset:0;stroke-opacity:1;color-rendering:auto;image-rendering:auto;shape-rendering:auto;text-rendering:auto;enable-background:accumulate;stop-color:#000000"
         id="path442" />
    </g>
  </g>
</svg>
