<?xml version="1.0" encoding="UTF-8" standalone="no"?>
<!-- Created with Inkscape (http://www.inkscape.org/) -->

<svg
   width="100mm"
   height="100mm"
   viewBox="0 0 100 100"
   version="1.1"
   id="svg5"
   inkscape:version="1.2.1 (9c6d41e410, 2022-07-14)"
   sodipodi:docname="logos.svg"
   xmlns:inkscape="http://www.inkscape.org/namespaces/inkscape"
   xmlns:sodipodi="http://sodipodi.sourceforge.net/DTD/sodipodi-0.dtd"
   xmlns="http://www.w3.org/2000/svg"
   xmlns:svg="http://www.w3.org/2000/svg">
  <sodipodi:namedview
     id="namedview7"
     pagecolor="#505050"
     bordercolor="#ffffff"
     borderopacity="1"
     inkscape:showpageshadow="0"
     inkscape:pageopacity="0"
     inkscape:pagecheckerboard="1"
     inkscape:deskcolor="#505050"
     inkscape:document-units="mm"
     showgrid="false"
     inkscape:zoom="1.76315"
     inkscape:cx="8048.6628"
     inkscape:cy="155.97085"
     inkscape:window-width="2560"
     inkscape:window-height="1403"
     inkscape:window-x="0"
     inkscape:window-y="0"
     inkscape:window-maximized="1"
     inkscape:current-layer="layer1"
     showguides="true" />
  <defs
     id="defs2">
    <clipPath
       clipPathUnits="userSpaceOnUse"
       id="clipPath5359">
      <path
         style="fill:#e59728;fill-opacity:1;stroke:none;stroke-width:2.19694"
         d="m -138.68491,1041.3942 c -1.47318,0 -2.66046,0.9093 -2.66046,2.039 v 3.7822 h -6.21915 c -3.67283,0 -6.62844,2.8819 -6.62844,6.4657 v 6.469 c 0,3.5834 2.95561,6.4693 6.62844,6.4693 h 66.299726 c 3.672834,0 6.628434,-2.8861 6.628434,-6.4693 v -6.469 c 0,-3.5836 -2.9556,-6.4657 -6.628434,-6.4657 h -5.74921 v -3.7822 c 0,-1.1297 -1.187259,-2.039 -2.660465,-2.039 h -12.142761 c -1.47322,0 -2.66041,0.9093 -2.66041,2.039 v 3.7822 h -19.40409 v -3.7822 c 0,-1.1297 -1.1872,-2.039 -2.66051,-2.039 z m 0,29.1063 c -1.47318,0 -2.66046,0.9093 -2.66046,2.039 v 3.7822 h -6.21915 c -3.67283,0 -6.62844,2.8817 -6.62844,6.4654 v 6.4693 c 0,3.5836 2.95561,6.4693 6.62844,6.4693 h 66.299726 c 3.672834,0 6.628434,-2.8861 6.628434,-6.4693 v -6.4693 c 0,-3.5833 -2.9556,-6.4654 -6.628434,-6.4654 h -5.74921 v -3.7822 c 0,-1.1297 -1.187259,-2.039 -2.660465,-2.039 h -12.142761 c -1.47322,0 -2.66041,0.9093 -2.66041,2.039 v 3.7822 h -19.40409 v -3.7822 c 0,-1.1297 -1.1872,-2.039 -2.66051,-2.039 z m 0,29.1061 c -1.47318,0 -2.66046,0.909 -2.66046,2.0389 v 3.7823 h -6.95438 c -3.67283,0 -6.62843,2.8821 -6.62843,6.4654 v 6.4693 c 0,3.5835 2.9556,6.4693 6.62843,6.4693 h 66.299656 c 3.672909,0 6.628518,-2.8862 6.628518,-6.4693 v -6.4693 c 0,-3.5832 -2.955609,-6.4654 -6.628518,-6.4654 h -5.01391 v -3.7823 c 0,-1.1299 -1.187259,-2.0389 -2.660465,-2.0389 h -12.142761 c -1.47322,0 -2.66041,0.909 -2.66041,2.0389 v 3.7823 h -19.40409 v -3.7823 c 0,-1.1299 -1.1872,-2.0389 -2.66051,-2.0389 z"
         id="path5361"
         inkscape:connector-curvature="0"
         clip-path="none"
         sodipodi:nodetypes="sscsssssssscssssccssssscsssssssscssssccssssscsssssssscssssccsss" />
    </clipPath>
    <clipPath
       id="clipPath730907-6"
       clipPathUnits="userSpaceOnUse">
      <rect
         transform="matrix(0.8512957,-0.52468622,0.42635355,0.9045566,0,0)"
         ry="2.6821809"
         rx="2.1497016"
         y="309.97757"
         x="-523.25262"
         height="66.828056"
         width="108.03775"
         id="rect730909-7"
         style="fill:#ffffff;fill-opacity:1;stroke:none;stroke-width:4.70222;stroke-linecap:round;stroke-linejoin:round;stroke-dashoffset:6" />
    </clipPath>
  </defs>
  <g
     inkscape:label="Layer 1"
     inkscape:groupmode="layer"
     id="layer1"
     transform="translate(-1210)">
    <g
       id="g290124"
       transform="matrix(1.1687175,0,0,1.1687175,1100.4922,-111.8665)">
      <g
         style="display:inline;stroke-width:0.604663"
         clip-path="url(#clipPath5359)"
         id="g823272"
         transform="matrix(-0.37872494,0,0,0.37872494,80.564143,-286.65595)"
         inkscape:export-filename="/home/duffy/Desktop/_delete_/fedora-modular_comp2.png"
         inkscape:export-xdpi="90"
         inkscape:export-ydpi="90">
        <g
           style="fill:#e59728;fill-opacity:1;stroke-width:0.259182"
           id="g823140"
           transform="matrix(-1.9032708,-0.86701195,0.89708732,-1.4067142,-1085.0438,1646.3156)"
           clip-path="url(#clipPath730907-6)">
          <g
             id="g823074"
             inkscape:label="Delaunay"
             transform="translate(-192.33305,47.376155)"
             style="fill:#e59728;stroke:none;stroke-width:0.259182">
            <path
               id="path823012"
               style="fill:#e48f2c;stroke:none;stroke-width:0.259182"
               d="m -78.995148,455.629 50.713394,-5.2706 -65.202934,4.78271 z"
               inkscape:connector-curvature="0" />
            <path
               id="path823014"
               style="fill:#e49928;stroke:none;stroke-width:0.259182"
               d="m -78.995148,455.629 28.979088,3.70236 21.734306,-8.97296 z"
               inkscape:connector-curvature="0" />
            <path
               id="path823016"
               style="fill:#e59b29;stroke:none;stroke-width:0.259182"
               d="m -78.995148,455.629 14.48954,18.14026 14.489548,-14.4379 z"
               inkscape:connector-curvature="0" />
            <path
               id="path823018"
               style="fill:#e49529;stroke:none;stroke-width:0.259182"
               d="m -50.01606,459.33136 28.97908,3.00763 -7.244774,-11.98059 z"
               inkscape:connector-curvature="0" />
            <path
               id="path823020"
               style="fill:#e49e2b;stroke:none;stroke-width:0.259182"
               d="m -78.995148,455.629 7.244774,25.58755 7.244766,-7.44729 z"
               inkscape:connector-curvature="0" />
            <path
               id="path823022"
               style="fill:#e38e29;stroke:none;stroke-width:0.259182"
               d="m -93.484688,455.14111 21.734314,26.07544 -7.244774,-25.58755 z"
               inkscape:connector-curvature="0" />
            <path
               id="path823024"
               style="fill:#e4962c;stroke:none;stroke-width:0.259182"
               d="m -71.750374,481.21655 14.48954,7.56958 -7.244774,-15.01687 z"
               inkscape:connector-curvature="0" />
            <path
               id="path823026"
               style="fill:#e39f2e;stroke:none;stroke-width:0.259182"
               d="m -57.260834,488.78613 7.244774,-29.45477 -14.489548,14.4379 z"
               inkscape:connector-curvature="0" />
            <path
               id="path823028"
               style="fill:#e39129;stroke:none;stroke-width:0.259182"
               d="m -57.260834,488.78613 36.223854,-26.44714 -28.97908,-3.00763 z"
               inkscape:connector-curvature="0" />
            <path
               id="path823030"
               style="fill:#e29d28;stroke:none;stroke-width:0.259182"
               d="m -57.260834,488.78613 43.468628,9.44757 -7.244774,-35.89471 z"
               inkscape:connector-curvature="0" />
            <path
               id="path823032"
               style="fill:#e5932a;stroke:none;stroke-width:0.259182"
               d="M 0.6973345,507.29727 -21.03698,462.33899 -13.792206,498.2337 Z"
               inkscape:connector-curvature="0" />
            <path
               id="path823034"
               style="fill:#e5932a;stroke:none;stroke-width:0.259182"
               d="m -115.219,509.53561 21.734312,-54.3945 -28.979092,51.60743 z"
               inkscape:connector-curvature="0" />
            <path
               id="path823036"
               style="fill:#e5982a;stroke:none;stroke-width:0.259182"
               d="m -115.219,509.53561 43.468626,-28.31906 -21.734314,-26.07544 z"
               inkscape:connector-curvature="0" />
            <path
               id="path823038"
               style="fill:#e5992a;stroke:none;stroke-width:0.259182"
               d="m -129.70856,535.66724 7.24478,-28.9187 -14.48954,23.91558 z"
               inkscape:connector-curvature="0" />
            <path
               id="path823040"
               style="fill:#e59829;stroke:none;stroke-width:0.259182"
               d="m -129.70856,535.66724 14.48956,-26.13163 -7.24478,-2.78707 z"
               inkscape:connector-curvature="0" />
            <path
               id="path823042"
               style="fill:#e48e28;stroke:none;stroke-width:0.259182"
               d="m -100.72946,538.91125 28.979086,-57.6947 -43.468626,28.31906 z"
               inkscape:connector-curvature="0" />
            <path
               id="path823044"
               style="fill:#e2a62d;stroke:none;stroke-width:0.259182"
               d="m -86.239922,544.33649 14.489548,-63.11994 -28.979086,57.6947 z"
               inkscape:connector-curvature="0" />
            <path
               id="path823046"
               style="fill:#e4992c;stroke:none;stroke-width:0.259182"
               d="m -129.70856,535.66724 28.9791,3.24401 -14.48954,-29.37564 z"
               inkscape:connector-curvature="0" />
            <path
               id="path823048"
               style="fill:#e2922c;stroke:none;stroke-width:0.259182"
               d="m -86.239922,544.33649 28.979088,-55.55036 -14.48954,-7.56958 z"
               inkscape:connector-curvature="0" />
            <path
               id="path823050"
               style="fill:#e39d2a;stroke:none;stroke-width:0.259182"
               d="m -42.771294,554.57153 28.979088,-56.33783 -43.468628,-9.44757 z"
               inkscape:connector-curvature="0" />
            <path
               id="path823052"
               style="fill:#e18429;stroke:none;stroke-width:0.259182"
               d="m -86.239922,544.33649 43.468628,10.23504 -14.48954,-65.7854 z"
               inkscape:connector-curvature="0" />
            <path
               id="path823054"
               style="fill:#e5ae2d;stroke:none;stroke-width:0.259182"
               d="M -42.771294,554.57153 0.6973345,507.29727 -13.792206,498.2337 Z"
               inkscape:connector-curvature="0" />
            <path
               id="path823056"
               style="fill:#e29c2a;stroke:none;stroke-width:0.259182"
               d="M -35.52652,559.67303 0.6973345,507.29727 -42.771294,554.57153 Z"
               inkscape:connector-curvature="0" />
            <path
               id="path823058"
               style="fill:#e4a12c;stroke:none;stroke-width:0.259182"
               d="m -129.70856,535.66724 21.73432,31.61224 7.24478,-28.36823 z"
               inkscape:connector-curvature="0" />
            <path
               id="path823060"
               style="fill:#e39428;stroke:none;stroke-width:0.259182"
               d="m -107.97424,567.27948 21.734318,-22.94299 -14.489538,-5.42524 z"
               inkscape:connector-curvature="0" />
            <path
               id="path823062"
               style="fill:#e3a030;stroke:none;stroke-width:0.259182"
               d="M -6.5474322,577.82184 0.6973345,507.29727 -35.52652,559.67303 Z"
               inkscape:connector-curvature="0" />
            <path
               id="path823064"
               style="fill:#e08f27;stroke:none;stroke-width:0.259182"
               d="m -107.97424,567.27948 65.202946,-12.70795 -43.468628,-10.23504 z"
               inkscape:connector-curvature="0" />
            <path
               id="path823066"
               style="fill:#e1842a;stroke:none;stroke-width:0.259182"
               d="m -107.97424,567.27948 72.44772,-7.60645 -7.244774,-5.1015 z"
               inkscape:connector-curvature="0" />
            <path
               id="path823068"
               style="fill:#e5922b;stroke:none;stroke-width:0.259182"
               d="m -136.95332,530.66412 28.97908,36.61536 -21.73432,-31.61224 z"
               inkscape:connector-curvature="0" />
            <path
               id="path823070"
               style="fill:#e1a828;stroke:none;stroke-width:0.259182"
               d="M -107.97424,567.27948 -6.5474322,577.82184 -35.52652,559.67303 Z"
               inkscape:connector-curvature="0" />
            <path
               id="path823072"
               style="fill:#e59c26;stroke:none;stroke-width:0.259182"
               d="m -93.484688,455.14111 -43.468632,75.52301 14.48954,-23.91558 z"
               inkscape:connector-curvature="0" />
          </g>
          <g
             style="fill:#e59728;stroke:none;stroke-width:0.259182"
             transform="translate(-192.33305,47.376155)"
             inkscape:label="Delaunay"
             id="g823138">
            <path
               inkscape:connector-curvature="0"
               d="m -78.995148,455.629 50.713394,-5.2706 -65.202934,4.78271 z"
               style="fill:#e48f2c;stroke:none;stroke-width:0.259182"
               id="path823076" />
            <path
               inkscape:connector-curvature="0"
               d="m -78.995148,455.629 28.979088,3.70236 21.734306,-8.97296 z"
               style="fill:#e49928;stroke:none;stroke-width:0.259182"
               id="path823078" />
            <path
               inkscape:connector-curvature="0"
               d="m -78.995148,455.629 14.48954,18.14026 14.489548,-14.4379 z"
               style="fill:#e59b29;stroke:none;stroke-width:0.259182"
               id="path823080" />
            <path
               inkscape:connector-curvature="0"
               d="m -50.01606,459.33136 28.97908,3.00763 -7.244774,-11.98059 z"
               style="fill:#e49529;stroke:none;stroke-width:0.259182"
               id="path823082" />
            <path
               inkscape:connector-curvature="0"
               d="m -78.995148,455.629 7.244774,25.58755 7.244766,-7.44729 z"
               style="fill:#e49e2b;stroke:none;stroke-width:0.259182"
               id="path823084" />
            <path
               inkscape:connector-curvature="0"
               d="m -93.484688,455.14111 21.734314,26.07544 -7.244774,-25.58755 z"
               style="fill:#e38e29;stroke:none;stroke-width:0.259182"
               id="path823086" />
            <path
               inkscape:connector-curvature="0"
               d="m -71.750374,481.21655 14.48954,7.56958 -7.244774,-15.01687 z"
               style="fill:#e4962c;stroke:none;stroke-width:0.259182"
               id="path823088" />
            <path
               inkscape:connector-curvature="0"
               d="m -57.260834,488.78613 7.244774,-29.45477 -14.489548,14.4379 z"
               style="fill:#e39f2e;stroke:none;stroke-width:0.259182"
               id="path823090" />
            <path
               inkscape:connector-curvature="0"
               d="m -57.260834,488.78613 36.223854,-26.44714 -28.97908,-3.00763 z"
               style="fill:#e39129;stroke:none;stroke-width:0.259182"
               id="path823092" />
            <path
               inkscape:connector-curvature="0"
               d="m -57.260834,488.78613 43.468628,9.44757 -7.244774,-35.89471 z"
               style="fill:#e29d28;stroke:none;stroke-width:0.259182"
               id="path823094" />
            <path
               inkscape:connector-curvature="0"
               d="M 0.6973345,507.29727 -21.03698,462.33899 -13.792206,498.2337 Z"
               style="fill:#e5932a;stroke:none;stroke-width:0.259182"
               id="path823096" />
            <path
               inkscape:connector-curvature="0"
               d="m -115.219,509.53561 21.734312,-54.3945 -28.979092,51.60743 z"
               style="fill:#e5932a;stroke:none;stroke-width:0.259182"
               id="path823098" />
            <path
               inkscape:connector-curvature="0"
               d="m -115.219,509.53561 43.468626,-28.31906 -21.734314,-26.07544 z"
               style="fill:#e5982a;stroke:none;stroke-width:0.259182"
               id="path823100" />
            <path
               inkscape:connector-curvature="0"
               d="m -129.70856,535.66724 7.24478,-28.9187 -14.48954,23.91558 z"
               style="fill:#e5992a;stroke:none;stroke-width:0.259182"
               id="path823102" />
            <path
               inkscape:connector-curvature="0"
               d="m -129.70856,535.66724 14.48956,-26.13163 -7.24478,-2.78707 z"
               style="fill:#e59829;stroke:none;stroke-width:0.259182"
               id="path823104" />
            <path
               inkscape:connector-curvature="0"
               d="m -100.72946,538.91125 28.979086,-57.6947 -43.468626,28.31906 z"
               style="fill:#e48e28;stroke:none;stroke-width:0.259182"
               id="path823106" />
            <path
               inkscape:connector-curvature="0"
               d="m -86.239922,544.33649 14.489548,-63.11994 -28.979086,57.6947 z"
               style="fill:#e2a62d;stroke:none;stroke-width:0.259182"
               id="path823108" />
            <path
               inkscape:connector-curvature="0"
               d="m -129.70856,535.66724 28.9791,3.24401 -14.48954,-29.37564 z"
               style="fill:#e4992c;stroke:none;stroke-width:0.259182"
               id="path823110" />
            <path
               inkscape:connector-curvature="0"
               d="m -86.239922,544.33649 28.979088,-55.55036 -14.48954,-7.56958 z"
               style="fill:#e2922c;stroke:none;stroke-width:0.259182"
               id="path823112" />
            <path
               inkscape:connector-curvature="0"
               d="m -42.771294,554.57153 28.979088,-56.33783 -43.468628,-9.44757 z"
               style="fill:#e39d2a;stroke:none;stroke-width:0.259182"
               id="path823114" />
            <path
               inkscape:connector-curvature="0"
               d="m -86.239922,544.33649 43.468628,10.23504 -14.48954,-65.7854 z"
               style="fill:#e18429;stroke:none;stroke-width:0.259182"
               id="path823116" />
            <path
               inkscape:connector-curvature="0"
               d="M -42.771294,554.57153 0.6973345,507.29727 -13.792206,498.2337 Z"
               style="fill:#e5ae2d;stroke:none;stroke-width:0.259182"
               id="path823118" />
            <path
               inkscape:connector-curvature="0"
               d="M -35.52652,559.67303 0.6973345,507.29727 -42.771294,554.57153 Z"
               style="fill:#e29c2a;stroke:none;stroke-width:0.259182"
               id="path823120" />
            <path
               inkscape:connector-curvature="0"
               d="m -129.70856,535.66724 21.73432,31.61224 7.24478,-28.36823 z"
               style="fill:#e4a12c;stroke:none;stroke-width:0.259182"
               id="path823122" />
            <path
               inkscape:connector-curvature="0"
               d="m -107.97424,567.27948 21.734318,-22.94299 -14.489538,-5.42524 z"
               style="fill:#e39428;stroke:none;stroke-width:0.259182"
               id="path823124" />
            <path
               inkscape:connector-curvature="0"
               d="M -6.5474322,577.82184 0.6973345,507.29727 -35.52652,559.67303 Z"
               style="fill:#e3a030;stroke:none;stroke-width:0.259182"
               id="path823126" />
            <path
               inkscape:connector-curvature="0"
               d="m -107.97424,567.27948 65.202946,-12.70795 -43.468628,-10.23504 z"
               style="fill:#e08f27;stroke:none;stroke-width:0.259182"
               id="path823128" />
            <path
               inkscape:connector-curvature="0"
               d="m -107.97424,567.27948 72.44772,-7.60645 -7.244774,-5.1015 z"
               style="fill:#e1842a;stroke:none;stroke-width:0.259182"
               id="path823130" />
            <path
               inkscape:connector-curvature="0"
               d="m -136.95332,530.66412 28.97908,36.61536 -21.73432,-31.61224 z"
               style="fill:#e5922b;stroke:none;stroke-width:0.259182"
               id="path823132" />
            <path
               inkscape:connector-curvature="0"
               d="M -107.97424,567.27948 -6.5474322,577.82184 -35.52652,559.67303 Z"
               style="fill:#e1a828;stroke:none;stroke-width:0.259182"
               id="path823134" />
            <path
               inkscape:connector-curvature="0"
               d="m -93.484688,455.14111 -43.468632,75.52301 14.48954,-23.91558 z"
               style="fill:#e59c26;stroke:none;stroke-width:0.259182"
               id="path823136" />
          </g>
        </g>
        <g
           clip-path="url(#clipPath730907-6)"
           transform="matrix(1.9032708,0.86701195,-0.89708732,1.4067142,760.98133,518.54462)"
           id="g823270"
           style="fill:#e59728;fill-opacity:1;stroke-width:0.259182">
          <g
             style="fill:#e59728;stroke:none;stroke-width:0.259182"
             transform="translate(-192.33305,47.376155)"
             inkscape:label="Delaunay"
             id="g823204">
            <path
               inkscape:connector-curvature="0"
               d="m -78.995148,455.629 50.713394,-5.2706 -65.202934,4.78271 z"
               style="fill:#e48f2c;stroke:none;stroke-width:0.259182"
               id="path823142" />
            <path
               inkscape:connector-curvature="0"
               d="m -78.995148,455.629 28.979088,3.70236 21.734306,-8.97296 z"
               style="fill:#e49928;stroke:none;stroke-width:0.259182"
               id="path823144" />
            <path
               inkscape:connector-curvature="0"
               d="m -78.995148,455.629 14.48954,18.14026 14.489548,-14.4379 z"
               style="fill:#e59b29;stroke:none;stroke-width:0.259182"
               id="path823146" />
            <path
               inkscape:connector-curvature="0"
               d="m -50.01606,459.33136 28.97908,3.00763 -7.244774,-11.98059 z"
               style="fill:#e49529;stroke:none;stroke-width:0.259182"
               id="path823148" />
            <path
               inkscape:connector-curvature="0"
               d="m -78.995148,455.629 7.244774,25.58755 7.244766,-7.44729 z"
               style="fill:#e49e2b;stroke:none;stroke-width:0.259182"
               id="path823150" />
            <path
               inkscape:connector-curvature="0"
               d="m -93.484688,455.14111 21.734314,26.07544 -7.244774,-25.58755 z"
               style="fill:#e38e29;stroke:none;stroke-width:0.259182"
               id="path823152" />
            <path
               inkscape:connector-curvature="0"
               d="m -71.750374,481.21655 14.48954,7.56958 -7.244774,-15.01687 z"
               style="fill:#e4962c;stroke:none;stroke-width:0.259182"
               id="path823154" />
            <path
               inkscape:connector-curvature="0"
               d="m -57.260834,488.78613 7.244774,-29.45477 -14.489548,14.4379 z"
               style="fill:#e39f2e;stroke:none;stroke-width:0.259182"
               id="path823156" />
            <path
               inkscape:connector-curvature="0"
               d="m -57.260834,488.78613 36.223854,-26.44714 -28.97908,-3.00763 z"
               style="fill:#e39129;stroke:none;stroke-width:0.259182"
               id="path823158" />
            <path
               inkscape:connector-curvature="0"
               d="m -57.260834,488.78613 43.468628,9.44757 -7.244774,-35.89471 z"
               style="fill:#e29d28;stroke:none;stroke-width:0.259182"
               id="path823160" />
            <path
               inkscape:connector-curvature="0"
               d="M 0.6973345,507.29727 -21.03698,462.33899 -13.792206,498.2337 Z"
               style="fill:#e5932a;stroke:none;stroke-width:0.259182"
               id="path823162" />
            <path
               inkscape:connector-curvature="0"
               d="m -115.219,509.53561 21.734312,-54.3945 -28.979092,51.60743 z"
               style="fill:#e5932a;stroke:none;stroke-width:0.259182"
               id="path823164" />
            <path
               inkscape:connector-curvature="0"
               d="m -115.219,509.53561 43.468626,-28.31906 -21.734314,-26.07544 z"
               style="fill:#e5982a;stroke:none;stroke-width:0.259182"
               id="path823166" />
            <path
               inkscape:connector-curvature="0"
               d="m -129.70856,535.66724 7.24478,-28.9187 -14.48954,23.91558 z"
               style="fill:#e5992a;stroke:none;stroke-width:0.259182"
               id="path823168" />
            <path
               inkscape:connector-curvature="0"
               d="m -129.70856,535.66724 14.48956,-26.13163 -7.24478,-2.78707 z"
               style="fill:#e59829;stroke:none;stroke-width:0.259182"
               id="path823170" />
            <path
               inkscape:connector-curvature="0"
               d="m -100.72946,538.91125 28.979086,-57.6947 -43.468626,28.31906 z"
               style="fill:#e48e28;stroke:none;stroke-width:0.259182"
               id="path823172" />
            <path
               inkscape:connector-curvature="0"
               d="m -86.239922,544.33649 14.489548,-63.11994 -28.979086,57.6947 z"
               style="fill:#e2a62d;stroke:none;stroke-width:0.259182"
               id="path823174" />
            <path
               inkscape:connector-curvature="0"
               d="m -129.70856,535.66724 28.9791,3.24401 -14.48954,-29.37564 z"
               style="fill:#e4992c;stroke:none;stroke-width:0.259182"
               id="path823176" />
            <path
               inkscape:connector-curvature="0"
               d="m -86.239922,544.33649 28.979088,-55.55036 -14.48954,-7.56958 z"
               style="fill:#e2922c;stroke:none;stroke-width:0.259182"
               id="path823178" />
            <path
               inkscape:connector-curvature="0"
               d="m -42.771294,554.57153 28.979088,-56.33783 -43.468628,-9.44757 z"
               style="fill:#e39d2a;stroke:none;stroke-width:0.259182"
               id="path823180" />
            <path
               inkscape:connector-curvature="0"
               d="m -86.239922,544.33649 43.468628,10.23504 -14.48954,-65.7854 z"
               style="fill:#e18429;stroke:none;stroke-width:0.259182"
               id="path823182" />
            <path
               inkscape:connector-curvature="0"
               d="M -42.771294,554.57153 0.6973345,507.29727 -13.792206,498.2337 Z"
               style="fill:#e5ae2d;stroke:none;stroke-width:0.259182"
               id="path823184" />
            <path
               inkscape:connector-curvature="0"
               d="M -35.52652,559.67303 0.6973345,507.29727 -42.771294,554.57153 Z"
               style="fill:#e29c2a;stroke:none;stroke-width:0.259182"
               id="path823186" />
            <path
               inkscape:connector-curvature="0"
               d="m -129.70856,535.66724 21.73432,31.61224 7.24478,-28.36823 z"
               style="fill:#e4a12c;stroke:none;stroke-width:0.259182"
               id="path823188" />
            <path
               inkscape:connector-curvature="0"
               d="m -107.97424,567.27948 21.734318,-22.94299 -14.489538,-5.42524 z"
               style="fill:#e39428;stroke:none;stroke-width:0.259182"
               id="path823190" />
            <path
               inkscape:connector-curvature="0"
               d="M -6.5474322,577.82184 0.6973345,507.29727 -35.52652,559.67303 Z"
               style="fill:#e3a030;stroke:none;stroke-width:0.259182"
               id="path823192" />
            <path
               inkscape:connector-curvature="0"
               d="m -107.97424,567.27948 65.202946,-12.70795 -43.468628,-10.23504 z"
               style="fill:#e08f27;stroke:none;stroke-width:0.259182"
               id="path823194" />
            <path
               inkscape:connector-curvature="0"
               d="m -107.97424,567.27948 72.44772,-7.60645 -7.244774,-5.1015 z"
               style="fill:#e1842a;stroke:none;stroke-width:0.259182"
               id="path823196" />
            <path
               inkscape:connector-curvature="0"
               d="m -136.95332,530.66412 28.97908,36.61536 -21.73432,-31.61224 z"
               style="fill:#e5922b;stroke:none;stroke-width:0.259182"
               id="path823198" />
            <path
               inkscape:connector-curvature="0"
               d="M -107.97424,567.27948 -6.5474322,577.82184 -35.52652,559.67303 Z"
               style="fill:#e1a828;stroke:none;stroke-width:0.259182"
               id="path823200" />
            <path
               inkscape:connector-curvature="0"
               d="m -93.484688,455.14111 -43.468632,75.52301 14.48954,-23.91558 z"
               style="fill:#e59c26;stroke:none;stroke-width:0.259182"
               id="path823202" />
          </g>
          <g
             id="g823268"
             inkscape:label="Delaunay"
             transform="translate(-192.33305,47.376155)"
             style="fill:#e59728;stroke:none;stroke-width:0.259182">
            <path
               id="path823206"
               style="fill:#e48f2c;stroke:none;stroke-width:0.259182"
               d="m -78.995148,455.629 50.713394,-5.2706 -65.202934,4.78271 z"
               inkscape:connector-curvature="0" />
            <path
               id="path823208"
               style="fill:#e49928;stroke:none;stroke-width:0.259182"
               d="m -78.995148,455.629 28.979088,3.70236 21.734306,-8.97296 z"
               inkscape:connector-curvature="0" />
            <path
               id="path823210"
               style="fill:#e59b29;stroke:none;stroke-width:0.259182"
               d="m -78.995148,455.629 14.48954,18.14026 14.489548,-14.4379 z"
               inkscape:connector-curvature="0" />
            <path
               id="path823212"
               style="fill:#e49529;stroke:none;stroke-width:0.259182"
               d="m -50.01606,459.33136 28.97908,3.00763 -7.244774,-11.98059 z"
               inkscape:connector-curvature="0" />
            <path
               id="path823214"
               style="fill:#e49e2b;stroke:none;stroke-width:0.259182"
               d="m -78.995148,455.629 7.244774,25.58755 7.244766,-7.44729 z"
               inkscape:connector-curvature="0" />
            <path
               id="path823216"
               style="fill:#e38e29;stroke:none;stroke-width:0.259182"
               d="m -93.484688,455.14111 21.734314,26.07544 -7.244774,-25.58755 z"
               inkscape:connector-curvature="0" />
            <path
               id="path823218"
               style="fill:#e4962c;stroke:none;stroke-width:0.259182"
               d="m -71.750374,481.21655 14.48954,7.56958 -7.244774,-15.01687 z"
               inkscape:connector-curvature="0" />
            <path
               id="path823220"
               style="fill:#e39f2e;stroke:none;stroke-width:0.259182"
               d="m -57.260834,488.78613 7.244774,-29.45477 -14.489548,14.4379 z"
               inkscape:connector-curvature="0" />
            <path
               id="path823222"
               style="fill:#e39129;stroke:none;stroke-width:0.259182"
               d="m -57.260834,488.78613 36.223854,-26.44714 -28.97908,-3.00763 z"
               inkscape:connector-curvature="0" />
            <path
               id="path823224"
               style="fill:#e29d28;stroke:none;stroke-width:0.259182"
               d="m -57.260834,488.78613 43.468628,9.44757 -7.244774,-35.89471 z"
               inkscape:connector-curvature="0" />
            <path
               id="path823226"
               style="fill:#e5932a;stroke:none;stroke-width:0.259182"
               d="M 0.6973345,507.29727 -21.03698,462.33899 -13.792206,498.2337 Z"
               inkscape:connector-curvature="0" />
            <path
               id="path823228"
               style="fill:#e5932a;stroke:none;stroke-width:0.259182"
               d="m -115.219,509.53561 21.734312,-54.3945 -28.979092,51.60743 z"
               inkscape:connector-curvature="0" />
            <path
               id="path823230"
               style="fill:#e5982a;stroke:none;stroke-width:0.259182"
               d="m -115.219,509.53561 43.468626,-28.31906 -21.734314,-26.07544 z"
               inkscape:connector-curvature="0" />
            <path
               id="path823232"
               style="fill:#e5992a;stroke:none;stroke-width:0.259182"
               d="m -129.70856,535.66724 7.24478,-28.9187 -14.48954,23.91558 z"
               inkscape:connector-curvature="0" />
            <path
               id="path823234"
               style="fill:#e59829;stroke:none;stroke-width:0.259182"
               d="m -129.70856,535.66724 14.48956,-26.13163 -7.24478,-2.78707 z"
               inkscape:connector-curvature="0" />
            <path
               id="path823236"
               style="fill:#e48e28;stroke:none;stroke-width:0.259182"
               d="m -100.72946,538.91125 28.979086,-57.6947 -43.468626,28.31906 z"
               inkscape:connector-curvature="0" />
            <path
               id="path823238"
               style="fill:#e2a62d;stroke:none;stroke-width:0.259182"
               d="m -86.239922,544.33649 14.489548,-63.11994 -28.979086,57.6947 z"
               inkscape:connector-curvature="0" />
            <path
               id="path823240"
               style="fill:#e4992c;stroke:none;stroke-width:0.259182"
               d="m -129.70856,535.66724 28.9791,3.24401 -14.48954,-29.37564 z"
               inkscape:connector-curvature="0" />
            <path
               id="path823242"
               style="fill:#e2922c;stroke:none;stroke-width:0.259182"
               d="m -86.239922,544.33649 28.979088,-55.55036 -14.48954,-7.56958 z"
               inkscape:connector-curvature="0" />
            <path
               id="path823244"
               style="fill:#e39d2a;stroke:none;stroke-width:0.259182"
               d="m -42.771294,554.57153 28.979088,-56.33783 -43.468628,-9.44757 z"
               inkscape:connector-curvature="0" />
            <path
               id="path823246"
               style="fill:#e18429;stroke:none;stroke-width:0.259182"
               d="m -86.239922,544.33649 43.468628,10.23504 -14.48954,-65.7854 z"
               inkscape:connector-curvature="0" />
            <path
               id="path823248"
               style="fill:#e5ae2d;stroke:none;stroke-width:0.259182"
               d="M -42.771294,554.57153 0.6973345,507.29727 -13.792206,498.2337 Z"
               inkscape:connector-curvature="0" />
            <path
               id="path823250"
               style="fill:#e29c2a;stroke:none;stroke-width:0.259182"
               d="M -35.52652,559.67303 0.6973345,507.29727 -42.771294,554.57153 Z"
               inkscape:connector-curvature="0" />
            <path
               id="path823252"
               style="fill:#e4a12c;stroke:none;stroke-width:0.259182"
               d="m -129.70856,535.66724 21.73432,31.61224 7.24478,-28.36823 z"
               inkscape:connector-curvature="0" />
            <path
               id="path823254"
               style="fill:#e39428;stroke:none;stroke-width:0.259182"
               d="m -107.97424,567.27948 21.734318,-22.94299 -14.489538,-5.42524 z"
               inkscape:connector-curvature="0" />
            <path
               id="path823256"
               style="fill:#e3a030;stroke:none;stroke-width:0.259182"
               d="M -6.5474322,577.82184 0.6973345,507.29727 -35.52652,559.67303 Z"
               inkscape:connector-curvature="0" />
            <path
               id="path823258"
               style="fill:#e08f27;stroke:none;stroke-width:0.259182"
               d="m -107.97424,567.27948 65.202946,-12.70795 -43.468628,-10.23504 z"
               inkscape:connector-curvature="0" />
            <path
               id="path823260"
               style="fill:#e1842a;stroke:none;stroke-width:0.259182"
               d="m -107.97424,567.27948 72.44772,-7.60645 -7.244774,-5.1015 z"
               inkscape:connector-curvature="0" />
            <path
               id="path823262"
               style="fill:#e5922b;stroke:none;stroke-width:0.259182"
               d="m -136.95332,530.66412 28.97908,36.61536 -21.73432,-31.61224 z"
               inkscape:connector-curvature="0" />
            <path
               id="path823264"
               style="fill:#e1a828;stroke:none;stroke-width:0.259182"
               d="M -107.97424,567.27948 -6.5474322,577.82184 -35.52652,559.67303 Z"
               inkscape:connector-curvature="0" />
            <path
               id="path823266"
               style="fill:#e59c26;stroke:none;stroke-width:0.259182"
               d="m -93.484688,455.14111 -43.468632,75.52301 14.48954,-23.91558 z"
               inkscape:connector-curvature="0" />
          </g>
        </g>
      </g>
      <g
         style="display:inline;stroke-width:0.604663"
         id="g6271"
         transform="matrix(0.43757162,0,0,0.43757162,206.07129,-313.87735)">
        <g
           transform="translate(15.434597,40)"
           id="g6269"
           style="stroke-width:0.604663">
          <text
             id="text6249"
             y="1063.8689"
             x="-236.92352"
             style="font-style:normal;font-weight:normal;font-size:18.1899px;line-height:0%;font-family:sans-serif;letter-spacing:0px;word-spacing:0px;fill:#294172;fill-opacity:1;stroke:none;stroke-width:0.644976"
             xml:space="preserve"><tspan
               style="font-style:normal;font-variant:normal;font-weight:500;font-stretch:normal;font-size:30.8931px;line-height:125%;font-family:Montserrat;-inkscape-font-specification:'Montserrat Medium';text-align:start;writing-mode:lr-tb;text-anchor:start;fill:#294172;fill-opacity:1;stroke-width:0.644976"
               y="1063.8689"
               x="-236.92352"
               id="tspan6247"
               sodipodi:role="line">SERVER</tspan></text>
        </g>
      </g>
      <g
         id="g2257"
         style="fill:#51a2da;fill-opacity:1;stroke-width:1.27854"
         transform="matrix(0.27161047,0,0,0.27161047,88.810817,116.48853)">
        <path
           d="m 96.729167,125.3578 c -3.595373,1.38954 -6.03555,4.80292 -6.045574,9.01632 -0.0105,4.41352 3.082522,10.10943 9.487987,10.15149 4.30838,0.0283 6.46291,-1.58283 7.62603,-2.6768 0.77153,-0.68369 0.8255,-1.87009 0.11854,-2.61974 -0.70838,-0.75106 -1.89761,-0.76906 -2.6268,-0.0385 -0.86818,0.81562 -2.14666,2.02425 -5.772524,1.62173 -1.555755,-0.17216 -3.227339,-1.43528 -3.785318,-2.40173 l 11.879842,-5.05073 c 0.9084,-0.40358 1.32573,-1.45803 0.94121,-2.37421 -2.12076,-4.1731 -5.88103,-7.92444 -11.823393,-5.62783 z m 7.456683,5.48995 -9.885684,4.22249 c -0.705852,-2.63428 2.187448,-5.73353 3.76568,-6.31024 2.366314,-0.86468 4.977204,0.10837 6.120004,2.08775 z"
           style="fill:#51a2da;fill-opacity:1;fill-rule:evenodd;stroke:none;stroke-width:1.29884"
           id="path2241"
           sodipodi:nodetypes="ssscccccccsccsc" />
        <path
           id="path2243"
           style="fill:#51a2da;fill-opacity:1;stroke-width:37.9912;stroke-linecap:round;stroke-linejoin:round"
           d="m 142.75841,124.51519 a 10.043481,9.9623653 0 0 0 -10.04462,9.9635 10.043481,9.9623653 0 0 0 10.04462,9.96093 10.043481,9.9623653 0 0 0 10.04204,-9.96093 10.043481,9.9623653 0 0 0 -10.04204,-9.9635 z m 0,3.73185 a 6.2822799,6.2315417 0 0 1 6.28239,6.23165 6.2822799,6.2315417 0 0 1 -6.28239,6.23165 6.2822799,6.2315417 0 0 1 -6.2824,-6.23165 6.2822799,6.2315417 0 0 1 6.2824,-6.23165 z" />
        <path
           style="color:#000000;font-style:normal;font-variant:normal;font-weight:normal;font-stretch:normal;font-size:medium;line-height:normal;font-family:sans-serif;font-variant-ligatures:normal;font-variant-position:normal;font-variant-caps:normal;font-variant-numeric:normal;font-variant-alternates:normal;font-feature-settings:normal;text-indent:0;text-align:start;text-decoration:none;text-decoration-line:none;text-decoration-style:solid;text-decoration-color:#000000;letter-spacing:normal;word-spacing:normal;text-transform:none;writing-mode:lr-tb;direction:ltr;text-orientation:mixed;dominant-baseline:auto;baseline-shift:baseline;text-anchor:start;white-space:normal;shape-padding:0;clip-rule:nonzero;display:inline;overflow:visible;visibility:visible;isolation:auto;mix-blend-mode:normal;color-interpolation:sRGB;color-interpolation-filters:linearRGB;solid-color:#000000;solid-opacity:1;vector-effect:none;fill:#51a2da;fill-opacity:1;fill-rule:nonzero;stroke:none;stroke-width:7.79293;stroke-linecap:round;stroke-linejoin:round;stroke-miterlimit:4;stroke-dasharray:none;stroke-dashoffset:0;stroke-opacity:1;color-rendering:auto;image-rendering:auto;shape-rendering:auto;text-rendering:auto;enable-background:accumulate"
           d="m 157.27615,124.6433 c -1.59548,0 -1.86142,1.31669 -1.85308,1.84776 v 15.98997 c -0.0436,1.03365 0.81202,1.89464 1.88299,1.89464 1.07096,0 1.92667,-0.86099 1.88297,-1.89464 0,0 0.0284,-5.94671 0,-9.75342 -0.0284,-3.80671 3.06985,-4.63179 4.14789,-4.63179 0.80054,0 1.44015,0.44589 2.0745,0.42206 0.94151,-0.0354 1.71459,-0.6668 1.71459,-1.77397 -0.0283,-1.78855 -2.22269,-2.04245 -3.84053,-2.00941 -1.61785,0.0331 -2.9842,0.52982 -4.16721,1.2363 0,0 -0.24663,-1.3275 -1.84212,-1.3275 z"
           id="path2245"
           inkscape:connector-curvature="0"
           sodipodi:nodetypes="zccsczcsczcz" />
        <g
           style="fill:#51a2da;fill-opacity:1;stroke-width:2.08199"
           transform="matrix(1.7992734,0,0,1.7380239,67.446745,-121.99926)"
           id="g2249">
          <path
             style="color:#000000;font-style:normal;font-variant:normal;font-weight:normal;font-stretch:normal;font-size:medium;line-height:normal;font-family:sans-serif;font-variant-ligatures:normal;font-variant-position:normal;font-variant-caps:normal;font-variant-numeric:normal;font-variant-alternates:normal;font-feature-settings:normal;text-indent:0;text-align:start;text-decoration:none;text-decoration-line:none;text-decoration-style:solid;text-decoration-color:#000000;letter-spacing:normal;word-spacing:normal;text-transform:none;writing-mode:lr-tb;direction:ltr;text-orientation:mixed;dominant-baseline:auto;baseline-shift:baseline;text-anchor:start;white-space:normal;shape-padding:0;clip-rule:nonzero;display:inline;overflow:visible;visibility:visible;opacity:1;isolation:auto;mix-blend-mode:normal;color-interpolation:sRGB;color-interpolation-filters:linearRGB;solid-color:#000000;solid-opacity:1;vector-effect:none;fill:#51a2da;fill-opacity:1;fill-rule:nonzero;stroke:none;stroke-width:4.40682;stroke-linecap:butt;stroke-linejoin:miter;stroke-miterlimit:4;stroke-dasharray:none;stroke-dashoffset:0;stroke-opacity:1;color-rendering:auto;image-rendering:auto;shape-rendering:auto;text-rendering:auto;enable-background:accumulate"
             d="m 60.088341,141.88715 c -1.393394,0 -2.398273,0.42786 -3.13079,0.97048 -1.110459,0.82303 0.08453,2.54386 1.19499,1.72083 0.505399,-0.37438 0.881229,-0.57413 1.9358,-0.57413 1.312636,0.0273 2.368475,0.53812 2.368475,1.55443 -0.703746,0.461 -3.763534,0.84205 -5.406566,1.8093 -1.643032,0.96724 -1.555977,2.18804 -1.555977,2.98017 0,1.73757 1.769154,2.90976 3.301505,2.90976 1.532352,0 2.182891,-0.33275 3.682046,-1.39626 v 0.30438 c -0.04845,1.45961 2.09629,1.45961 2.047845,0 v -6.23787 c 0.0066,-2.58701 -1.787667,-4.00169 -4.437328,-4.04109 z m 2.439505,5.75572 c -5.12e-4,0.68595 0.0092,0.8837 -0.009,1.56941 -0.004,0.8235 -0.503683,1.20524 -1.026925,1.52032 -0.523236,0.31508 -1.586095,0.59147 -2.201906,0.62167 -0.710308,0.0243 -1.65271,-0.1418 -1.702203,-1.01389 5.12e-4,-0.5264 0.246817,-0.85289 0.65127,-1.21646 0.957742,-0.74385 2.255423,-0.99358 4.288768,-1.48105 z"
             id="path2247"
             inkscape:connector-curvature="0"
             sodipodi:nodetypes="ccccczszcccccscscccss" />
        </g>
        <path
           style="font-style:normal;font-variant:normal;font-weight:bold;font-stretch:normal;font-size:medium;line-height:25px;font-family:Comfortaa;-inkscape-font-specification:Comfortaa;letter-spacing:0px;word-spacing:0px;fill:#51a2da;fill-opacity:1;stroke:none;stroke-width:1.96187px;stroke-linecap:butt;stroke-linejoin:miter;stroke-opacity:1"
           d="m 128.56291,116.32562 c -1.15198,-0.0687 -2.00005,1.07152 -1.82333,2.15483 v 8.36367 c -3.63641,-3.04884 -9.55863,-2.83682 -12.91558,0.5392 -3.39481,3.02498 -4.03972,8.51062 -1.57068,12.28835 1.81366,2.85198 5.13136,4.88571 8.55043,4.72423 2.14993,-0.0196 4.2827,-0.9455 5.93583,-2.31651 -0.16962,1.08236 0.66623,2.22553 1.82333,2.15604 1.13581,0.0506 2.01523,-1.07045 1.84088,-2.15482 -0.0197,-8.04418 0.0197,-16.08885 -0.0197,-24.13274 -0.0591,-0.90718 -0.92676,-1.65309 -1.83241,-1.62225 z m -7.9771,12.01866 c 3.28298,-0.0857 6.21551,2.86987 6.15377,6.12271 0.069,3.25587 -2.87355,6.20634 -6.15377,6.12273 -3.11889,0.0827 -5.97784,-2.55935 -6.1372,-5.65665 -0.33212,-3.1928 2.28898,-6.30485 5.49957,-6.55826 0.21182,-0.0207 0.42464,-0.0306 0.63763,-0.0306 z"
           id="path2251"
           inkscape:connector-curvature="0"
           sodipodi:nodetypes="ccccccccccccccccccc" />
        <g
           style="fill:#51a2da;fill-opacity:1;stroke-width:2.1356"
           transform="matrix(1.7361841,0,0,1.7118711,84.821887,-122.89238)"
           id="g2255">
          <path
             style="font-style:normal;font-variant:normal;font-weight:bold;font-stretch:normal;font-size:medium;line-height:25px;font-family:Comfortaa;-inkscape-font-specification:Comfortaa;letter-spacing:0px;word-spacing:0px;fill:#51a2da;fill-opacity:1;stroke:none;stroke-width:4.52034;stroke-linecap:butt;stroke-linejoin:miter;stroke-miterlimit:4;stroke-dasharray:none;stroke-opacity:1"
             d="m -2.5312666,143.62929 v 11.47421 c -0.003,1.4145 2.12023294,1.4145 2.11718234,0 v -7.65727 H 1.7635608 c 0.5092674,0 0.9446445,-0.37386 0.9446445,-0.9741 0,-0.60024 -0.4664127,-0.9648 -0.9446445,-0.9648 h -2.17764176 v -1.76487 c 0,-1.1293 0.8711995,-2.06801 2.62476896,-2.04625 0.6099425,0.008 0.8261384,0.1567 1.048907,0.29442 1.2161282,0.81695 2.3869012,-1.07509 1.1131122,-1.79886 -0.7812122,-0.48483 -1.5111158,-0.65571 -2.3819993,-0.65571 -2.74449516,0 -4.5059235,2.11423 -4.5219745,4.09323 z"
             id="path2253"
             inkscape:connector-curvature="0"
             sodipodi:nodetypes="ccccczcccscccc" />
        </g>
      </g>
    </g>
  </g>
</svg>
