<?xml version="1.0" encoding="UTF-8" standalone="no"?>
<!-- Created with Inkscape (http://www.inkscape.org/) -->

<svg
   width="31.201342mm"
   height="53.733604mm"
   viewBox="0 0 31.201341 53.733606"
   version="1.1"
   id="svg5"
   xml:space="preserve"
   inkscape:export-filename="beefy miracle v4.svg"
   inkscape:export-xdpi="96"
   inkscape:export-ydpi="96"
   inkscape:version="1.2.2 (b0a8486541, 2022-12-01)"
   sodipodi:docname="beefy_miracle_v4.svg"
   xmlns:inkscape="http://www.inkscape.org/namespaces/inkscape"
   xmlns:sodipodi="http://sodipodi.sourceforge.net/DTD/sodipodi-0.dtd"
   xmlns="http://www.w3.org/2000/svg"
   xmlns:svg="http://www.w3.org/2000/svg"><sodipodi:namedview
     id="namedview7"
     pagecolor="#ffffff"
     bordercolor="#999999"
     borderopacity="1"
     inkscape:showpageshadow="0"
     inkscape:pageopacity="0"
     inkscape:pagecheckerboard="0"
     inkscape:deskcolor="#d1d1d1"
     inkscape:document-units="mm"
     showgrid="false"
     showguides="true"
     inkscape:zoom="1.5587434"
     inkscape:cx="71.211208"
     inkscape:cy="221.33213"
     inkscape:window-width="1920"
     inkscape:window-height="1011"
     inkscape:window-x="0"
     inkscape:window-y="0"
     inkscape:window-maximized="1"
     inkscape:current-layer="layer1"><inkscape:grid
       type="xygrid"
       id="grid105985"
       originx="0"
       originy="0" /></sodipodi:namedview><defs
     id="defs2"><inkscape:path-effect
       effect="powerstroke"
       id="path-effect188377"
       is_visible="true"
       lpeversion="1"
       offset_points="0.2,0.2724995 | 0.22915925,0.3522052 | 0.6041674,0.20432971"
       not_jump="false"
       sort_points="true"
       interpolator_type="CentripetalCatmullRom"
       interpolator_beta="0.2"
       start_linecap_type="zerowidth"
       linejoin_type="round"
       miter_limit="4"
       scale_width="1"
       end_linecap_type="zerowidth" /><inkscape:path-effect
       effect="powerstroke"
       id="path-effect176216"
       is_visible="true"
       lpeversion="1"
       offset_points="0.2,0.2724995 | 0.49320858,0.38295096 | 0.86190258,0.26257226"
       not_jump="false"
       sort_points="true"
       interpolator_type="CentripetalCatmullRom"
       interpolator_beta="0.2"
       start_linecap_type="round"
       linejoin_type="round"
       miter_limit="4"
       scale_width="0.9"
       end_linecap_type="round" /><inkscape:path-effect
       effect="powerstroke"
       id="path-effect176212"
       is_visible="true"
       lpeversion="1"
       offset_points="0.2,0.2724995 | 0.97439221,0.34404773 | 1.5535948,0.24428835"
       not_jump="false"
       sort_points="true"
       interpolator_type="CentripetalCatmullRom"
       interpolator_beta="0.2"
       start_linecap_type="round"
       linejoin_type="round"
       miter_limit="4"
       scale_width="0.9"
       end_linecap_type="round" /><inkscape:path-effect
       effect="powerstroke"
       id="path-effect176204"
       is_visible="true"
       lpeversion="1"
       offset_points="0.11859648,0.34024511 | 0.36260023,0.34810948 | 0.80042019,0.32619063"
       not_jump="false"
       sort_points="true"
       interpolator_type="CentripetalCatmullRom"
       interpolator_beta="0.2"
       start_linecap_type="round"
       linejoin_type="round"
       miter_limit="4"
       scale_width="0.8"
       end_linecap_type="round" /><inkscape:path-effect
       effect="powerstroke"
       id="path-effect34769"
       is_visible="true"
       lpeversion="1"
       offset_points="0.16922526,0.17445798 | 0.56487508,0.21852814 | 0.85242192,0.20623404"
       not_jump="false"
       sort_points="true"
       interpolator_type="CentripetalCatmullRom"
       interpolator_beta="0.2"
       start_linecap_type="round"
       linejoin_type="round"
       miter_limit="4"
       scale_width="0.8"
       end_linecap_type="round" /><inkscape:path-effect
       effect="powerstroke"
       id="path-effect34757"
       is_visible="true"
       lpeversion="1"
       offset_points="0.13509325,0.13710362 | 0.49809402,0.16664719 | 0.91874404,0.1814306"
       not_jump="false"
       sort_points="true"
       interpolator_type="CentripetalCatmullRom"
       interpolator_beta="0.2"
       start_linecap_type="round"
       linejoin_type="round"
       miter_limit="4"
       scale_width="1"
       end_linecap_type="round" /><inkscape:path-effect
       effect="powerstroke"
       id="path-effect4347"
       is_visible="true"
       lpeversion="1"
       offset_points="0.078975745,0.16378462 | 0.59292797,0.22977936 | 0.88294547,0.16937942"
       not_jump="false"
       sort_points="true"
       interpolator_type="CentripetalCatmullRom"
       interpolator_beta="0.2"
       start_linecap_type="round"
       linejoin_type="round"
       miter_limit="4"
       scale_width="1"
       end_linecap_type="round" /><inkscape:path-effect
       effect="powerstroke"
       id="path-effect4330"
       is_visible="true"
       lpeversion="1"
       offset_points="0.25312976,0.24437348 | 0.43635677,0.26815242 | 0.86378268,0.18178837"
       not_jump="false"
       sort_points="true"
       interpolator_type="CentripetalCatmullRom"
       interpolator_beta="0.2"
       start_linecap_type="round"
       linejoin_type="round"
       miter_limit="4"
       scale_width="1"
       end_linecap_type="square" /><inkscape:path-effect
       effect="powerstroke"
       id="path-effect6436"
       is_visible="true"
       lpeversion="1"
       offset_points="0.22222548,-0.35466221 | 0.47939741,-0.1787439 | 0.93059299,-0.16941136"
       not_jump="false"
       sort_points="true"
       interpolator_type="CentripetalCatmullRom"
       interpolator_beta="0.40298507"
       start_linecap_type="zerowidth"
       linejoin_type="round"
       miter_limit="4"
       scale_width="1"
       end_linecap_type="square" /><linearGradient
       id="linearGradient38280"
       inkscape:swatch="solid"><stop
         style="stop-color:#000000;stop-opacity:1;"
         offset="0"
         id="stop38278" /></linearGradient></defs><g
     inkscape:label="Layer 1"
     inkscape:groupmode="layer"
     id="layer1"
     transform="translate(-46.907437,17.082279)"><g
       id="g188441"><g
         id="g7075"
         transform="translate(5.4033966,2.0262737)"><g
           id="g4353"><path
             style="fill:#000000;fill-rule:nonzero;stroke:none;stroke-width:0.3;stroke-linecap:round;stroke-linejoin:round"
             d="m 51.135309,11.882184 c -0.228724,0.572726 -0.907536,2.385225 -1.26772,3.437301 -0.270524,0.790186 -0.545448,1.583174 -0.802727,2.482719 -0.569544,1.991338 -0.948735,3.97498 -1.238247,5.827967 -0.132271,0.846582 -0.21919,1.484813 -0.263255,1.85062 l -0.02174,0.180484 0.360968,0.04348 0.02174,-0.180484 c 0.04164,-0.345687 0.120357,-1.014171 0.261084,-1.835343 0.237156,-1.383853 0.952388,-4.220932 1.394701,-5.737934 0.24757,-0.849093 0.50244,-1.728392 0.750587,-2.4753 0.443752,-1.335668 0.91603,-2.554701 1.258499,-3.412246 a 0.24437348,0.24437348 90 0 0 -0.45389,-0.181266 z"
             id="path4326"
             sodipodi:nodetypes="cc"
             inkscape:path-effect="#path-effect4330"
             inkscape:original-d="m 51.362254,11.972817 c -1.801075,4.509905 -3.075152,9.01981 -3.61841,13.529715" /><path
             style="fill:#e8e8e8;fill-opacity:1;fill-rule:evenodd;stroke:#000000;stroke-width:0.3;stroke-linecap:round;stroke-linejoin:round;stroke-dasharray:none;stroke-opacity:1"
             d="m 45.813325,34.391239 c 0,0 3.854396,-1.651884 2.359833,-6.804186 0,0 1.458592,-0.894833 -0.157322,-1.848538 -1.469809,-0.867475 -1.828246,1.859304 -1.258578,1.730545 0,0 -2.585679,4.103717 -2.753139,4.916321 -0.170209,0.825942 -0.671249,2.477825 1.809206,2.005858 z"
             id="path4341"
             sodipodi:nodetypes="ccscsc" /></g><g
           id="g4357"
           transform="translate(0,-0.47196682)"><path
             style="fill:#000000;fill-rule:nonzero;stroke:none;stroke-width:0.3;stroke-linecap:round;stroke-linejoin:round"
             d="m 57.420909,11.916539 c 0.01629,0.11811 0.05862,0.402986 0.115968,0.768583 0.149634,0.95389 0.732436,3.849753 1.258702,5.58154 0.405762,1.335244 0.874428,2.556939 1.244607,3.559216 0.259154,0.701674 0.436449,1.184051 0.570544,1.53465 a 0.16937942,0.16937942 90 0 0 0.316406,-0.121016 c -0.114462,-0.299267 -0.338639,-0.876389 -0.56829,-1.528582 -0.356298,-1.011864 -0.727061,-2.241949 -1.123132,-3.576462 -0.510999,-1.721752 -1.215255,-4.559829 -1.375557,-5.502185 -0.06201,-0.364545 -0.09818,-0.640394 -0.114752,-0.760512 a 0.16378462,0.16378462 90 0 0 -0.324496,0.04477 z"
             id="path4343"
             sodipodi:nodetypes="cc"
             inkscape:path-effect="#path-effect4347"
             inkscape:original-d="m 57.583157,11.894155 c 0.438521,3.17855 1.4887,6.968759 3.185776,11.405865" /><path
             style="fill:#e8e8e8;fill-opacity:1;fill-rule:evenodd;stroke:#000000;stroke-width:0.3;stroke-linecap:round;stroke-linejoin:round;stroke-dasharray:none;stroke-opacity:1"
             d="m 61.752196,24.833914 c 0,0 0.66075,6.762622 -4.719668,4.994981 0,0 -1.927198,-0.943935 3.382428,-4.758999 0,0 -1.349227,-0.981963 0.511298,-1.730545 1.743733,-0.701591 1.47405,1.801488 0.825942,1.494563 z"
             id="path4349"
             sodipodi:nodetypes="cccsc" /></g></g><g
         id="g188403"><path
           style="fill:#000000;fill-opacity:1;fill-rule:nonzero;stroke:none;stroke-width:0.5;stroke-linecap:round;stroke-dasharray:none;stroke-opacity:1"
           d="m 54.51897,-0.7940112 0,0 c 0.0035,0.053631 -0.235028,0.35021219 -1.125078,0.35166763 -0.08567,1.401e-4 -0.17417,-0.003425 -0.265143,-0.0103347 -0.661011,-0.0502029 -1.626489,-0.3079932 -2.582416,-0.66414774 -0.07701,-0.028693 -0.157116,-0.059686 -0.239373,-0.09318 -0.425037,-0.1730705 -0.90875,-0.4132095 -1.343684,-0.7593501 -0.403972,-0.3215003 -0.741244,-0.7148111 -0.97004,-1.1974983 -0.261749,-0.5522102 -0.345212,-1.1450149 -0.315877,-1.7346585 0.01789,-0.3595946 0.07645,-0.6902068 0.138939,-0.957728 0.141205,-0.6045224 0.35461,-1.1285061 0.456611,-1.3690756 l 0.06613,-0.1559706 0.311941,0.132263 -0.06613,0.1559706 c -0.09966,0.2350514 -0.304688,0.737595 -0.43857,1.3136998 -0.05918,0.254635 -0.115647,0.5643438 -0.135145,0.8988193 -0.03189,0.5470365 0.03935,1.0853817 0.269407,1.5819537 0.201053,0.4339608 0.503508,0.7927686 0.877062,1.0867194 0.40372,0.3176888 0.860851,0.5359916 1.272499,0.6827875 0.07937,0.028303 0.156812,0.05386 0.231525,0.076863 0.925408,0.2849173 1.910262,0.2499749 2.515364,0.285106 0.08621,0.00501 0.169728,0.011187 0.250546,0.019235 0.829841,0.082636 1.086261,0.27685258 1.091431,0.35685825 z"
           id="path6432"
           inkscape:path-effect="#path-effect6436"
           inkscape:original-d="m 54.51897,-0.7940112 c 0,0 -9.037804,0.583981 -6.09009,-6.368174" /><g
           id="g188373"
           transform="matrix(0.52883932,0,0,0.52883932,-117.10832,-0.7338148)"
           style="stroke-width:0.378187;stroke-dasharray:none"
           inkscape:transform-center-x="0.64455307"
           inkscape:transform-center-y="-0.85961499"><path
             style="fill:#e8e8e8;fill-opacity:1;fill-rule:evenodd;stroke:#000000;stroke-width:0.56728;stroke-linecap:round;stroke-linejoin:round;stroke-dasharray:none;stroke-opacity:1;paint-order:normal"
             d="m 317.36676,-15.134822 c 0,0 1.67098,5.164824 -3.56981,2.962179 -5.24076,-2.202646 -3.41789,-3.721711 -0.91144,-4.785057 0,0 -4.48125,-6.683889 2.81027,-13.443732 0.0554,-0.01108 3.5006,-1.687509 1.21526,4.405291 0,0 1.67098,-4.709104 4.63315,-4.63315 2.96217,0.07595 -0.22786,5.392683 -0.22786,5.392683 0,0 1.74692,-3.569804 4.10147,-2.354552 2.35456,1.215253 -2.65836,6.607936 -2.65836,6.607936 -0.0499,0.09983 3.99053,-0.157884 3.94957,2.354551 -0.0576,3.533603 -9.34225,3.493851 -9.34225,3.493851 z"
             id="path188369"
             sodipodi:nodetypes="cscccscscsc" /><path
             style="fill:#000000;fill-opacity:1;fill-rule:nonzero;stroke:none;stroke-width:0.378187;stroke-linecap:round;stroke-linejoin:round;stroke-dasharray:none;stroke-opacity:1;paint-order:normal"
             d="m 323.41484,-21.211084 c -0.09,-0.02158 -0.43466,-0.07343 -0.53786,-0.106891 -0.0465,-0.01509 -0.0464,-0.0516 -0.0938,-0.04825 -0.10756,0.0076 -0.3289,0.181245 -0.50216,0.361887 -0.058,0.06045 -0.10639,0.116039 -0.15134,0.16788 -0.223,0.257182 -0.32823,0.518019 -0.38583,0.688718 0.0966,-0.08109 0.41091,-0.271973 0.62986,-0.360916 0.0535,-0.02172 0.11488,-0.04164 0.1817,-0.06015 0.19179,-0.05312 0.4385,-0.09107 0.49541,-0.145837 0.0292,-0.02811 0.006,-0.05499 0.0251,-0.09597 0.0432,-0.0909 0.27375,-0.334698 0.33885,-0.400471 z"
             id="path188371"
             sodipodi:nodetypes="cc"
             inkscape:path-effect="#path-effect188377"
             inkscape:original-d="m 323.41484,-21.211084 c -0.77546,0.220953 -1.32512,0.556637 -1.67095,1.063346"
             inkscape:linked-fill="path176131"
             class="UnoptimicedTransforms" /></g></g><g
         id="g188414"><path
           style="fill:none;fill-opacity:1;fill-rule:evenodd;stroke:#000000;stroke-width:0.378643;stroke-linecap:round;stroke-dasharray:none;stroke-opacity:1"
           d="m 70.521645,1.1629579 c 0,0 -2.668366,-1.1634077 -3.04956,-2.1450328"
           id="path8370" /><g
           id="g176223"
           transform="matrix(0.51137618,0,0,0.51137618,-102.68547,-32.996807)"
           style="stroke-width:0.391102;stroke-dasharray:none"><g
             id="g176187"
             transform="matrix(-1,0,0,1,557.58406,37.293718)"
             style="stroke-width:0.391102;stroke-dasharray:none"><path
               style="fill:#e8e8e8;fill-opacity:1;fill-rule:evenodd;stroke:#000000;stroke-width:0.586652;stroke-linecap:round;stroke-linejoin:round;stroke-dasharray:none;stroke-opacity:1;paint-order:normal"
               d="m 207.06949,28.01857 c 0,0 -2.04087,-4.135445 0.32224,-3.920617 2.36311,0.214828 4.88734,4.403982 8.3783,4.726223 0,0 1.02044,-3.383545 3.06131,0.751901 2.04087,4.135445 -2.09458,2.846475 -2.09458,2.846475 0,0 -1.34268,3.383547 -5.69295,4.189153 0,0 -1.90583,1.190762 -2.95389,1.611212 -0.74101,0.297271 -2.68535,-0.913022 -0.48336,-4.135446 0,0 -2.30941,-0.644485 -1.77234,-2.040869 0,0 -2.47052,-2.255697 -1.07414,-3.866909 0,0 0.64449,-0.751901 2.30941,-0.161123 z"
               id="path176185"
               sodipodi:nodetypes="cscsccscccc" /></g><path
             style="fill:#000000;fill-opacity:1;fill-rule:nonzero;stroke:none;stroke-width:0.391102;stroke-linecap:round;stroke-linejoin:round;stroke-dasharray:none;stroke-opacity:1;paint-order:normal"
             d="m 350.57001,64.989589 c -0.0853,0.03859 -0.23144,0.103598 -0.41337,0.17329 -0.23886,0.0915 -0.53332,0.186007 -0.86473,0.273243 -0.14404,0.03791 -0.30387,0.07686 -0.47729,0.112009 -0.38475,0.07798 -0.7125,0.111681 -0.97359,0.115237 -0.26322,0.0036 -0.45074,-0.0221 -0.55429,-0.03889 a 0.2609525,0.2609525 90 0 0 -0.0835,0.515176 c 0.12893,0.02091 0.34202,0.04591 0.64146,0.04561 0.29545,-3.02e-4 0.65207,-0.02364 1.07208,-0.09809 0.18747,-0.03323 0.36201,-0.07226 0.51589,-0.112141 0.35559,-0.09216 0.66708,-0.205449 0.92048,-0.304448 0.19597,-0.07656 0.34779,-0.142685 0.44132,-0.185008 a 0.27219609,0.27219609 90 0 0 -0.22442,-0.495982 z"
             id="path176202"
             sodipodi:nodetypes="cc"
             inkscape:path-effect="#path-effect176204"
             inkscape:original-d="m 350.68222,65.23758 c -1.18751,0.537325 -2.51084,0.7947 -3.43725,0.644484" /><path
             style="fill:#000000;fill-opacity:1;fill-rule:nonzero;stroke:none;stroke-width:0.391102;stroke-linecap:round;stroke-linejoin:round;stroke-dasharray:none;stroke-opacity:1;paint-order:normal"
             d="m 351.94574,69.071995 c -6.1e-4,-0.0045 -0.005,-0.05322 -0.0514,-0.2335 -0.008,-0.03074 -0.018,-0.06833 -0.0305,-0.110499 -0.0444,-0.150264 -0.14033,-0.432986 -0.3445,-0.710551 -0.0911,-0.123887 -0.20541,-0.249043 -0.34833,-0.361314 -0.14201,-0.111563 -0.30816,-0.207122 -0.50077,-0.276506 -0.20019,-0.07212 -0.41911,-0.112403 -0.65505,-0.118953 -0.20349,-0.0056 -0.41276,0.01398 -0.62472,0.05497 -0.0577,0.01117 -0.11633,0.02405 -0.17576,0.03865 -0.53938,0.133071 -0.94884,0.251063 -1.2701,0.3489 -0.34267,0.104359 -0.59202,0.187712 -0.79483,0.245999 -0.045,0.01294 -0.0877,0.02464 -0.12842,0.03505 -0.14296,0.03653 -0.2732,0.06214 -0.39417,0.07741 -0.19453,0.02455 -0.34953,0.0196 -0.4517,0.01743 a 0.21985952,0.21985952 90 0 0 -0.009,0.43962 c 0.11258,0.0024 0.29201,-0.0017 0.51636,-0.03163 0.14153,-0.01887 0.27797,-0.0441 0.43372,-0.07346 0.0435,-0.0082 0.0888,-0.01662 0.13653,-0.02542 0.2168,-0.04002 0.47351,-0.08655 0.82507,-0.157379 0.33298,-0.06708 0.73665,-0.153029 1.27914,-0.276308 0.0506,-0.01147 0.0999,-0.02152 0.14792,-0.03023 0.17673,-0.03207 0.34218,-0.04706 0.49657,-0.04476 0.17807,0.0027 0.33474,0.02822 0.47327,0.07195 0.13308,0.042 0.24837,0.100437 0.34911,0.170024 0.10196,0.07042 0.18824,0.151766 0.26134,0.236967 0.16613,0.193613 0.26116,0.404108 0.30703,0.525754 0.0125,0.03309 0.0223,0.0623 0.0298,0.08661 0.0435,0.141663 0.0382,0.170677 0.0376,0.166164 a 0.24524955,0.24524955 90 0 0 0.48618,-0.06499 z"
             id="path176210"
             sodipodi:nodetypes="csc"
             inkscape:path-effect="#path-effect176212"
             inkscape:original-d="m 351.70265,69.104489 c 0,0 -0.2621,-1.960742 -2.41681,-1.450091 -2.09866,0.497367 -2.42185,0.659252 -3.11502,0.644485" /><path
             style="fill:#000000;fill-opacity:1;fill-rule:nonzero;stroke:none;stroke-width:0.391102;stroke-linecap:round;stroke-linejoin:round;stroke-dasharray:none;stroke-opacity:1;paint-order:normal"
             d="m 349.82173,71.168645 c -0.23506,0.0011 -0.87603,0.03773 -1.35572,0.0544 -0.10666,0.0037 -0.21607,0.0054 -0.32703,0.0056 -0.49194,8.36e-4 -1.0247,-0.02745 -1.56142,-0.04979 -0.003,-1.4e-4 -0.0402,-0.0017 -0.0436,-0.0018 -0.52341,-0.02158 -1.06188,-0.04671 -1.68655,-0.179251 -0.30708,-0.06516 -0.59033,-0.147747 -0.83617,-0.238531 -0.4759,-0.175744 -0.87702,-0.392572 -1.1112,-0.519752 a 0.23631503,0.23631503 90 0 0 -0.22556,0.415332 c 0.2544,0.138161 0.65982,0.337931 1.16514,0.544789 0.25865,0.105881 0.5438,0.218017 0.86714,0.322222 0.63819,0.205675 1.24667,0.319553 1.79771,0.343953 0.0157,6.96e-4 0.0313,0.0013 0.0468,0.0019 0.57763,0.02012 1.12947,-0.06413 1.61831,-0.121133 0.11131,-0.01298 0.21973,-0.02467 0.32605,-0.03387 0.56943,-0.04929 1.00423,-0.05194 1.32844,-0.05351 a 0.24524955,0.24524955 90 0 0 -0.002,-0.490494 z"
             id="path176214"
             sodipodi:nodetypes="cc"
             inkscape:path-effect="#path-effect176216"
             inkscape:original-d="m 349.82292,71.413892 c -2.3097,0.0112 -4.15491,0.597769 -7.03564,-0.966726" /></g></g><g
         id="g16525"><path
           style="fill:#aa430f;fill-opacity:1;fill-rule:evenodd;stroke:#000000;stroke-width:0.4;stroke-linecap:round;stroke-linejoin:round;stroke-dasharray:none"
           d="m 57.696445,6.4819722 c 0,0 0.314462,5.3249678 3.19512,5.2525178 2.969735,-0.07469 3.622813,-1.325196 3.4435,-4.0254994 -0.03704,-0.2987699 -1.248907,-11.9502791 -1.092773,-14.0779881 0.127889,-1.7428138 2.830004,-8.9025985 -2.172763,-8.6353395 -5.01465,0.267894 -4.345525,7.3539655 -4.345525,7.6325255 0,0.278559 0.972441,13.8537837 0.972441,13.8537837 z"
           id="path34700"
           sodipodi:nodetypes="cscsssc" /><path
           style="fill:#d09151;fill-opacity:1;fill-rule:evenodd;stroke:#000000;stroke-width:0.4;stroke-linecap:round;stroke-linejoin:round;stroke-dasharray:none"
           d="m 65.635608,11.941543 c 0,0 -7.056065,4.578438 -12.840735,-0.03817 -5.78467,-4.6166112 -0.94557,-34.930503 8.788249,-17.2983852 l 2.336115,-4.0603941 c 0,0 5.229532,0.200067 4.254252,5.5621831 -1.182652,6.50225 0.565858,13.799343 -2.537881,15.8347692 z"
           id="path4363"
           sodipodi:nodetypes="csccscc" /><path
           style="fill:#000000;fill-rule:nonzero;stroke:none;stroke-width:0.3;stroke-linecap:round;stroke-linejoin:round"
           d="m 62.697092,0.51701414 c -0.009,0.11562526 -0.01859,0.28534775 -0.03011,0.52045966 -0.01954,0.3989049 -0.03472,0.8096206 -0.01822,1.2573947 -10e-7,-2.8e-6 2.24e-4,0.00606 2.24e-4,0.00605 0.01823,0.4874585 0.06698,0.9341634 0.09723,1.1832791 0.01109,0.091307 0.02174,0.1648213 0.0258,0.1946636 a 0.1814306,0.1814306 90 0 0 0.359548,-0.048921 c -0.0081,-0.059356 -0.01737,-0.1326645 -0.02545,-0.1920207 -0.03678,-0.2706765 -0.0869,-0.655049 -0.124122,-1.1555305 -10e-7,-8.8e-6 -4.37e-4,-0.00589 -4.38e-4,-0.0059 -0.03186,-0.4301869 -0.05098,-0.8430005 -0.04055,-1.2285756 0.0059,-0.21958316 0.02155,-0.40737496 0.02949,-0.50968814 a 0.13710362,0.13710362 90 0 0 -0.273386,-0.0212157 z"
           id="path34753"
           inkscape:path-effect="#path-effect34757"
           inkscape:original-d="m 62.833785,0.527622 c -0.101308,1.3054527 0.01317,2.3563775 0.117994,3.126781"
           inkscape:linked-fill="path2380"
           class="UnoptimicedTransforms"
           sodipodi:nodetypes="cc"
           transform="matrix(1,0,0,0.91391943,0.0903635,3.058914)" /><path
           style="fill:#000000;fill-opacity:1;fill-rule:nonzero;stroke:none;stroke-width:0.3;stroke-linecap:round;stroke-linejoin:round"
           d="m 42.264601,-1.6997618 c -0.0097,0.1981741 -0.02242,0.4858968 -0.04845,0.83989193 -0.0293,0.39854952 -0.08594,0.9360377 -0.100733,1.3593313 -0.003,0.0859724 -0.0044,0.16706321 -0.0042,0.24361321 6.04e-4,0.2399227 0.01637,0.46678366 0.043,0.68768786 0.01672,0.1386801 0.03674,0.2671618 0.05745,0.3878302 0.04295,0.2502048 0.09098,0.4546611 0.125578,0.5890031 a 0.16498723,0.16498723 90 0 0 0.31955,-0.082286 c -0.03246,-0.1260644 -0.08146,-0.325859 -0.119668,-0.5611165 -0.01858,-0.1143924 -0.03378,-0.2373897 -0.04546,-0.3688983 -0.01882,-0.2118524 -0.02675,-0.42366303 -0.03082,-0.65567184 -0.0013,-0.0740746 -0.0023,-0.15106302 -0.0028,-0.23497179 -0.0022,-0.42227009 0.01371,-0.922266 0.03668,-1.34674534 0.01701,-0.31428123 0.04123,-0.69154633 0.04868,-0.84404743 a 0.13956638,0.13956638 90 0 0 -0.2788,-0.013621 z"
           id="path34765"
           inkscape:path-effect="#path-effect34769"
           inkscape:original-d="m 42.404001,-1.6929515 c -0.08774,1.79595056 -0.255974,2.7042693 0.09298,4.0594044"
           inkscape:linked-fill="path11133"
           class="UnoptimicedTransforms"
           transform="translate(19.911149,3.7607717)"
           sodipodi:nodetypes="cc" /></g></g></g></svg>
