<?xml version="1.0" encoding="UTF-8" standalone="no"?>
<!-- Created with Inkscape (http://www.inkscape.org/) -->

<svg
   width="63.260406mm"
   height="86.34758mm"
   viewBox="0 0 63.260406 86.347579"
   version="1.1"
   id="svg310393"
   xml:space="preserve"
   sodipodi:docname="badger.svg"
   inkscape:version="1.2.2 (b0a8486541, 2022-12-01)"
   xmlns:inkscape="http://www.inkscape.org/namespaces/inkscape"
   xmlns:sodipodi="http://sodipodi.sourceforge.net/DTD/sodipodi-0.dtd"
   xmlns="http://www.w3.org/2000/svg"
   xmlns:svg="http://www.w3.org/2000/svg"><sodipodi:namedview
     id="namedview310395"
     pagecolor="#ffffff"
     bordercolor="#000000"
     borderopacity="0.25"
     inkscape:showpageshadow="2"
     inkscape:pageopacity="0.0"
     inkscape:pagecheckerboard="0"
     inkscape:deskcolor="#d1d1d1"
     inkscape:document-units="mm"
     showgrid="false"
     inkscape:zoom="0.5253601"
     inkscape:cx="1435.2061"
     inkscape:cy="460.63643"
     inkscape:window-width="1920"
     inkscape:window-height="979"
     inkscape:window-x="0"
     inkscape:window-y="32"
     inkscape:window-maximized="1"
     inkscape:current-layer="layer1"
     showguides="true"><sodipodi:guide
       position="-160.32823,181.02228"
       orientation="0,-1"
       id="guide986"
       inkscape:locked="false" /><sodipodi:guide
       position="-160.6141,180.73624"
       orientation="1,0"
       id="guide988"
       inkscape:locked="false" /><sodipodi:guide
       position="-161.21462,182.21992"
       orientation="1,0"
       id="guide990"
       inkscape:locked="false" /><sodipodi:guide
       position="-162.59219,177.26687"
       orientation="1,0"
       id="guide992"
       inkscape:locked="false" /><sodipodi:guide
       position="-160.69661,173.76737"
       orientation="0,-1"
       id="guide994"
       inkscape:locked="false" /></sodipodi:namedview><defs
     id="defs310390"><inkscape:path-effect
       effect="powerstroke"
       id="path-effect37154"
       is_visible="true"
       lpeversion="1"
       offset_points="0.15584567,0.10484881 | 1.0719982,0.20275494 | 2.862994,0.094391184 | 1.912515,0.075489965"
       not_jump="false"
       sort_points="true"
       interpolator_type="CentripetalCatmullRom"
       interpolator_beta="0.2"
       start_linecap_type="zerowidth"
       linejoin_type="round"
       miter_limit="4"
       scale_width="1"
       end_linecap_type="zerowidth" /><inkscape:path-effect
       effect="powerstroke"
       id="path-effect37150"
       is_visible="true"
       lpeversion="1"
       offset_points="0.28711787,0.23519027 | 0.58871538,0.30124405 | 0.79330636,0.23550691"
       not_jump="false"
       sort_points="true"
       interpolator_type="CentripetalCatmullRom"
       interpolator_beta="0.2"
       start_linecap_type="zerowidth"
       linejoin_type="round"
       miter_limit="4"
       scale_width="1"
       end_linecap_type="zerowidth" /><inkscape:path-effect
       effect="powerstroke"
       id="path-effect36040"
       is_visible="true"
       lpeversion="1"
       offset_points="0.33692311,0.14695783 | 4.1479785,0.12767338 | 2.7189252,0.32353086 | 1.9452045,0.14024583 | 5.6954771,0.092031374 | 4.9438933,0.31312773"
       not_jump="false"
       sort_points="true"
       interpolator_type="CentripetalCatmullRom"
       interpolator_beta="0.2"
       start_linecap_type="zerowidth"
       linejoin_type="round"
       miter_limit="4"
       scale_width="1"
       end_linecap_type="zerowidth" /><inkscape:path-effect
       effect="powerstroke"
       id="path-effect35485"
       is_visible="true"
       lpeversion="1"
       offset_points="0.19996176,0.054518713 | 1.0032317,0.17813951 | 1.9657552,0.14006406"
       not_jump="false"
       sort_points="true"
       interpolator_type="CentripetalCatmullRom"
       interpolator_beta="0.2"
       start_linecap_type="zerowidth"
       linejoin_type="round"
       miter_limit="4"
       scale_width="1"
       end_linecap_type="zerowidth" /><inkscape:path-effect
       effect="powerstroke"
       id="path-effect34932"
       is_visible="true"
       lpeversion="1"
       offset_points="0.19850048,0.053352263 | 3.6783927,0.024970921 | 1.8775876,0.22215795 | 5.7179726,0.16010642"
       not_jump="false"
       sort_points="true"
       interpolator_type="CentripetalCatmullRom"
       interpolator_beta="0.2"
       start_linecap_type="zerowidth"
       linejoin_type="round"
       miter_limit="4"
       scale_width="1"
       end_linecap_type="zerowidth" /><inkscape:path-effect
       effect="powerstroke"
       id="path-effect34381"
       is_visible="true"
       lpeversion="1"
       offset_points="0.16158222,-0.14039182 | 2.161631,0.063377367 | 2.9801371,0.17233868 | 1.5111013,-0.19595804 | 3.9599579,0.095946494"
       not_jump="false"
       sort_points="true"
       interpolator_type="CentripetalCatmullRom"
       interpolator_beta="0.2"
       start_linecap_type="zerowidth"
       linejoin_type="round"
       miter_limit="4"
       scale_width="1"
       end_linecap_type="zerowidth" /><inkscape:path-effect
       effect="powerstroke"
       id="path-effect33286"
       is_visible="true"
       lpeversion="1"
       offset_points="0.17793646,0.075811497 | 0.50047694,0.25234712 | 0.90534874,0.195571"
       not_jump="false"
       sort_points="true"
       interpolator_type="CentripetalCatmullRom"
       interpolator_beta="0.2"
       start_linecap_type="zerowidth"
       linejoin_type="round"
       miter_limit="4"
       scale_width="1"
       end_linecap_type="zerowidth" /><inkscape:path-effect
       effect="powerstroke"
       id="path-effect33282"
       is_visible="true"
       lpeversion="1"
       offset_points="0.14913016,0.050818701 | 0.50638013,0.13319762 | 0.81360893,0.18224271"
       not_jump="false"
       sort_points="true"
       interpolator_type="CentripetalCatmullRom"
       interpolator_beta="0.2"
       start_linecap_type="zerowidth"
       linejoin_type="round"
       miter_limit="4"
       scale_width="1"
       end_linecap_type="zerowidth" /><inkscape:path-effect
       effect="powerstroke"
       id="path-effect32737"
       is_visible="true"
       lpeversion="1"
       offset_points="0,0.076930698 | 0.41975698,0.25994259 | 0.66753749,0.27956697"
       not_jump="false"
       sort_points="true"
       interpolator_type="CentripetalCatmullRom"
       interpolator_beta="0.2"
       start_linecap_type="zerowidth"
       linejoin_type="round"
       miter_limit="4"
       scale_width="1"
       end_linecap_type="zerowidth" /><inkscape:path-effect
       effect="powerstroke"
       id="path-effect32194"
       is_visible="true"
       lpeversion="1"
       offset_points="0.2,0.24999949 | 0.51431925,0.32091476 | 0.8,0.24999949"
       not_jump="false"
       sort_points="true"
       interpolator_type="CentripetalCatmullRom"
       interpolator_beta="0.2"
       start_linecap_type="zerowidth"
       linejoin_type="round"
       miter_limit="4"
       scale_width="1"
       end_linecap_type="zerowidth" /><inkscape:path-effect
       effect="powerstroke"
       id="path-effect31653"
       is_visible="true"
       lpeversion="1"
       offset_points="0.28091217,0.1401627 | 1.5955468,0.079738521 | 2.0306851,0.30085634 | 1.0603816,0.21729082 | 2.7458419,0.2614279"
       not_jump="false"
       sort_points="true"
       interpolator_type="CentripetalCatmullRom"
       interpolator_beta="0.2"
       start_linecap_type="zerowidth"
       linejoin_type="round"
       miter_limit="4"
       scale_width="1"
       end_linecap_type="zerowidth" /><inkscape:path-effect
       effect="powerstroke"
       id="path-effect31114"
       is_visible="true"
       lpeversion="1"
       offset_points="0.25557084,0.074995788 | 0.53556785,0.10982658 | 0.8425713,0.10146646"
       not_jump="false"
       sort_points="true"
       interpolator_type="CentripetalCatmullRom"
       interpolator_beta="0.2"
       start_linecap_type="zerowidth"
       linejoin_type="round"
       miter_limit="4"
       scale_width="1"
       end_linecap_type="zerowidth" /><inkscape:path-effect
       effect="powerstroke"
       id="path-effect30577"
       is_visible="true"
       lpeversion="1"
       offset_points="0.29896964,0.1065134 | 0.51721575,0.13375538 | 0.76888841,0.10650436"
       not_jump="false"
       sort_points="true"
       interpolator_type="CentripetalCatmullRom"
       interpolator_beta="0.2"
       start_linecap_type="zerowidth"
       linejoin_type="round"
       miter_limit="4"
       scale_width="1"
       end_linecap_type="zerowidth" /><inkscape:path-effect
       effect="powerstroke"
       id="path-effect30573"
       is_visible="true"
       lpeversion="1"
       offset_points="0.35050352,0.10987455 | 0.58476721,0.11681391 | 1,0.17642751"
       not_jump="false"
       sort_points="true"
       interpolator_type="CentripetalCatmullRom"
       interpolator_beta="0.2"
       start_linecap_type="zerowidth"
       linejoin_type="round"
       miter_limit="4"
       scale_width="1"
       end_linecap_type="zerowidth" /><inkscape:path-effect
       effect="powerstroke"
       id="path-effect30569"
       is_visible="true"
       lpeversion="1"
       offset_points="0.4385877,0.11992275 | 0.65636703,0.15219197 | 0.98572244,0.1426465"
       not_jump="false"
       sort_points="true"
       interpolator_type="CentripetalCatmullRom"
       interpolator_beta="0.2"
       start_linecap_type="zerowidth"
       linejoin_type="round"
       miter_limit="4"
       scale_width="1"
       end_linecap_type="zerowidth" /><inkscape:path-effect
       effect="powerstroke"
       id="path-effect30565"
       is_visible="true"
       lpeversion="1"
       offset_points="0.25015312,0.10566806 | 0.51738563,0.097923731 | 0.82569308,0.073533946"
       not_jump="false"
       sort_points="true"
       interpolator_type="CentripetalCatmullRom"
       interpolator_beta="0.2"
       start_linecap_type="zerowidth"
       linejoin_type="round"
       miter_limit="4"
       scale_width="1"
       end_linecap_type="zerowidth" /><inkscape:path-effect
       effect="powerstroke"
       id="path-effect30561"
       is_visible="true"
       lpeversion="1"
       offset_points="0.27097379,0.063256797 | 0.57265978,0.054441418 | 0.81203556,0.053052725"
       not_jump="false"
       sort_points="true"
       interpolator_type="CentripetalCatmullRom"
       interpolator_beta="0.2"
       start_linecap_type="zerowidth"
       linejoin_type="round"
       miter_limit="4"
       scale_width="1"
       end_linecap_type="zerowidth" /><inkscape:path-effect
       effect="powerstroke"
       id="path-effect30034"
       is_visible="true"
       lpeversion="1"
       offset_points="0.28812698,0.12853854 | 0.69660658,0.23411844 | 0.98905356,0.13197898"
       not_jump="false"
       sort_points="true"
       interpolator_type="CentripetalCatmullRom"
       interpolator_beta="0.2"
       start_linecap_type="zerowidth"
       linejoin_type="round"
       miter_limit="4"
       scale_width="1"
       end_linecap_type="zerowidth" /><inkscape:path-effect
       effect="powerstroke"
       id="path-effect30030"
       is_visible="true"
       lpeversion="1"
       offset_points="0.13284361,0.051600526 | 0.5074171,0.1906485 | 0.75160945,0.13897401"
       not_jump="false"
       sort_points="true"
       interpolator_type="CentripetalCatmullRom"
       interpolator_beta="0.2"
       start_linecap_type="zerowidth"
       linejoin_type="round"
       miter_limit="4"
       scale_width="1"
       end_linecap_type="zerowidth" /><inkscape:path-effect
       effect="powerstroke"
       id="path-effect30026"
       is_visible="true"
       lpeversion="1"
       offset_points="0.2817241,0.13780289 | 1.866943,0.086715058 | 2.5032728,0.26508224 | 3.4983938,0.11873488 | 1.3098375,0.23257707 | 4.7034873,0.15659807 | 3.9872209,0.060622223"
       not_jump="false"
       sort_points="true"
       interpolator_type="CentripetalCatmullRom"
       interpolator_beta="0.2"
       start_linecap_type="zerowidth"
       linejoin_type="round"
       miter_limit="4"
       scale_width="1"
       end_linecap_type="zerowidth" /><inkscape:path-effect
       effect="powerstroke"
       id="path-effect29505"
       is_visible="true"
       lpeversion="1"
       offset_points="0.30210227,0.063889773 | 0.56958758,0.13024895 | 0.81159364,0.11892788"
       not_jump="false"
       sort_points="true"
       interpolator_type="CentripetalCatmullRom"
       interpolator_beta="0.2"
       start_linecap_type="zerowidth"
       linejoin_type="round"
       miter_limit="4"
       scale_width="1"
       end_linecap_type="zerowidth" /><inkscape:path-effect
       effect="powerstroke"
       id="path-effect28986"
       is_visible="true"
       lpeversion="1"
       offset_points="0.22664987,0.098546272 | 2.5,0.24999949 | 1.7525676,0.11106328 | 4.7990208,0.09985542 | 4.5293589,0.14647477 | 4.1219383,0.065933628"
       not_jump="false"
       sort_points="true"
       interpolator_type="CentripetalCatmullRom"
       interpolator_beta="0.2"
       start_linecap_type="zerowidth"
       linejoin_type="round"
       miter_limit="4"
       scale_width="1"
       end_linecap_type="zerowidth" /><inkscape:path-effect
       effect="powerstroke"
       id="path-effect28469"
       is_visible="true"
       lpeversion="1"
       offset_points="0.27465273,0.049587312 | 0.56368687,0.068948998 | 0.83260778,0.057350316"
       not_jump="false"
       sort_points="true"
       interpolator_type="CentripetalCatmullRom"
       interpolator_beta="0.2"
       start_linecap_type="zerowidth"
       linejoin_type="round"
       miter_limit="4"
       scale_width="1"
       end_linecap_type="zerowidth" /><inkscape:path-effect
       effect="powerstroke"
       id="path-effect28465"
       is_visible="true"
       lpeversion="1"
       offset_points="0.30541013,0.056176776 | 0.69006445,0.065787659 | 0.84035607,0.058757119"
       not_jump="false"
       sort_points="true"
       interpolator_type="CentripetalCatmullRom"
       interpolator_beta="0.2"
       start_linecap_type="zerowidth"
       linejoin_type="round"
       miter_limit="4"
       scale_width="1"
       end_linecap_type="zerowidth" /><inkscape:path-effect
       effect="powerstroke"
       id="path-effect28461"
       is_visible="true"
       lpeversion="1"
       offset_points="0.22331922,0.055857658 | 0.54196653,0.085332329 | 0.83423763,0.053441751"
       not_jump="false"
       sort_points="true"
       interpolator_type="CentripetalCatmullRom"
       interpolator_beta="0.2"
       start_linecap_type="zerowidth"
       linejoin_type="round"
       miter_limit="4"
       scale_width="1"
       end_linecap_type="zerowidth" /><inkscape:path-effect
       effect="powerstroke"
       id="path-effect28457"
       is_visible="true"
       lpeversion="1"
       offset_points="0.5682903,0.091380832 | 2.0206384,0.16615371 | 3.5217814,0.058351633"
       not_jump="false"
       sort_points="true"
       interpolator_type="CentripetalCatmullRom"
       interpolator_beta="0.2"
       start_linecap_type="zerowidth"
       linejoin_type="round"
       miter_limit="4"
       scale_width="1"
       end_linecap_type="zerowidth" /><inkscape:path-effect
       effect="powerstroke"
       id="path-effect26242"
       is_visible="true"
       lpeversion="1"
       offset_points="0.32509497,0.081673591 | 0.96561198,0.20227352 | 2.0401292,0.081986476 | 2.7091808,0.21551189 | 2.9349219,0.1000137 | 3.8065817,0.11309097 | 3.3811878,0.12633462"
       not_jump="false"
       sort_points="true"
       interpolator_type="CentripetalCatmullRom"
       interpolator_beta="0.2"
       start_linecap_type="zerowidth"
       linejoin_type="round"
       miter_limit="4"
       scale_width="1"
       end_linecap_type="zerowidth" /><inkscape:path-effect
       effect="powerstroke"
       id="path-effect26238"
       is_visible="true"
       lpeversion="1"
       offset_points="0.50252523,0.10439606 | 3.5749672,0.14529571 | 2.8460614,0.25892705 | 2.191132,0.062424492 | 1.0795956,0.17820241 | 4.3103243,0.21375078 | 5.9341501,0.048226608 | 5.3697687,0.21049982 | 4.9496439,0.055908788"
       not_jump="false"
       sort_points="true"
       interpolator_type="CentripetalCatmullRom"
       interpolator_beta="0.2"
       start_linecap_type="zerowidth"
       linejoin_type="round"
       miter_limit="4"
       scale_width="1"
       end_linecap_type="zerowidth" /></defs><g
     inkscape:label="Layer 1"
     inkscape:groupmode="layer"
     id="layer1"
     transform="translate(-484.6186,-106.09449)"><g
       id="g27756"
       transform="translate(34.417455,-19.076637)"><path
         style="fill:#c7c7c7;fill-opacity:1;stroke-width:0.492623;stroke-linejoin:round;paint-order:fill markers stroke"
         d="m 484.46038,131.43629 c 0,0 0.33097,0.60331 -1.04917,0.31374 -1.38016,-0.28958 -3.77867,-0.59319 -4.63716,-0.11154 -0.8585,0.48166 -0.92372,-1.67066 -1.58012,-2.91002 -0.65639,-1.23937 -5.48264,3.58067 -5.48264,3.58067 0,0 -1.54301,7.17052 -0.23804,10.97829 1.30493,3.8078 2.32297,5.74136 4.64084,7.04315 1.59698,0.89691 -0.094,0.45844 -1.83942,0.41661 -2.12057,-0.0508 -7.21663,0.77527 -8.69786,2.99671 -1.74656,2.61937 -2.89593,7.61936 -2.96396,9.60851 -0.068,1.98914 -0.28711,6.4128 -0.41209,6.64564 -0.12497,0.23284 -1.81715,2.8685 -4.41058,0.89573 -2.59343,-1.97277 -2.51309,-2.91976 -2.44242,-3.48435 0.0707,-0.56459 0.29655,-1.42261 0.49109,-1.67257 0.19453,-0.24997 0.2549,-0.42766 0.2549,-0.42766 0,0 -3.11765,1.07578 -4.21437,2.24327 -1.31119,1.39578 -1.93787,3.00695 -1.42713,4.66103 0.51076,1.65407 1.27784,3.41448 2.64255,4.6066 1.36472,1.1921 2.89723,1.82514 3.92123,1.83383 1.02398,0.009 2.16352,-0.23404 2.16352,-0.23404 0,0 -1.94452,2.05143 -2.55928,3.15809 -0.61476,1.10666 -2.05224,3.9203 -2.22344,5.17154 -0.17121,1.25123 -0.25415,5.54235 0.0289,6.34466 0.28299,0.8023 1.49609,3.44026 3.03481,4.47956 1.53871,1.0393 6.0866,3.10635 7.85706,3.53483 1.77047,0.42848 7.70309,1.71755 7.70309,1.71755 l 3.73034,0.25042 0.77007,-0.69646 c 0,0 2.50477,1.50227 4.01388,1.70408 1.5091,0.20181 4.04933,0.14626 4.33351,0.10348 0.28423,-0.0427 1.10827,-0.1996 1.10827,-0.1996 l 0.62753,-0.11735 c 0,0 1.11397,1.16464 2.48739,1.31662 1.3734,0.15198 2.25661,0.0214 2.25661,0.0214 l 4.07198,-0.90752 c 0,0 2.55037,0.94627 3.6147,1.12931 1.0643,0.18304 4.67182,0.6987 7.12659,-0.44559 2.45476,-1.14429 5.00963,-3.06293 5.56816,-4.67932 0.55851,-1.61639 0.81689,-4.02247 0.22421,-4.89688 -0.59266,-0.87439 -0.31153,-1.57733 -2.07512,0.10118 -1.76358,1.67856 -7.18578,-0.3628 -7.18578,-0.3628 0,0 -2.90872,-4.27659 -3.04071,-7.62683 -0.1279,-3.24645 -0.22684,-6.0812 2.16662,-12.19982 1.56632,-4.00411 1.79823,-11.21123 0.46957,-13.91363 -0.28928,-0.58835 -4.10372,-4.86539 -9.72078,-6.58066 -6.19401,-1.89146 -6.58232,-2.28199 -6.58232,-2.28199 0,0 5.43785,-0.39136 6.93338,-0.87559 1.49552,-0.48422 4.77321,-1.65784 4.77321,-1.65784 0,0 -1.92934,0.41956 -3.18807,-0.23927 -1.2587,-0.65885 -5.18501,-5.75209 -5.19002,-6.60294 -0.005,-0.85085 -0.0899,-4.47416 -0.0899,-4.47416 0,0 -0.65999,-2.21469 -1.25422,-2.77692 -0.59423,-0.56225 0.63438,-0.0597 0.80307,-1.18 0.16868,-1.12039 -5.31251,-3.30122 -5.31251,-3.30122 z"
         id="path14246"
         sodipodi:nodetypes="cssscssssssssscsssccssssscccssccsccssssscsssscscsscsscc" /><path
         style="fill:#505050;fill-opacity:1;stroke-width:0.492623;stroke-linejoin:round;paint-order:fill markers stroke"
         d="m 481.00404,145.12351 c 0,0 -4.60167,-1.9521 -5.88993,-3.72558 -1.28825,-1.77347 -3.88547,-5.94001 -3.83531,-6.59157 0.0502,-0.65156 0.92466,-3.99007 0.92466,-3.99007 0,0 1.74617,-3.9655 1.94233,-4.293 0.19616,-0.32752 0.5626,-2.24539 1.35244,-0.76277 0.78983,1.48263 2.76822,5.29892 2.95525,5.53488 0.18701,0.23597 0.1129,0.46645 0.1129,0.46645 0,0 1.71072,1.69584 3.9204,5.00018 2.20972,3.30434 -1.48274,8.36148 -1.48274,8.36148 z"
         id="path14248" /><path
         style="fill:#505050;fill-opacity:1;stroke-width:0.492623;stroke-linejoin:round;paint-order:fill markers stroke"
         d="m 476.96169,150.97231 -2.41469,5.30746 -2.01969,4.56184 c 0,0 -3.02729,7.15709 -3.42032,8.49293 -0.39302,1.33584 -1.15315,3.66285 -0.92176,4.3465 0.56025,1.65528 2.92809,1.25666 3.21431,1.14085 0.28624,-0.11583 0.29243,-0.11583 0.29243,-0.11583 0,0 -0.808,-0.16684 -0.94588,1.30721 -0.13787,1.47407 -0.66942,6.77979 -0.66942,6.77979 l 0.0804,6.7138 0.83813,6.48631 1.72993,6.1988 1.9988,5.5191 1.25958,2.82073 c 0,0 0.62572,1.31682 0.69636,-0.28421 0.0706,-1.60102 0.15055,-6.99569 0.15055,-6.99569 l -0.11788,-2.48852 -0.0172,-5.26065 0.40993,-5.55743 -3.1599,-0.1963 -0.4705,-1.64247 c 0,0 -0.69831,-5.09787 -0.6326,-5.31694 0.0657,-0.21905 0.029,-5.30893 0.029,-5.30893 l 0.19728,-3.06906 c 0,0 2.1972,-1.18206 2.74833,-1.88693 0.55113,-0.70487 2.63633,-4.10294 3.03685,-6.02802 0.40053,-1.92508 0.56387,-3.13392 0.43259,-3.23263 -0.1313,-0.0987 -0.74879,0.0374 -1.38557,1.24897 -0.63677,1.21169 -1.11436,2.01367 -1.11436,2.01367 l -2.73357,1.70204 c 0,0 -9.9e-4,-0.30583 0.1205,-0.91975 0.12185,-0.61392 1.25938,-5.5752 1.25938,-5.5752 l 0.78258,-2.96785 c 0,0 0.77915,-2.87476 0.91446,-3.19195 0.13532,-0.3172 1.12402,-2.59418 1.12402,-2.59418 0,0 0.20192,-0.54095 0.23713,0.42194 0.0351,0.96292 0.15168,0.82826 0.20523,1.37141 0.0535,0.54315 0.86054,5.8811 0.86054,5.8811 l 0.35841,2.40451 c 0,0 -0.26799,-0.37478 -0.29701,0.0327 -0.029,0.40744 0.0932,1.49849 0.29638,2.26393 0.20315,0.76543 0.85362,2.83986 1.07966,3.19034 0.22604,0.35049 1.33459,2.56893 2.62348,3.48895 1.2889,0.92001 -1.23322,2.24719 -1.23322,2.24719 l 0.0963,0.98803 c 0,0 1.29778,6.34316 1.45119,6.68744 0.15341,0.34428 1.90078,6.17442 1.90078,6.17442 l 1.75035,4.69469 1.9494,4.91423 2.88828,7.74932 2.08776,4.87719 c 0,0 1.23073,2.40955 1.51294,0.0206 0.28222,-2.38896 0.13512,-6.13964 0.13512,-6.13964 l -0.35207,-6.98691 -1.11017,-5.989 -1.45449,-5.09353 -1.99479,-5.87035 -1.63957,-4.21007 -0.53469,-1.22854 2.82897,0.89939 c 0,0 2.50298,0.51286 2.66762,0.51286 h 0.19083 c 0.0609,0 0.74049,-0.11537 0.63105,-0.65344 -0.10944,-0.53807 -0.60836,-1.61242 -0.60836,-1.61242 l -2.45228,-3.74939 c 0,0 -3.70336,-5.30274 -3.8453,-5.51494 -0.14196,-0.21219 -3.42138,-5.69252 -3.42138,-5.69252 l -3.27574,-5.5273 -0.8431,-1.35662 c 0,0 -2.71349,-0.5094 -3.98134,-1.20298 z"
         id="path16183"
         sodipodi:nodetypes="cccssscsccccccsccccccsccsssscccccscssccssssccscccccsccccccccsssccscccsc" /><path
         style="fill:#505050;fill-opacity:1;stroke-width:0.492623;stroke-linejoin:round;paint-order:fill markers stroke"
         d="m 488.97196,135.95834 c 0,0 1.03934,-1.3309 1.26016,-2.04278 0.22085,-0.71188 0.51792,-3.96526 0.28728,-4.22523 -0.23068,-0.25998 0.0234,-0.76362 -2.50003,-0.14199 -2.52342,0.62163 -4.15455,2.31666 -4.15455,2.31666 0,0 1.96125,0.1061 5.10714,4.09334 z"
         id="path14595"
         sodipodi:nodetypes="cssscc" /><path
         style="fill:#fcfcfc;fill-opacity:1;stroke-width:0.492623;stroke-linejoin:round;paint-order:fill markers stroke"
         d="m 482.86625,152.36205 c 0,0 -2.00025,-1.18788 -2.54674,-2.05343 -0.54652,-0.86555 -1.54242,-3.31506 -1.60092,-5.10336 -0.0585,-1.78831 -1.18596,-1.93317 -1.62651,-1.79907 -0.44053,0.13408 -1.53538,0.43207 -1.34977,1.76241 0.18557,1.33036 0.62028,3.57753 1.22027,4.36115 0.84379,1.10204 1.75478,1.99394 2.58764,2.33578 0.83287,0.34181 3.31603,0.49652 3.31603,0.49652 z"
         id="path15323"
         sodipodi:nodetypes="cssssssc" /><path
         style="fill:#ae2020;fill-opacity:1;stroke-width:0.492623;stroke-linejoin:round;paint-order:fill markers stroke"
         d="m 475.93413,153.32452 c 0,0 0.0945,2.20381 0.62858,3.72499 0.53408,1.52118 2.17525,5.85214 2.42887,6.13167 0.25359,0.27952 0.003,-0.0656 -0.24511,0.1739 -0.24805,0.23944 -0.81335,1.19856 -0.81335,1.19856 l -1.0835,-3.49972 c 0,0 -1.1698,-4.7864 -1.18464,-5.82539 -0.0149,-1.03898 -0.25715,-1.15278 -0.046,-1.51814 0.21116,-0.36535 0.31516,-0.38587 0.31516,-0.38587 z"
         id="path18304" /><path
         style="fill:#ae2020;fill-opacity:1;stroke-width:0.492623;stroke-linejoin:round;paint-order:fill markers stroke"
         d="m 479.48331,164.11217 c 0,0 0.22536,0.30583 0.3149,0.7348 0.0896,0.42897 0.51648,2.5244 1.3296,3.9178 0.81312,1.3934 1.58798,2.97423 2.98847,3.63465 1.40049,0.66043 2.10994,1.76825 2.37582,2.12407 0.26585,0.35583 4.25745,4.31282 4.25745,4.31282 l 3.28377,9.78617 -0.34916,-0.15298 c 0,0 -4.59043,-5.19679 -6.22217,-7.3124 -1.63177,-2.11562 -5.87578,-8.5762 -5.87578,-8.5762 l -2.848,-5.71115 c 0,0 0.4147,-1.83964 0.48403,-2.21274 0.0692,-0.3731 0.0969,-0.76154 0.26107,-0.54484 z"
         id="path18567" /><g
         id="g38108"
         transform="matrix(0.98524902,0,0,0.98524902,-7.951249,6.5970227)"><path
           style="opacity:1;fill:#000000;fill-opacity:1;fill-rule:nonzero;stroke:none;stroke-width:0.499999;stroke-linejoin:round;stroke-opacity:1;paint-order:fill markers stroke"
           d="m 499.52184,127.2328 c 0.002,-0.005 -0.0357,-0.0514 -0.33682,-0.17065 -0.30647,-0.12136 -0.78221,-0.27138 -1.36614,-0.38096 0,0 -0.0161,-0.003 -0.0161,-0.003 -0.91986,-0.17086 -2.33617,-0.30396 -3.92775,0.10426 -0.0261,-0.0786 -0.0567,-0.16366 -0.0918,-0.255 -0.0331,-0.0862 -0.0708,-0.17881 -0.11315,-0.27809 -0.10845,-0.25435 -0.2461,-0.54928 -0.41119,-0.8817 -0.30078,-0.60563 -0.68007,-1.31018 -1.08593,-2.02848 -0.38516,-0.68168 -0.77413,-1.34004 -1.10011,-1.87048 -0.16428,-0.26732 -0.30986,-0.49775 -0.43016,-0.68172 -0.0615,-0.094 -0.11613,-0.17556 -0.16333,-0.24379 -0.0483,-0.0698 -0.0888,-0.12567 -0.12114,-0.16717 a 0.06725507,0.05448207 73.708722 0 0 -0.0326,-0.0226 c -0.019,-0.005 -0.0381,-0.005 -0.0557,-0.002 -0.0176,0.003 -0.0345,0.009 -0.0505,0.0172 -0.0319,0.0157 -0.0649,0.0401 -0.0982,0.0698 -0.0343,0.0306 -0.071,0.0687 -0.10961,0.11285 -0.0395,0.0452 -0.0815,0.0975 -0.12546,0.15577 -0.0914,0.12113 -0.19189,0.2689 -0.29777,0.43591 -0.006,0.01 -0.0127,0.0201 -0.0191,0.0302 -0.10569,0.16798 -0.21774,0.35618 -0.33357,0.56014 -0.26063,0.45892 -0.54045,0.99737 -0.82093,1.58543 -0.29756,0.62386 -0.59751,1.30702 -0.88283,2.02663 -0.57749,1.4565 -1.12836,3.1459 -1.48119,4.90372 -0.13137,0.65447 -0.2384,1.33395 -0.30704,2.02453 -0.1066,1.07259 -0.11969,2.15477 -4.4e-4,3.19779 0.149,1.28146 0.40657,2.66504 0.84267,4.02864 0.4337,1.35611 1.0412,2.68424 1.88974,3.88013 0.25516,0.35961 0.53171,0.70671 0.83144,1.03887 0.69638,0.77173 1.52725,1.472 2.52541,2.05548 1.42087,0.83056 3.16571,1.41544 5.30879,1.64087 3.22543,0.33612 5.88561,0.29082 8.04863,0.0552 1.35358,-0.14741 2.5409,-0.37543 3.57527,-0.63715 1.38626,-0.35077 2.48421,-0.75884 3.32029,-1.099 0.43228,-0.17588 0.83023,-0.34866 1.13536,-0.47713 0.19959,-0.084 0.37418,-0.15554 0.53093,-0.21411 0.11073,-0.0414 0.21002,-0.075 0.30013,-0.10168 a 0.06445789,0.06244774 32.023348 0 0 -0.0304,-0.12285 c -0.95958,0.12952 -1.74841,6.7e-4 -2.40798,-0.21344 -0.31345,-0.10174 -0.62393,-0.23162 -0.93296,-0.38636 -0.29194,-0.1462 -0.5959,-0.32413 -0.9169,-0.55181 -0.57217,-0.40583 -1.07841,-0.88497 -1.54467,-1.38334 -0.40951,-0.43772 -0.85053,-0.96409 -1.00691,-1.14769 -0.17978,-0.21106 -0.28995,-0.32335 -0.35539,-0.39628 0.0412,0.0675 0.1363,0.23777 0.27819,0.45411 0.14829,0.22608 0.49766,0.75106 0.89213,1.25424 0.42368,0.54044 0.91847,1.08525 1.49963,1.53748 0.32786,0.25513 0.65205,0.45648 0.96725,0.61064 0.33677,0.16471 0.67962,0.28029 1.02605,0.35628 0.72751,0.15959 1.56042,0.16304 2.52124,-0.008 l -0.0304,-0.12285 c -0.0901,0.0349 -0.18777,0.0736 -0.29914,0.11749 -0.15208,0.0599 -0.33765,0.13314 -0.53492,0.20933 -0.31685,0.12237 -0.70596,0.26875 -1.15272,0.42274 -0.84857,0.2925 -1.95793,0.63132 -3.33747,0.92546 -1.03043,0.2197 -2.20488,0.41324 -3.54144,0.5491 -2.13352,0.21687 -4.76345,0.28788 -7.96596,-0.0127 -2.09702,-0.19458 -3.80418,-0.73571 -5.19266,-1.52533 -0.97597,-0.55502 -1.78861,-1.22958 -2.46336,-1.98269 -0.29036,-0.32408 -0.5564,-0.6643 -0.80007,-1.0177 -0.81058,-1.17563 -1.36734,-2.48803 -1.75238,-3.82404 -0.38726,-1.3437 -0.59914,-2.70516 -0.7243,-3.96587 -0.10136,-1.00267 -0.0839,-2.04824 0.0127,-3.09406 0.0622,-0.67281 0.15624,-1.33906 0.27049,-1.98343 0.30669,-1.72985 0.77994,-3.42159 1.28779,-4.88827 0.25119,-0.72545 0.51751,-1.41522 0.78689,-2.04704 0.25358,-0.59475 0.51065,-1.13978 0.75543,-1.60302 0.10869,-0.2057 0.21471,-0.39475 0.3158,-0.56272 0.006,-0.0101 0.0122,-0.0202 0.0183,-0.0302 0.10142,-0.167 0.198,-0.31305 0.28586,-0.43128 0.0422,-0.0568 0.0822,-0.10688 0.11939,-0.14941 0.0365,-0.0417 0.0698,-0.0756 0.0995,-0.10147 0.0295,-0.0256 0.0536,-0.0416 0.0719,-0.0497 0.009,-0.004 0.0151,-0.005 0.0189,-0.006 0.003,-2.6e-4 0.005,5.4e-4 0.003,5.1e-4 a 0.0501045,0.02841466 64.256356 0 0 -0.0326,-0.0226 c 0.0282,0.0405 0.0645,0.0962 0.10872,0.16718 0.0431,0.0692 0.0933,0.15225 0.14998,0.24822 0.11082,0.18753 0.2459,0.42334 0.39833,0.69597 0.30273,0.54145 0.66503,1.21222 1.02436,1.90452 0.38071,0.73349 0.73066,1.43813 1.01448,2.04864 0.15512,0.33368 0.28369,0.62455 0.38721,0.87366 0.0403,0.0969 0.0763,0.18636 0.10833,0.26875 0.0594,0.15264 0.10482,0.28181 0.1373,0.38882 a 0.17780256,0.17464257 73.45935 0 0 0.21669,0.11997 c 1.57903,-0.45816 3.02603,-0.40455 3.96516,-0.28042 -10e-6,0 0.0159,0.002 0.0159,0.002 0.58451,0.0781 1.04672,0.18501 1.36999,0.26611 0.29656,0.0744 0.36263,0.0882 0.36598,0.0802 z"
           id="path26236"
           sodipodi:nodetypes="cccsscc"
           inkscape:path-effect="#path-effect26238"
           inkscape:original-d="m 499.52184,127.2328 c 0,0 -2.66356,-1.11823 -5.76503,-0.23694 -0.42667,-1.46945 -2.95713,-5.91955 -3.44799,-6.58331 -0.56196,-0.15987 -5.02421,8.44558 -4.3139,15.03205 0.5536,5.13332 2.67005,11.63832 11.16541,12.47981 10.1754,1.0079 15.04263,-1.7181 16.87113,-2.34262 -3.71198,0.58198 -5.59298,-2.01502 -7.17465,-4.14167" /><path
           style="opacity:1;fill:#000000;fill-opacity:1;fill-rule:nonzero;stroke:none;stroke-width:0.499999;stroke-linejoin:round;stroke-opacity:1;paint-order:fill markers stroke"
           d="m 499.4889,127.02438 c 0.0113,0.008 0.0993,-0.0649 0.34175,-0.27645 0.10201,-0.089 0.24548,-0.2061 0.42755,-0.33723 0.39955,-0.28776 1.08405,-0.71619 2.07809,-1.05922 0.0684,-0.0236 0.13929,-0.0472 0.21272,-0.0707 1.00117,-0.32032 1.73746,-0.51289 2.29191,-0.59181 0.25215,-0.0359 0.44281,-0.0444 0.58685,-0.0356 0.1543,0.009 0.25352,0.0385 0.31407,0.073 -0.002,-0.001 -0.003,-0.002 -0.002,-0.001 8.2e-4,9.5e-4 0.002,0.003 0.005,0.007 0.001,0.002 0.003,0.005 0.005,0.007 0.004,0.007 0.009,0.0171 0.0141,0.0294 0.0144,0.0349 0.0289,0.0849 0.0424,0.15027 0.0134,0.0651 0.0253,0.14319 0.0351,0.2328 0.01,0.0903 0.0176,0.19154 0.0227,0.30194 0.0105,0.22744 0.01,0.48866 -0.004,0.7708 -0.015,0.30023 -0.0443,0.61373 -0.088,0.93163 -0.0884,0.64347 -0.22196,1.2133 -0.37255,1.73048 -0.0359,0.12336 -0.0713,0.23956 -0.10436,0.34474 -0.15638,0.49731 -0.3358,1.02571 -0.66952,1.51152 -0.10452,0.15216 -0.2269,0.30801 -0.36856,0.46119 a 0.09160784,0.0925821 46.433558 0 0 -0.004,0.12148 c 0.34577,0.41477 0.61124,0.89377 0.80963,1.43549 0.10127,0.27652 0.17974,0.55414 0.24483,0.82918 0.0595,0.25148 0.10669,0.51619 0.1438,0.79606 0.0812,0.61269 0.10597,1.23456 0.12644,1.81772 0.005,0.15366 0.0103,0.29843 0.0159,0.43759 0.0241,0.60324 0.0798,1.29721 0.0941,1.56684 0.0217,-0.24888 0.10973,-0.9838 0.13211,-1.56698 0.005,-0.13884 0.009,-0.28718 0.009,-0.44122 0.003,-0.58392 -0.0294,-1.22719 -0.11954,-1.84978 -0.0415,-0.28696 -0.0936,-0.55882 -0.15629,-0.81894 -0.0685,-0.28418 -0.15933,-0.57078 -0.27558,-0.85402 -0.21823,-0.53172 -0.49963,-0.98928 -0.83181,-1.40643 0.1264,-0.13864 0.23958,-0.27712 0.34141,-0.41084 0.36117,-0.47429 0.68408,-0.98666 0.89155,-1.48894 0.0448,-0.10856 0.0893,-0.22711 0.13197,-0.35686 0.17543,-0.53338 0.29222,-1.15506 0.33839,-1.81952 0.0231,-0.33187 0.0274,-0.65879 0.016,-0.9686 -0.0107,-0.29143 -0.0351,-0.56073 -0.0683,-0.79466 -0.0162,-0.11367 -0.0344,-0.21824 -0.0539,-0.31205 -0.0193,-0.0929 -0.04,-0.17536 -0.0613,-0.24563 -0.0211,-0.0696 -0.0434,-0.12901 -0.0666,-0.17533 -0.008,-0.0167 -0.0172,-0.0325 -0.0265,-0.0467 -0.004,-0.006 -0.008,-0.0112 -0.0117,-0.0166 -0.007,-0.009 -0.0149,-0.0184 -0.0237,-0.0268 -0.009,-0.008 -0.0189,-0.0164 -0.0309,-0.0232 -0.0807,-0.0454 -0.19534,-0.0959 -0.36593,-0.13192 -0.1596,-0.0337 -0.3673,-0.0545 -0.63838,-0.0467 -0.58184,0.0167 -1.38541,0.16455 -2.3922,0.48758 -0.0771,0.0247 -0.15146,0.05 -0.2231,0.0757 -1.05281,0.37705 -1.72372,0.89188 -2.10231,1.24971 -0.17122,0.16184 -0.29744,0.30539 -0.38673,0.41505 -0.24047,0.29532 -0.23077,0.38527 -0.22411,0.38977 z"
           id="path26240"
           sodipodi:nodetypes="csscc"
           inkscape:path-effect="#path-effect26242"
           inkscape:original-d="m 499.4889,127.02438 c 0,0 0.8408,-1.24569 2.99818,-1.93692 2.15741,-0.69124 2.98985,-0.60406 3.29467,-0.43166 0.30486,0.1724 0.65595,4.34285 -1.45829,6.61098 1.48458,1.79994 1.41101,4.15676 1.36352,6.94152" /><path
           style="opacity:1;fill:#000000;fill-opacity:1;stroke:none;stroke-width:0.499999;stroke-linejoin:round;stroke-opacity:1;paint-order:fill markers stroke"
           d="m 506.74402,140.01915 c 0,0 1.16944,-3.74872 1.87585,-4.97355 1.00062,-1.73498 1.43083,-3.79214 2.62563,0.1743 1.41852,4.70913 0.0332,7.20935 -0.91212,8.01725 -0.94536,0.80791 -1.00997,0.8715 -1.27516,0.80276 -0.26516,-0.0687 -2.16638,-2.52861 -2.16638,-2.52861 0,0 -0.57605,2.83823 -5.83229,3.97063 -2.83365,0.61048 -6.99223,-3.72561 -5.62602,-9.54013 0.93697,-3.98771 0.90031,-4.51891 1.54363,-4.50666 2.31324,0.044 6.82727,1.74261 9.76686,8.58401 z"
           id="path26745"
           sodipodi:nodetypes="csssscsssc" /><path
           style="opacity:1;fill:#fcfcfc;fill-opacity:1;stroke:none;stroke-width:0.499999;stroke-linejoin:round;stroke-opacity:1;paint-order:fill markers stroke"
           d="m 505.36683,138.81102 c 0.30828,1.46124 -0.621,4.69242 -1.87116,5.32075 -1.35007,0.67855 -1.76864,0.6778 -1.48928,-0.006 0.8242,-2.01744 1.25491,-7.50991 0.31269,-9.44932 -0.42555,-0.85748 2.59671,2.49687 3.04775,4.13457 z"
           id="path26801"
           sodipodi:nodetypes="csscc" /><path
           style="opacity:1;fill:#fcfcfc;fill-opacity:1;stroke:none;stroke-width:0.499999;stroke-linejoin:round;stroke-opacity:1;paint-order:fill markers stroke"
           d="m 510.13058,133.8307 c 0.23357,0.0152 1.99359,3.67166 0.97202,6.45307 -1.05372,2.86895 -1.26156,2.41191 -1.26156,2.41191 0,0 1.50978,-2.3796 0.4784,-5.07871 -0.6275,-1.64216 -1.09008,-2.12615 -1.04812,-2.40683 0.042,-0.28068 0.62569,-1.39465 0.85926,-1.37944 z"
           id="path26857"
           sodipodi:nodetypes="zscszz" /><path
           style="opacity:1;fill:#000000;fill-opacity:1;stroke:none;stroke-width:0.499999;stroke-linejoin:round;stroke-opacity:1;paint-order:fill markers stroke"
           d="m 513.3562,145.61271 c 0,0 1.32038,-1.17082 1.91451,-1.66332 0.65783,-0.5453 2.64662,-3.0952 2.04884,-1.02793 -0.39699,1.37289 -2.47613,2.97285 -3.45811,2.75303 -0.66654,-0.14921 -0.50524,-0.0618 -0.50524,-0.0618 z"
           id="path26859"
           sodipodi:nodetypes="csssc" /><path
           style="opacity:1;fill:#030303;fill-opacity:1;fill-rule:nonzero;stroke:none;stroke-width:0.499999;stroke-linejoin:round;stroke-opacity:1;paint-order:fill markers stroke"
           d="m 498.45809,147.96286 v 0 c 0.005,-0.0129 -0.52748,-0.16215 -1.59824,-0.99713 -0.11589,-0.0904 -0.23343,-0.18732 -0.35099,-0.2911 -0.28612,-0.25258 -0.60713,-0.57744 -0.9033,-0.97898 -0.35815,-0.48556 -0.69544,-1.1039 -0.88081,-1.87015 -0.17715,-0.73182 -0.29536,-1.40179 -0.39984,-2.03482 -0.0983,-0.59526 -0.18162,-1.14168 -0.28725,-1.58817 -0.053,-0.22388 -0.11269,-0.42829 -0.18519,-0.60949 -0.0729,-0.18234 -0.15986,-0.34375 -0.26807,-0.47904 -0.11054,-0.13819 -0.24188,-0.24722 -0.3987,-0.32287 -0.16012,-0.0772 -0.33937,-0.11606 -0.53728,-0.12161 -0.0327,-9.2e-4 -0.065,-0.001 -0.0968,-0.001 -0.15841,3.7e-4 -0.31239,0.0131 -0.45907,0.0415 -0.17005,0.0329 -0.33062,0.0869 -0.47685,0.16713 -0.14298,0.0785 -0.27002,0.18079 -0.37781,0.30954 -0.10611,0.12675 -0.19135,0.27643 -0.2556,0.44934 -0.0638,0.1718 -0.1067,0.36585 -0.12932,0.58258 -0.0227,0.21769 -0.0251,0.45867 -0.008,0.72346 0.0361,0.54442 0.15613,1.18785 0.35334,1.92717 0.21522,0.80722 0.47786,1.45655 0.76785,1.99041 0.33791,0.6221 0.70987,1.0807 1.06686,1.42968 0.0357,0.0349 0.0712,0.0687 0.10658,0.10143 0.39691,0.36772 0.82059,0.64856 1.24508,0.87054 0.64757,0.33862 1.28929,0.53202 1.62337,0.62674 -0.33299,-0.10656 -0.96172,-0.32402 -1.59196,-0.68418 -0.41223,-0.23557 -0.81797,-0.52638 -1.19595,-0.89756 -0.0336,-0.033 -0.0674,-0.0671 -0.10135,-0.10223 -0.33923,-0.35149 -0.6883,-0.80864 -1.00242,-1.42359 -0.26957,-0.52774 -0.51209,-1.16846 -0.70842,-1.96504 -0.18124,-0.73551 -0.28335,-1.36457 -0.30487,-1.88731 -0.0104,-0.25362 -0.002,-0.4787 0.0247,-0.677 0.0263,-0.19743 0.0699,-0.36595 0.12811,-0.5088 0.0584,-0.14326 0.13113,-0.25991 0.21539,-0.35454 0.0853,-0.0958 0.18397,-0.17082 0.29506,-0.2284 0.11423,-0.0592 0.24318,-0.10077 0.38619,-0.12647 0.12355,-0.0222 0.25685,-0.0324 0.39868,-0.0321 0.0285,6e-5 0.0574,5.6e-4 0.0869,0.001 0.16004,0.005 0.29126,0.0356 0.40305,0.089 0.10815,0.0517 0.20226,0.12694 0.28642,0.22993 0.0837,0.10245 0.15781,0.23259 0.22496,0.39408 0.0667,0.16049 0.12484,0.34765 0.17888,0.56212 0.10876,0.43165 0.19776,0.96148 0.30648,1.56307 0.11452,0.63366 0.2445,1.30966 0.43552,2.0481 0.20755,0.80277 0.5744,1.44334 0.95759,1.93887 0.31688,0.40979 0.65725,0.73621 0.95856,0.9863 0.12388,0.10283 0.24775,0.19801 0.36978,0.28581 1.12764,0.8114 1.69364,0.8765 1.69827,0.86356 z"
           id="path27366"
           sodipodi:nodetypes="csssc"
           inkscape:path-effect="#path-effect28457"
           inkscape:original-d="m 498.45809,147.96286 c 0,0 -3.1091,-1.11227 -3.85877,-4.10595 -0.74967,-2.99367 -0.50385,-4.97816 -1.95582,-5.02115 -1.50248,-0.0445 -2.11545,0.98406 -1.33991,4.00628 0.78354,3.05339 2.37555,4.343 4.70492,5.0457" /><path
           style="opacity:1;fill:#030303;fill-opacity:1;fill-rule:nonzero;stroke:none;stroke-width:0.499999;stroke-linejoin:round;stroke-opacity:1;paint-order:fill markers stroke"
           d="m 493.11261,140.46636 c -0.0587,0.0769 -0.22964,0.2905 -0.3521,0.46154 -0.146,0.20391 -0.3187,0.45612 -0.45973,0.68504 -0.13507,0.21927 -0.27288,0.46615 -0.3716,0.6594 -0.0746,0.14603 -0.15059,0.32718 -0.18071,0.39262 0.0453,-0.056 0.17382,-0.20458 0.27153,-0.33627 0.12932,-0.17427 0.28932,-0.40737 0.4258,-0.62577 0.14249,-0.22802 0.29177,-0.49476 0.40964,-0.71612 0.0989,-0.18569 0.21431,-0.4337 0.25717,-0.52044 z"
           id="path28459"
           inkscape:path-effect="#path-effect28461"
           inkscape:original-d="m 493.11261,140.46636 -1.36414,2.1986"
           sodipodi:nodetypes="cc" /><path
           style="opacity:1;fill:#030303;fill-opacity:1;fill-rule:nonzero;stroke:none;stroke-width:0.499999;stroke-linejoin:round;stroke-opacity:1;paint-order:fill markers stroke"
           d="m 492.22413,140.69444 v 0 c -0.0106,3.4e-4 -0.0434,0.0353 -0.0432,0.18445 9e-5,0.0673 0.008,0.16274 0.0228,0.2771 0.0165,0.12482 0.0388,0.24855 0.0618,0.36046 0.0257,0.12516 0.0442,0.22131 0.0825,0.33107 0.0472,0.13528 0.12908,0.28803 0.16788,0.36671 -0.0122,-0.0685 -0.0338,-0.27289 -0.054,-0.39583 -0.0194,-0.11768 -0.0427,-0.20129 -0.0673,-0.32773 -0.0221,-0.11363 -0.0411,-0.22758 -0.0601,-0.3532 -0.0167,-0.11057 -0.0297,-0.2054 -0.0417,-0.26897 -0.0269,-0.14274 -0.0559,-0.17447 -0.0686,-0.17406 z"
           id="path28463"
           inkscape:path-effect="#path-effect28465"
           inkscape:original-d="m 492.22413,140.69444 c 0,0 0.0226,0.69951 0.29173,1.51979"
           sodipodi:nodetypes="cc" /><path
           style="opacity:1;fill:#030303;fill-opacity:1;fill-rule:nonzero;stroke:none;stroke-width:0.499999;stroke-linejoin:round;stroke-opacity:1;paint-order:fill markers stroke"
           d="m 492.84355,143.84236 c 0.0103,0.005 0.0435,-0.0105 0.10115,-0.0938 0.0364,-0.0525 0.0802,-0.12564 0.1251,-0.2047 0.0128,-0.0225 0.0257,-0.0456 0.0385,-0.0687 0.0373,-0.0674 0.0797,-0.14046 0.11425,-0.20599 0.0168,-0.0319 0.0319,-0.0622 0.0437,-0.0898 0.006,-0.0148 0.0121,-0.0306 0.0172,-0.0462 0.0186,-0.0565 0.0295,-0.11033 0.0361,-0.1307 -0.0217,0.0131 -0.064,0.0343 -0.11405,0.0792 -0.0127,0.0114 -0.0251,0.0237 -0.0362,0.0363 -0.0207,0.0236 -0.0414,0.0515 -0.062,0.0826 -0.0428,0.0644 -0.0832,0.1389 -0.1203,0.20892 -0.0126,0.0238 -0.0247,0.0476 -0.0364,0.0713 -0.041,0.0833 -0.0743,0.16214 -0.0947,0.22348 -0.0323,0.097 -0.0223,0.1333 -0.0124,0.13802 z"
           id="path28467"
           inkscape:path-effect="#path-effect28469"
           inkscape:original-d="m 492.84355,143.84236 c 0,0 0.2858,-0.60001 0.47604,-0.8398" /><path
           style="opacity:1;fill:#020202;fill-opacity:1;fill-rule:nonzero;stroke:none;stroke-width:0.499999;stroke-linejoin:round;stroke-opacity:1;paint-order:fill markers stroke"
           d="m 484.88316,166.09963 c 0.005,0.0127 0.28653,-0.0746 1.16476,-0.43791 0.47102,-0.19487 1.0373,-0.43097 1.63532,-0.70603 0.21571,-0.0992 0.43532,-0.2034 0.65609,-0.31254 0.58717,-0.29025 1.1852,-0.60311 1.74046,-0.93129 0.19847,-0.1173 0.3887,-0.23493 0.56893,-0.35258 0.71216,-0.46488 1.19947,-0.89851 1.48265,-1.1593 -0.2324,0.16026 -0.98849,0.60652 -1.60632,0.95612 -0.18671,0.10565 -0.37704,0.21284 -0.57788,0.3248 -0.5656,0.31529 -1.1394,0.6262 -1.72547,0.92983 0.51337,-0.26597 -1.15553,0.59841 -0.64215,0.33244 -0.58486,0.30218 -1.12398,0.57785 -1.58406,0.80202 -0.65925,0.32122 -1.1164,0.5446 -1.11233,0.55444 z"
           id="path29503"
           inkscape:path-effect="#path-effect29505"
           inkscape:original-d="m 484.88316,166.09963 c 0,0 4.91255,-2.03398 7.24821,-3.89965"
           sodipodi:nodetypes="cc" /><path
           style="opacity:1;fill:#000000;fill-opacity:1;fill-rule:nonzero;stroke:none;stroke-width:0.499999;stroke-linejoin:round;stroke-opacity:1;paint-order:fill markers stroke"
           d="m 491.15979,148.74757 v 0 c -0.01,-0.002 -0.0556,0.0422 -0.0794,0.37401 -0.0269,0.37485 0.003,0.91267 0.10637,1.55897 0.0336,0.2095 0.0725,0.41932 0.11531,0.62646 0.11183,0.54165 0.27916,1.20915 0.54523,2.05098 0.2597,0.82168 0.61493,1.94025 1.21796,3.42101 0.56854,1.39608 1.25046,2.82009 1.57616,3.29051 0.14568,0.21043 0.25856,0.25705 0.3108,0.30905 -0.01,-0.0731 0.0215,-0.19072 -0.0544,-0.4342 -0.14356,-0.46054 -0.88247,-2.03763 -1.44372,-3.32897 -0.62431,-1.43644 -1.05939,-2.55622 -1.31688,-3.35021 -0.26533,-0.81819 -0.45163,-1.50003 -0.57676,-2.01611 -0.0491,-0.20259 -0.0956,-0.40735 -0.13775,-0.61171 -0.13441,-0.65114 -0.19691,-1.13001 -0.22648,-1.51595 -0.0248,-0.32335 -0.0266,-0.37199 -0.0364,-0.37384 z"
           id="path30567"
           sodipodi:nodetypes="cc"
           inkscape:path-effect="#path-effect30569"
           inkscape:original-d="m 491.15979,148.74757 c 0,0 -0.54031,2.87093 3.7924,11.63099" /><path
           style="opacity:1;fill:#020202;fill-opacity:1;fill-rule:nonzero;stroke:none;stroke-width:0.499999;stroke-linejoin:round;stroke-opacity:1;paint-order:fill markers stroke"
           d="m 496.28412,147.89177 h 0 c -0.0209,0.0122 -5.3e-4,0.19938 0.68858,1.43906 0.42725,0.76861 1.24774,2.19806 2.56875,4.4397 1.32707,2.25192 3.05519,5.14573 4.96713,8.28944 0.26588,0.43915 0.60428,0.93587 0.96549,1.44357 0.38746,0.5446 0.82394,1.13333 1.22328,1.66865 0.12866,0.17248 0.49805,0.66609 0.62671,0.83857 0.7406,0.99096 1.36651,1.82506 1.91766,2.61319 0.38766,0.55435 0.71795,1.05798 0.97239,1.50329 0.12979,0.22717 0.24061,0.44053 0.32878,0.63768 0.0874,0.19551 0.15281,0.37557 0.19188,0.53683 0.0382,0.15776 0.0508,0.29586 0.0352,0.41104 -0.008,0.0558 -0.0217,0.10587 -0.0425,0.15009 -0.0152,0.0322 -0.034,0.0615 -0.0567,0.0879 -0.008,0.009 -0.0162,0.0179 -0.025,0.0263 -0.0342,0.0326 -0.076,0.0605 -0.1267,0.0828 -0.0509,0.0225 -0.11096,0.0395 -0.18105,0.0502 -0.14091,0.0214 -0.31997,0.0164 -0.54255,-0.0201 -1.92967,-0.30947 -3.94033,-0.99202 -5.9746,-1.87482 -10e-6,-1e-5 -0.0369,-0.0161 -0.037,-0.0161 -1.71789,-0.74747 -3.44241,-1.65953 -5.04542,-2.72182 -0.21777,-0.14025 -0.44626,-0.34265 -0.6784,-0.59657 -0.23835,-0.26072 -0.47425,-0.56879 -0.70093,-0.90566 -0.50552,-0.75124 -0.94209,-1.60945 -1.27425,-2.38795 -1e-5,-1e-5 -0.007,-0.0169 -0.007,-0.0169 -0.41963,-0.98613 -0.71387,-1.90355 -0.8937,-2.65335 -0.10034,-0.41836 -0.17657,-0.83087 -0.2186,-1.22151 -0.0346,-0.32194 -0.0478,-0.64595 -0.0256,-0.94795 0.002,-0.0322 0.005,-0.0642 0.008,-0.0961 l -0.0601,0.0549 c 0.008,2.5e-4 0.0191,0.003 0.0328,0.009 0.0133,0.006 0.0287,0.0157 0.0464,0.0298 0.0342,0.0274 0.0736,0.0692 0.11839,0.12778 0.0429,0.0561 0.0893,0.12563 0.13912,0.20833 0.0487,0.0808 0.10001,0.17294 0.15388,0.27548 0.107,0.2037 0.22143,0.44325 0.34092,0.70409 0.12189,0.26607 0.24817,0.5524 0.37148,0.83162 0.2385,0.54006 0.4456,1.00619 0.64017,1.38882 0.0502,0.0987 0.10124,0.19499 0.15227,0.28742 0.14545,0.26345 0.28356,0.48279 0.40679,0.65399 0.0721,0.10014 0.13564,0.17915 0.19118,0.242 0.0779,0.0882 0.13467,0.13848 0.17155,0.17069 -0.0246,-0.0421 -0.0575,-0.10962 -0.10346,-0.21439 -0.0331,-0.0754 -0.071,-0.16555 -0.11737,-0.27755 -0.0685,-0.16549 -0.18477,-0.45149 -0.29026,-0.70049 -0.0407,-0.096 -0.0835,-0.19549 -0.12773,-0.29591 -0.1565,-0.35499 -0.40383,-0.885 -0.64898,-1.38259 -0.13549,-0.27502 -0.27801,-0.55577 -0.41794,-0.81672 -0.13697,-0.25543 -0.27073,-0.49057 -0.39659,-0.69029 -0.0634,-0.10063 -0.12436,-0.19153 -0.18251,-0.27149 -0.0594,-0.0817 -0.11575,-0.15175 -0.16876,-0.20916 -0.0548,-0.0593 -0.10675,-0.10593 -0.15586,-0.13825 -0.0256,-0.0169 -0.0511,-0.0303 -0.0765,-0.0395 -0.0263,-0.01 -0.053,-0.0148 -0.0798,-0.0143 a 0.06165046,0.06059041 2.1160743 0 0 -0.0601,0.0549 c -0.003,0.0329 -0.006,0.066 -0.008,0.0992 -0.0222,0.31042 -0.0116,0.64241 0.0181,0.96945 0.036,0.39698 0.10298,0.81808 0.19233,1.24355 0.1606,0.76482 0.42697,1.69943 0.82921,2.70885 0,-10e-6 0.007,0.0173 0.007,0.0173 0.31776,0.795 0.73089,1.6817 1.21857,2.47432 0.21866,0.3554 0.45039,0.68836 0.69006,0.97735 0.23224,0.28003 0.47405,0.52134 0.7208,0.70124 1.57278,1.12685 3.33793,2.11976 5.08017,2.85571 1e-5,1e-5 0.0378,0.0159 0.0378,0.0159 2.09586,0.88067 4.18804,1.37337 6.1533,1.60045 0.23821,0.027 0.43913,0.0238 0.60442,-0.009 0.0827,-0.0164 0.15729,-0.0405 0.22349,-0.0724 0.0661,-0.0319 0.12372,-0.0717 0.17255,-0.11934 0.0125,-0.0122 0.0245,-0.025 0.0358,-0.0382 0.0328,-0.0384 0.06,-0.0803 0.082,-0.12501 0.0302,-0.0614 0.0505,-0.12789 0.0627,-0.19812 0.0249,-0.14336 0.0167,-0.30606 -0.015,-0.48034 -0.0326,-0.17902 -0.0909,-0.37581 -0.16932,-0.58534 -0.0792,-0.21165 -0.18021,-0.43958 -0.29925,-0.68029 -0.23334,-0.47185 -0.54091,-1.0027 -0.90786,-1.57999 -0.51506,-0.8103 -1.13273,-1.69074 -1.85768,-2.6805 -0.20289,-0.27699 -0.40322,-0.54863 -0.6208,-0.84366 -0.39421,-0.53451 -0.83162,-1.12728 -1.21402,-1.66395 -0.35924,-0.50418 -0.6921,-0.98948 -0.95216,-1.41212 -1.96378,-3.20675 -3.62623,-5.94591 -5.0255,-8.2497 -1.38626,-2.28237 -2.17118,-3.57091 -2.67559,-4.37412 -0.75399,-1.20065 -0.90356,-1.31183 -0.92581,-1.29878 z"
           id="path30024"
           sodipodi:nodetypes="cssscc"
           inkscape:path-effect="#path-effect30026"
           inkscape:original-d="m 496.28412,147.89177 c 0,0 3.61818,6.16788 8.42568,14.0454 2.0537,3.36518 8.75969,10.76737 5.07104,10.2592 -4.18497,-0.57655 -8.26418,-2.54301 -11.16414,-4.5424 -1.84324,-1.27083 -3.97661,-6.49612 -3.72906,-9.00865 0.57146,-0.004 2.08127,4.16176 2.76532,4.98981" /><path
           style="opacity:1;fill:#000000;fill-opacity:1;fill-rule:nonzero;stroke:none;stroke-width:0.499999;stroke-linejoin:round;stroke-opacity:1;paint-order:fill markers stroke"
           d="m 497.32173,163.09612 h 0 c -0.002,0.0104 0.0288,0.0358 0.26658,0.11564 0.37406,0.12566 1.49965,0.48529 2.75432,0.82612 0.0246,0.007 0.049,0.0133 0.0732,0.0198 0.88478,0.23811 1.65486,0.42068 2.4284,0.61879 -2e-5,-1e-5 0.0154,0.004 0.0154,0.004 0.34801,0.0892 0.7554,0.19095 1.09532,0.28038 0.45238,0.11903 0.72218,0.19855 0.86938,0.24698 -0.13892,-0.0768 -0.382,-0.20645 -0.82055,-0.39063 -0.33425,-0.14037 -0.71269,-0.28286 -1.06463,-0.40305 0,0 -0.0151,-0.005 -0.0151,-0.005 -0.74522,-0.25416 -1.53416,-0.49853 -2.41197,-0.7202 -0.0244,-0.006 -0.049,-0.0123 -0.0738,-0.0185 -1.27168,-0.31612 -2.43006,-0.50271 -2.82616,-0.55889 -0.24852,-0.0352 -0.28803,-0.0252 -0.29035,-0.0152 z"
           id="path30028"
           inkscape:path-effect="#path-effect30030"
           inkscape:original-d="m 497.32173,163.09612 c 0,0 5.68237,1.31727 7.50255,2.11163" /><path
           style="opacity:1;fill:#020202;fill-opacity:1;fill-rule:nonzero;stroke:none;stroke-width:0.499999;stroke-linejoin:round;stroke-opacity:1;paint-order:fill markers stroke"
           d="m 496.30496,156.47512 c -0.0228,0.0123 0.0304,0.24379 0.46445,1.09355 0.22449,0.43944 0.54343,1.04693 0.94276,1.75059 0.37168,0.65493 0.77923,1.33309 1.18584,1.94999 0.11293,0.17133 0.23071,0.35054 0.35725,0.54058 0.70188,1.05406 1.42641,2.04126 1.73491,2.20107 0.0817,0.0423 0.14805,0.007 0.17699,0.008 0.005,-0.0291 0.052,-0.0862 0.0277,-0.17442 -0.0816,-0.2968 -0.88399,-1.316 -1.54964,-2.29667 -0.12593,-0.18554 -0.24565,-0.36542 -0.35534,-0.5346 -0.50059,-0.77208 -0.72498,-1.11486 -1.23162,-1.90299 -0.4135,-0.64322 -0.82365,-1.28724 -1.06563,-1.66881 -0.5094,-0.80321 -0.65972,-0.98126 -0.68772,-0.96611 z"
           id="path30032"
           inkscape:path-effect="#path-effect30034"
           inkscape:original-d="m 496.30496,156.47512 c 0,0 2.59334,4.79088 4.8622,7.5436" /><path
           style="opacity:1;fill:#212121;fill-opacity:1;fill-rule:nonzero;stroke:none;stroke-width:0.499999;stroke-linejoin:round;stroke-opacity:1;paint-order:fill markers stroke"
           d="m 493.66513,148.26144 c -0.009,-0.005 -0.13777,0.13745 -0.29746,0.43485 -0.12781,0.23805 -0.28589,0.5832 -0.45631,0.98055 -0.0558,0.13004 -0.11064,0.2604 -0.16609,0.39337 -0.19977,0.47908 -0.39961,0.97431 -0.5502,1.4731 -0.15702,0.52008 -0.24077,0.97501 -0.29092,1.26616 0.0537,-0.20745 0.2422,-0.8037 0.39183,-1.23338 0.17071,-0.49019 0.34714,-0.98577 0.54966,-1.46368 0.0557,-0.13132 0.11331,-0.26133 0.17155,-0.38869 0.17637,-0.38565 0.35106,-0.72951 0.46358,-0.97073 0.1754,-0.376 0.19732,-0.48439 0.18436,-0.49155 z"
           id="path30559"
           inkscape:path-effect="#path-effect30561"
           inkscape:original-d="m 493.66513,148.26144 c 0,0 -1.28196,2.32089 -1.76098,4.54803" /><path
           style="opacity:1;fill:#020202;fill-opacity:1;fill-rule:nonzero;stroke:none;stroke-width:0.499999;stroke-linejoin:round;stroke-opacity:1;paint-order:fill markers stroke"
           d="m 491.35061,154.6921 c -0.0204,-0.005 -0.15093,0.23309 -0.40527,1.13497 -0.19488,0.69106 -0.42238,1.64987 -0.67702,2.71361 0.004,-0.0163 -0.0559,0.23342 -0.052,0.21714 -0.22791,0.95071 -0.47368,1.98611 -0.66407,2.90012 -0.0661,0.31709 -0.12153,0.60111 -0.16586,0.85055 -0.0304,0.17133 -0.058,0.34131 -0.0816,0.50324 -0.0802,0.54814 -0.0962,0.85668 -0.10381,1.02444 0.0299,-0.16841 0.0935,-0.46289 0.2168,-1.00334 0.38786,-1.70071 -0.27504,1.20544 0.11281,-0.49527 0.21502,-0.9515 -0.0245,0.10865 0.19051,-0.84285 0.21025,-0.92432 0.44587,-1.92649 0.68552,-2.89043 0.0181,-0.0727 0.0361,-0.14481 0.0541,-0.21639 0.26764,-1.06441 0.52465,-2.00538 0.6893,-2.70802 0.21357,-0.91147 0.22256,-1.18195 0.20063,-1.18777 z"
           id="path30563"
           inkscape:path-effect="#path-effect30565"
           inkscape:original-d="m 491.35061,154.6921 c 0,0 -1.91307,7.21113 -2.14969,9.34407" /><path
           style="opacity:1;fill:#000000;fill-opacity:1;fill-rule:nonzero;stroke:none;stroke-width:0.499999;stroke-linejoin:round;stroke-opacity:1;paint-order:fill markers stroke"
           d="m 490.73133,149.54709 c -0.009,5e-4 -0.0307,0.0505 -0.0265,0.38189 0.004,0.33651 0.0359,0.84171 0.0947,1.37022 0.0567,0.50991 0.13825,1.03645 0.23756,1.60776 0.053,0.30464 0.12059,0.67645 0.19826,1.07981 0.17277,0.89711 0.36632,2.1138 0.76625,3.61631 0.36947,1.38811 0.82554,2.59851 1.02529,2.74562 0.0739,0.0544 0.13668,-0.0546 0.16382,-0.0655 0.0273,-0.0109 0.14743,0.0242 0.16382,-0.0655 0.0387,-0.21174 -0.44538,-1.43709 -0.88685,-2.7545 -0.46909,-1.39983 -0.83125,-2.68676 -1.0032,-3.52209 -0.0836,-0.40597 -0.14845,-0.76396 -0.20081,-1.07305 -0.0921,-0.54353 -0.17504,-1.11792 -0.24622,-1.59717 -0.0557,-0.37495 -0.17362,-1.16826 -0.20291,-1.35133 -0.0521,-0.32572 -0.0715,-0.37314 -0.0832,-0.37249 z"
           id="path30571"
           inkscape:path-effect="#path-effect30573"
           inkscape:original-d="m 490.73133,149.54709 c 0,0 0.29768,5.3291 2.45938,10.73612"
           sodipodi:nodetypes="cc" /><path
           style="opacity:1;fill:#020202;fill-opacity:1;fill-rule:nonzero;stroke:none;stroke-width:0.499999;stroke-linejoin:round;stroke-opacity:1;paint-order:fill markers stroke"
           d="m 490.96951,151.32265 c -0.009,-0.003 -0.0552,0.0648 -0.2486,0.5292 -0.1908,0.45827 -0.47192,1.17698 -0.73609,1.88588 -0.38692,1.03828 -0.79853,2.19069 -1.22162,3.43568 -0.0363,0.10677 -0.073,0.2151 -0.10997,0.32491 -0.48496,1.43881 -0.98665,2.9977 -1.36927,4.36432 -0.0311,0.111 -0.0612,0.22023 -0.0904,0.3276 -0.15329,0.56393 -0.29729,1.14948 -0.40723,1.67637 -0.0661,0.31667 -0.11466,0.58686 -0.14938,0.8167 -0.0488,0.32301 -0.0645,0.52916 -0.0717,0.6527 0.0197,-0.12156 0.0585,-0.3252 0.13466,-0.64038 0.0544,-0.2252 0.12331,-0.48848 0.20996,-0.79895 0.14725,-0.52757 0.31407,-1.07884 0.48835,-1.64728 0.0325,-0.10603 0.0657,-0.21392 0.0997,-0.3237 0.42639,-1.37715 0.91707,-2.87898 1.40886,-4.34205 0.002,-0.007 0.10699,-0.31777 0.1093,-0.32464 0.32862,-0.97462 0.84086,-2.47536 1.16949,-3.44998 0.23361,-0.69141 0.49188,-1.47331 0.63239,-1.92186 0.1503,-0.47983 0.16136,-0.5609 0.15156,-0.56452 z"
           id="path30575"
           sodipodi:nodetypes="cc"
           inkscape:path-effect="#path-effect30577"
           inkscape:original-d="m 490.96951,151.32265 c 0,0 -4.07824,11.04505 -4.40431,14.01336" /><path
           style="opacity:1;fill:#020202;fill-opacity:1;fill-rule:nonzero;stroke:none;stroke-width:0.499999;stroke-linejoin:round;stroke-opacity:1;paint-order:fill markers stroke"
           d="m 493.63143,148.33512 c -0.0167,0.002 -0.006,0.3475 0.13458,1.52949 0.10228,0.86105 0.25316,2.02189 0.42251,3.25319 0.0241,0.17494 0.0485,0.35118 0.0731,0.52794 0.14342,1.02755 0.29638,2.13536 0.43517,3.02379 0.0657,0.42059 0.12528,0.77285 0.17952,1.05193 0.0208,0.10688 0.0426,0.2104 0.0645,0.30781 0.0439,0.19514 0.0865,0.35736 0.12431,0.48495 0.0537,0.18118 0.0914,0.27182 0.11151,0.32171 -0.003,-0.0506 -0.006,-0.15587 -0.0188,-0.33856 -0.009,-0.13104 -0.0237,-0.2994 -0.0448,-0.4966 -0.0105,-0.0988 -0.0227,-0.20387 -0.0363,-0.31147 -0.0354,-0.27861 -0.0865,-0.63698 -0.14795,-1.05495 -0.16064,-1.09194 -0.28902,-1.92774 -0.44966,-3.01968 0.004,0.0247 -0.0808,-0.55193 -0.0772,-0.52718 -0.18091,-1.2343 -0.35132,-2.38216 -0.48736,-3.24343 -0.18568,-1.17556 -0.26584,-1.5113 -0.28316,-1.50894 z"
           id="path31112"
           inkscape:path-effect="#path-effect31114"
           inkscape:original-d="m 493.63143,148.33512 c 0,0 1.25507,9.21313 1.54522,10.50081" /><path
           style="opacity:1;fill:#020202;fill-opacity:1;fill-rule:nonzero;stroke:none;stroke-width:0.499999;stroke-linejoin:round;stroke-opacity:1;paint-order:fill markers stroke"
           d="m 504.3625,170.6154 c -0.0214,0.009 0.24803,0.77956 1.19493,3.29599 0.45804,1.21725 1.25896,3.36815 2.09192,5.87357 0.82615,2.48492 1.71701,5.41451 2.41218,8.37097 0.72151,3.06845 1.15876,5.85313 1.23152,8.2172 -0.0184,-0.60194 0.0843,2.78916 0.066,2.18722 0.0671,2.28149 0.12019,4.05131 0.13061,5.46858 0.007,0.97531 -0.006,1.75475 -0.0495,2.35309 -0.0221,0.30648 -0.0518,0.56417 -0.0901,0.77451 -0.0389,0.21359 -0.0861,0.37501 -0.14096,0.48774 -0.0275,0.0565 -0.056,0.0988 -0.0847,0.12891 -0.0143,0.015 -0.0284,0.0267 -0.0423,0.0357 -0.0138,0.009 -0.0275,0.0152 -0.0411,0.0191 -0.0267,0.008 -0.0563,0.008 -0.0906,-0.003 -0.002,-6.1e-4 -0.004,-0.001 -0.006,-0.002 -0.034,-0.0114 -0.072,-0.0327 -0.114,-0.0659 -0.0456,-0.036 -0.0944,-0.0847 -0.14617,-0.14652 -0.0528,-0.0631 -0.1082,-0.13899 -0.16605,-0.22756 -0.1184,-0.18124 -0.24665,-0.41441 -0.38595,-0.6982 -0.27859,-0.56755 -0.60819,-1.35146 -1.0101,-2.38067 -0.37562,-0.9619 -0.83143,-2.18189 -1.39911,-3.73446 -0.15369,-0.41867 -0.30857,-0.8376 -0.46501,-1.2577 -1.97898,-5.31428 -4.31749,-11.19864 -5.90459,-15.66805 -0.97068,-2.73353 -1.60368,-4.76331 -2.11718,-6.58298 9e-5,3.2e-4 -0.0304,-0.10799 -0.0303,-0.10767 -0.83547,-2.97082 -1.29184,-5.10173 -1.52475,-6.52234 0.11806,1.35205 0.32374,3.69456 1.02301,6.65209 0.009,0.0366 0.0174,0.0732 0.0261,0.10977 0.43512,1.81767 1.06025,3.95048 2.00345,6.66866 1.47874,4.2615 3.95771,10.45081 5.9615,15.66347 -0.21091,-0.54868 0.69144,1.79898 0.48053,1.25029 0.59785,1.55048 1.09713,2.7528 1.52482,3.70575 0.45559,1.01512 0.8473,1.78545 1.17916,2.34108 0.16591,0.27779 0.32053,0.50804 0.4628,0.68781 0.0696,0.088 0.13703,0.1648 0.20203,0.22952 0.0635,0.0632 0.12565,0.11587 0.18637,0.15624 0.0557,0.0371 0.11188,0.0649 0.1682,0.0803 0.003,9.3e-4 0.007,0.002 0.0102,0.003 0.0597,0.0147 0.11853,0.0148 0.17533,-0.002 0.0281,-0.008 0.0548,-0.0204 0.0801,-0.036 0.0252,-0.0155 0.049,-0.0344 0.0713,-0.0561 0.0444,-0.0431 0.0842,-0.0982 0.12043,-0.1633 0.0716,-0.12886 0.13318,-0.30454 0.18638,-0.52396 0.0527,-0.21749 0.0981,-0.48151 0.13653,-0.79209 0.075,-0.60616 0.12404,-1.39378 0.14895,-2.37348 0.036,-1.41494 0.0215,-3.20979 -0.035,-5.48345 -0.0168,-0.6748 -0.0364,-1.39512 -0.059,-2.18845 -0.0679,-2.40335 -0.51634,-5.22387 -1.25322,-8.30371 -0.71065,-2.97028 -1.62443,-5.90868 -2.47651,-8.39148 -0.87035,-2.53605 -1.68324,-4.61774 -2.18617,-5.85567 -1.12583,-2.77115 -1.4488,-3.19699 -1.45599,-3.19385 z"
           id="path31651"
           sodipodi:nodetypes="cssc"
           inkscape:path-effect="#path-effect31653"
           inkscape:original-d="m 504.3625,170.6154 c 0,0 6.85495,15.70837 7.15122,25.75122 0.37287,12.63933 0.36616,16.10206 -4.06432,4.30613 -5.18934,-13.81638 -8.63675,-21.22247 -9.76824,-30.24151" /><path
           style="opacity:1;fill:#000000;fill-opacity:1;fill-rule:nonzero;stroke:none;stroke-width:0.499999;stroke-linejoin:round;stroke-opacity:1;paint-order:fill markers stroke"
           d="m 494.02915,162.38272 c -0.0378,0.0106 -0.15804,0.20245 0.1115,1.05581 0.30011,0.95012 1.09684,2.7641 2.59913,5.32305 1.41496,2.41019 3.3464,5.29407 5.88675,8.46811 2.40664,3.00697 4.99402,5.77514 6.85934,7.73349 -1.89232,-2.16453 -4.06952,-4.83434 -6.46383,-8.03939 -2.44792,-3.2768 -4.30765,-6.06191 -5.72863,-8.48692 -1.50424,-2.56712 -2.2498,-4.27355 -2.68781,-5.18226 -0.37666,-0.78143 -0.51862,-0.88816 -0.57645,-0.87189 z"
           id="path32192"
           sodipodi:nodetypes="cc"
           inkscape:path-effect="#path-effect32194"
           inkscape:original-d="m 494.02915,162.38272 c 0,0 2.29504,8.1584 15.45672,22.58046" /><path
           style="opacity:1;fill:#000000;fill-opacity:1;fill-rule:nonzero;stroke:none;stroke-width:0.499999;stroke-linejoin:round;stroke-opacity:1;paint-order:fill markers stroke"
           d="m 500.48413,168.92716 c -0.01,0.008 -0.0402,0.0352 -0.0579,0.0507 -0.0586,0.0514 -0.0941,0.0675 0.18405,0.41632 0.29471,0.36952 0.76275,0.89321 1.18107,1.37624 0.17392,0.20082 0.34464,0.39777 0.50999,0.58518 0.36724,0.41622 0.74211,0.8246 1.20499,1.27071 0.1868,0.18004 0.40955,0.38279 0.64513,0.58777 0.33025,0.28734 0.66365,0.56009 0.97157,0.79729 0.42871,0.33025 0.70954,0.51672 0.88555,0.63517 -0.13742,-0.14408 -0.37816,-0.41416 -0.72013,-0.81024 -0.24734,-0.28647 -0.53362,-0.6231 -0.81092,-0.94626 -0.20033,-0.23345 -0.3983,-0.46227 -0.56909,-0.65223 -0.442,-0.49166 -0.7919,-0.85399 -1.19422,-1.26561 -0.17544,-0.1795 -0.3538,-0.36122 -0.5395,-0.55293 -0.38995,-0.40256 -0.94741,-1.01118 -1.24335,-1.31039 -0.3124,-0.31585 -0.32968,-0.28475 -0.3894,-0.2324 -0.0177,0.0155 -0.0482,0.0422 -0.0579,0.0507 z"
           id="path32735"
           inkscape:path-effect="#path-effect32737"
           inkscape:original-d="m 500.48413,168.92716 c 0,0 3.55498,4.05815 5.52448,5.71937"
           sodipodi:nodetypes="cc" /><path
           style="opacity:1;fill:#020202;fill-opacity:1;fill-rule:nonzero;stroke:none;stroke-width:0.499999;stroke-linejoin:round;stroke-opacity:1;paint-order:fill markers stroke"
           d="m 488.22146,170.28806 c -0.009,-8.3e-4 -0.0425,0.084 -0.10255,0.62952 -0.0851,0.77266 -0.24868,2.7396 -0.28012,5.15867 0,9e-5 -0.001,0.12401 -0.001,0.1241 -0.0182,1.65442 8.1e-4,3.38327 0.16064,4.9979 0.0452,0.4569 0.10032,0.88882 0.1658,1.29325 0.26193,1.61773 0.68145,2.72043 0.94939,3.36584 -0.21211,-0.74321 -0.38742,-1.7473 -0.58848,-3.41681 -0.0486,-0.40361 -0.0965,-0.82665 -0.14223,-1.28067 -0.16188,-1.60695 -0.26372,-3.29933 -0.27873,-4.95925 0,6e-5 -0.001,-0.12366 -0.001,-0.1236 -0.0172,-2.35806 0.0887,-4.42822 0.11758,-5.15183 0.0218,-0.54742 0.0131,-0.636 0.001,-0.63712 z"
           id="path33280"
           inkscape:path-effect="#path-effect33282"
           inkscape:original-d="m 488.22146,170.28806 c 0,0 -0.96582,10.24642 0.89167,15.56928"
           sodipodi:nodetypes="cc" /><path
           style="opacity:1;fill:#020202;fill-opacity:1;fill-rule:nonzero;stroke:none;stroke-width:0.499999;stroke-linejoin:round;stroke-opacity:1;paint-order:fill markers stroke"
           d="m 488.42792,185.8641 h 0 c -4.9e-4,0.0192 0.13149,0.0383 0.81028,0.10458 0.79126,0.0773 2.45141,0.26521 4.39729,0.46174 -1e-5,0 0.008,8.2e-4 0.008,8.2e-4 1.34236,0.13554 2.88074,0.3131 4.42459,0.5572 0.85272,0.13483 1.49805,0.25631 2.07086,0.36804 0.17058,0.0333 0.32893,0.0645 0.46325,0.0902 0.63976,0.12229 1.13369,0.17682 1.338,0.2204 -0.19194,-0.11078 -0.58832,-0.37509 -1.23711,-0.59831 -0.13412,-0.0461 -0.28751,-0.0944 -0.46002,-0.14401 -0.55064,-0.15817 -1.24831,-0.31563 -2.08759,-0.46192 -1.5207,-0.26507 -3.15432,-0.43284 -4.46721,-0.53426 0,0 -0.008,-6.4e-4 -0.008,-6.4e-4 -2.01097,-0.1549 -3.65569,-0.12214 -4.43573,-0.11071 -0.68297,0.01 -0.81613,0.0307 -0.81654,0.0469 z"
           id="path33284"
           inkscape:path-effect="#path-effect33286"
           inkscape:original-d="m 488.42792,185.8641 c 0,0 9.4423,0.23918 13.51245,1.80294"
           sodipodi:nodetypes="cc" /><path
           style="opacity:1;fill:#020202;fill-opacity:1;fill-rule:nonzero;stroke:none;stroke-width:0.499999;stroke-linejoin:round;stroke-opacity:1;paint-order:fill markers stroke"
           d="m 486.0586,170.96417 c 0.0259,0.006 0.0881,0.0517 0.0211,0.60275 -0.0634,0.52108 -0.31381,1.81378 -0.52165,4.83445 -0.20833,3.02773 -0.30902,7.731 0.4293,13.55319 0.0913,0.72123 0.23594,1.51765 0.41698,2.35161 0.18836,0.86763 0.41476,1.76991 0.65829,2.66245 0.55674,2.04048 1.20181,4.02742 1.71869,5.53667 0.0272,0.0796 0.0542,0.15807 0.0809,0.23545 0.62777,1.82028 1.20483,3.36625 1.61411,4.4089 0.24907,0.63452 0.46467,1.15654 0.63857,1.54727 0.0889,0.19972 0.16831,0.36839 0.23685,0.50201 0.0341,0.0665 0.0657,0.1247 0.0946,0.17382 0.0285,0.0486 0.0548,0.089 0.0783,0.11981 0.008,0.0147 0.0168,0.0281 0.0274,0.0392 0.0105,0.0109 0.0232,0.0202 0.0388,0.0256 0.0155,0.005 0.0327,0.007 0.0509,0.003 0.0175,-0.003 0.0349,-0.0111 0.0512,-0.0222 0.016,-0.0108 0.0312,-0.0248 0.0457,-0.0417 0.002,-0.003 0.005,-0.006 0.007,-0.009 0.0116,-0.0146 0.0229,-0.031 0.0339,-0.0492 0.0262,-0.0436 0.051,-0.0981 0.0746,-0.16355 0.0464,-0.12873 0.0889,-0.30232 0.12702,-0.52349 0.0374,-0.21717 0.0707,-0.48124 0.0991,-0.79537 0.0554,-0.61323 0.0923,-1.41956 0.10392,-2.4416 0.0105,-0.91843 5.8e-4,-2.01215 -0.0348,-3.29562 -0.003,-0.108 -0.006,-0.21906 -0.01,-0.33319 -0.0423,-1.48284 -0.10502,-3.18615 -0.0789,-5.292 0.0323,-2.60096 0.26485,-6.36691 0.29233,-7.70405 0.0104,-0.50437 -0.0209,-0.7737 -0.0243,-0.93361 -0.0285,0.1574 -0.10188,0.41857 -0.16703,0.91923 -0.17271,1.32732 -0.4439,5.09961 -0.4778,7.71364 -0.0274,2.11616 0.0589,3.83042 0.11,5.30771 0.004,0.11383 0.007,0.22461 0.0107,0.33232 0.0395,1.28013 0.0573,2.36997 0.0589,3.28402 0.002,1.01738 -0.0165,1.81757 -0.0473,2.42453 -0.0157,0.31091 -0.0348,0.57087 -0.056,0.78389 -0.0217,0.21759 -0.0456,0.38436 -0.0704,0.50701 -0.0126,0.0623 -0.0252,0.11183 -0.0375,0.15071 -0.005,0.0161 -0.0101,0.0301 -0.0148,0.0423 -10e-4,0.003 -0.002,0.005 -0.003,0.007 -0.006,0.0139 -0.0107,0.0248 -0.015,0.0334 -0.004,0.008 -0.008,0.0159 -0.0112,0.0206 -0.003,0.005 -0.007,0.0103 -0.013,0.0138 -0.006,0.004 -0.0151,0.006 -0.0265,0.004 -0.0116,-0.001 -0.0248,-0.006 -0.0392,-0.0138 -0.0302,-0.024 -0.0642,-0.0583 -0.10133,-0.10191 -0.0375,-0.044 -0.0781,-0.0974 -0.12157,-0.15944 -0.0873,-0.1247 -0.18637,-0.28507 -0.29505,-0.47704 -0.21303,-0.37626 -0.46799,-0.88275 -0.7542,-1.50617 -0.48048,-1.04655 -1.09718,-2.52958 -1.76532,-4.37103 -0.028,-0.0773 -0.0563,-0.15565 -0.0849,-0.23512 -0.54922,-1.5278 -1.20629,-3.49141 -1.78029,-5.54766 -0.25037,-0.89694 -0.48305,-1.80637 -0.67661,-2.68328 -0.18594,-0.84234 -0.33536,-1.65277 -0.42968,-2.39162 -0.74631,-5.85891 -0.63126,-10.59617 -0.38992,-13.64401 0.23059,-2.91217 0.58691,-4.51673 0.67234,-4.85445 0.13803,-0.54563 0.23729,-0.55527 0.25489,-0.55117 z"
           id="path33833"
           sodipodi:nodetypes="csssc"
           inkscape:path-effect="#path-effect34381"
           inkscape:original-d="m 486.0586,170.96417 c 0,0 -1.76031,7.56388 -0.30427,19.02001 0.73277,5.76546 4.9169,16.63038 5.77312,17.50563 0.35862,0.36659 0.61846,-1.9482 0.44008,-7.59856 -0.10978,-3.47734 -0.26269,-6.01057 0.36199,-13.93512" /><path
           style="opacity:1;fill:#020202;fill-opacity:1;fill-rule:nonzero;stroke:none;stroke-width:0.499999;stroke-linejoin:round;stroke-opacity:1;paint-order:fill markers stroke"
           d="m 491.31373,146.46213 c 0.001,-0.009 -0.0615,-0.0692 -0.939,-0.1481 -0.13752,-0.0124 -0.30727,-0.0257 -0.50451,-0.0371 -0.63046,-0.0365 -1.92336,-0.0772 -3.4016,0.1337 -1.17292,0.16738 -2.61811,0.51459 -3.94158,1.25998 -0.60823,0.34257 -1.19948,0.77406 -1.72851,1.31973 -0.51041,0.52645 -0.96343,1.15973 -1.31734,1.92237 -0.68151,1.46829 -1.17645,3.10947 -1.53305,4.76882 -0.35387,1.64668 -0.56385,3.27571 -0.68766,4.70085 -0.19568,2.25243 -0.17956,4.03403 -0.16481,4.65722 0.004,0.16906 0.009,0.2834 0.0118,0.33548 -0.032,0.0948 -0.11952,0.32133 -0.27129,0.58762 -0.10185,0.17872 -0.23225,0.37482 -0.39387,0.56175 -0.1612,0.18644 -0.35302,0.36325 -0.57827,0.50492 -0.22423,0.14103 -0.4835,0.24846 -0.78213,0.29518 -0.29788,0.0466 -0.63948,0.0335 -1.02913,-0.0719 -0.38883,-0.10514 -0.82581,-0.30228 -1.31356,-0.62389 -0.4859,-0.3204 -1.02087,-0.76345 -1.60741,-1.35984 -0.22492,-0.22392 -0.39652,-0.45639 -0.52423,-0.69248 -0.12718,-0.23512 -0.21098,-0.47415 -0.26037,-0.71215 -0.0983,-0.47342 -0.0597,-0.93969 0.0407,-1.35522 0.0709,-0.29325 0.17187,-0.5581 0.274,-0.77818 0.0401,-0.0864 0.0808,-0.16672 0.12058,-0.23988 0.12978,-0.23899 0.24821,-0.39599 0.25213,-0.39149 l -0.0358,-0.0534 c -0.002,-0.005 -0.38219,0.0812 -0.97379,0.29642 -0.57557,0.20942 -1.34933,0.5419 -2.11607,1.02404 -0.7717,0.48527 -1.5276,1.11666 -2.07389,1.92059 -0.27878,0.41026 -0.50049,0.86182 -0.64331,1.35717 -0.14666,0.50868 -0.20826,1.05713 -0.16785,1.64629 0.0725,1.07829 0.4171,2.18683 0.92321,3.17294 0.58812,1.14591 1.36963,2.08821 2.21306,2.77825 0.9758,0.79834 1.96232,1.20653 2.81982,1.38572 0.15907,0.0332 0.31673,0.0592 0.47262,0.0786 0.7064,0.0878 1.36423,0.0383 1.94873,-0.0789 0.90152,-0.1808 1.62976,-0.5243 2.06977,-0.74775 -0.4578,0.19922 -1.2041,0.46563 -2.09789,0.57202 -0.57753,0.0687 -1.20935,0.0705 -1.87678,-0.0436 -0.14734,-0.0252 -0.29595,-0.0559 -0.44568,-0.0927 -0.8051,-0.19754 -1.73227,-0.5932 -2.66108,-1.35381 -0.80416,-0.65853 -1.56107,-1.55589 -2.14133,-2.65465 -0.49967,-0.94615 -0.84666,-2.00761 -0.93555,-3.03827 -0.0472,-0.55562 0.001,-1.07292 0.12973,-1.55449 0.12521,-0.46935 0.32568,-0.90192 0.5837,-1.29988 0.50697,-0.78195 1.22389,-1.41135 1.97359,-1.90655 0.74349,-0.4911 1.49934,-0.83713 2.06478,-1.06077 0.58008,-0.22945 0.95313,-0.32938 0.95083,-0.33444 a 0.21823236,0.09552839 32.572475 0 0 -0.0358,-0.0534 c 0.004,0.005 -0.10966,0.16709 -0.24012,0.4089 -0.04,0.0741 -0.0814,0.15491 -0.12286,0.24184 -0.10542,0.22101 -0.21313,0.48712 -0.29317,0.78297 -0.11309,0.41805 -0.17122,0.89649 -0.0889,1.39266 0.0415,0.25009 0.11864,0.50474 0.24241,0.75822 0.12434,0.25467 0.29539,0.50743 0.52341,0.75249 0.58425,0.61198 1.12135,1.07471 1.61496,1.41603 0.49542,0.34257 0.94935,0.56444 1.36523,0.69105 0.41781,0.12719 0.79761,0.15831 1.14129,0.11843 0.34481,-0.04 0.64926,-0.15106 0.91499,-0.30299 0.26595,-0.15207 0.49184,-0.34434 0.68063,-0.54552 0.18916,-0.20157 0.34207,-0.41313 0.46191,-0.6048 0.24058,-0.38481 0.35063,-0.69255 0.3575,-0.70168 a 0.03989675,0.0707507 37.328397 0 0 0.011,-0.0795 c 0.002,0.001 -0.003,-0.12462 -0.008,-0.35761 -0.0135,-0.61055 -0.0387,-2.38137 0.13905,-4.61218 0.11265,-1.41345 0.30786,-3.02684 0.6431,-4.65708 0.33791,-1.64314 0.80967,-3.26252 1.46143,-4.70921 0.3294,-0.73131 0.75362,-1.34082 1.23458,-1.85061 0.49892,-0.52882 1.06078,-0.95233 1.6447,-1.29296 1.27296,-0.74259 2.67909,-1.10742 3.83664,-1.29475 1.44856,-0.23442 2.74441,-0.22632 3.36566,-0.21069 0.1955,0.005 0.36593,0.0119 0.50234,0.0185 0.87474,0.0423 0.94502,0.0504 0.94636,0.0417 z"
           id="path34930"
           sodipodi:nodetypes="cscccsc"
           inkscape:path-effect="#path-effect34932"
           inkscape:original-d="m 491.31373,146.46213 c 0,0 -8.98549,-1.37449 -11.68141,4.51973 -2.69594,5.89423 -2.30328,14.41529 -2.30328,14.41529 0,0 -1.58864,4.75972 -6.2629,-0.0646 -1.81581,-1.88004 -0.059,-4.25329 -0.059,-4.25329 0,0 -6.19436,1.55412 -5.83877,6.20032 0.30711,4.01273 4.54283,9.31278 10.30276,6.59992" /><path
           style="opacity:1;fill:#020202;fill-opacity:1;fill-rule:nonzero;stroke:none;stroke-width:0.499999;stroke-linejoin:round;stroke-opacity:1;paint-order:fill markers stroke"
           d="m 492.20776,146.42576 c -0.0151,-0.007 -0.10816,0.058 -0.55496,0.9841 -0.26151,0.54202 -0.73958,1.58046 -1.46318,3.18206 -0.48061,1.06377 -1.07051,2.37877 -1.6501,3.68364 -0.52848,1.18979 -1.04954,2.37381 -1.45927,3.32487 -0.44386,1.02959 -0.95248,2.23567 -1.45409,3.4908 -0.5315,1.32991 -1.01936,2.62546 -1.42027,3.80999 -0.21833,0.64506 -0.40323,1.23466 -0.55489,1.7686 -0.1703,0.59958 -0.29326,1.10986 -0.37694,1.54338 -0.002,0.01 -0.004,0.0191 -0.006,0.0287 -0.092,0.48277 -0.13655,0.87858 -0.13853,1.19753 -0.001,0.17826 0.0111,0.33631 0.0373,0.47421 0.0275,0.14456 0.0715,0.27237 0.13652,0.37931 0.0638,0.10551 0.14453,0.19836 0.23813,0.27953 0.0952,0.0825 0.20425,0.1535 0.32394,0.21379 0.23519,0.11845 0.52003,0.20001 0.84361,0.24494 0.55835,0.0775 1.30039,0.0537 2.1789,-0.1382 0.69068,-0.15086 1.51643,-0.42032 2.31882,-0.8385 0.35287,-0.18391 0.69959,-0.39607 1.01889,-0.63576 0.30483,-0.22883 0.58546,-0.48338 0.82067,-0.76178 1.73637,-2.02391 2.68408,-4.37707 3.15652,-6.25779 0.11994,-0.47746 0.20781,-0.91867 0.2704,-1.31065 0.0654,-0.40952 0.10355,-0.7673 0.1223,-1.06329 0.01,-0.15527 0.0144,-0.29435 0.0147,-0.4166 3.7e-4,-0.12729 -0.004,-0.23686 -0.0114,-0.32872 -0.008,-0.0964 -0.0199,-0.1745 -0.0349,-0.23481 -0.008,-0.0316 -0.0168,-0.0593 -0.0271,-0.0829 -0.005,-0.0121 -0.0111,-0.0236 -0.0176,-0.0341 -0.007,-0.0107 -0.0142,-0.021 -0.0232,-0.0302 -0.0168,-0.0172 -0.0362,-0.0297 -0.0575,-0.0376 -0.022,-0.008 -0.0444,-0.0108 -0.0658,-0.0101 -0.0224,7.4e-4 -0.0443,0.005 -0.0651,0.0114 -0.02,0.006 -0.0399,0.014 -0.0592,0.0231 -0.002,0.001 -0.004,0.002 -0.007,0.003 -0.0464,0.0225 -0.0952,0.0537 -0.14354,0.0887 -0.0537,0.0388 -0.10969,0.0845 -0.16525,0.13329 -0.1268,0.11125 -0.26268,0.2483 -0.3894,0.38909 -0.14311,0.159 -0.28853,0.33804 -0.42924,0.53679 -0.0333,0.047 -0.0666,0.0955 -0.0999,0.14563 -0.26906,0.40518 -0.5036,0.83564 -0.69448,1.25026 -0.0463,0.10048 -0.0902,0.20064 -0.13193,0.30017 -0.21935,0.52382 -0.32567,0.96278 -0.38434,1.23129 0.0748,-0.18712 0.33918,-0.7305 0.56445,-1.14501 0.0506,-0.0931 0.10293,-0.18703 0.15663,-0.28135 0.21986,-0.38614 0.47517,-0.80045 0.73404,-1.1938 0.0207,-0.0315 0.0739,-0.11238 0.0946,-0.14386 0.12762,-0.19399 0.25628,-0.38943 0.37235,-0.55466 0.10615,-0.15112 0.21586,-0.29739 0.32311,-0.41682 0.0467,-0.052 0.0933,-0.0993 0.1383,-0.13869 0.0408,-0.0357 0.0797,-0.0643 0.11455,-0.0833 0.002,-8.8e-4 0.003,-0.002 0.005,-0.003 0.0142,-0.007 0.0273,-0.013 0.0391,-0.0167 0.0124,-0.004 0.0225,-0.005 0.0302,-0.005 0.007,1e-5 0.0117,0.001 0.0143,0.003 0.002,0.001 0.004,0.003 0.006,0.006 1.1e-4,5.6e-4 0.002,0.003 0.004,0.007 0.002,0.004 0.004,0.01 0.007,0.0173 0.005,0.0148 0.0104,0.035 0.0152,0.0617 0.009,0.051 0.0164,0.12134 0.0194,0.21308 0.003,0.0869 0.002,0.19199 -0.003,0.31539 -0.005,0.11841 -0.0152,0.25374 -0.0306,0.40527 -0.0293,0.28881 -0.0788,0.63903 -0.15591,1.03977 -0.0738,0.38361 -0.17316,0.81528 -0.30426,1.28169 -0.51841,1.84441 -1.49984,4.1153 -3.21888,6.04829 -0.21946,0.24225 -0.48209,0.46708 -0.77116,0.67221 -0.30261,0.21475 -0.63203,0.40641 -0.96916,0.57412 -0.76767,0.38189 -1.55422,0.63072 -2.20893,0.77903 -0.83093,0.18824 -1.52124,0.23248 -2.02265,0.19321 -0.29198,-0.0229 -0.53865,-0.0749 -0.7367,-0.15284 -0.10051,-0.0396 -0.18962,-0.0863 -0.26642,-0.14019 -0.0752,-0.0528 -0.14005,-0.11356 -0.19249,-0.18324 -0.0473,-0.0622 -0.0893,-0.14997 -0.12054,-0.26919 -0.0297,-0.11313 -0.049,-0.25137 -0.0553,-0.41712 -0.0113,-0.2971 0.019,-0.67754 0.10128,-1.15395 0.002,-0.009 0.003,-0.0187 0.005,-0.0282 0.0749,-0.42651 0.19134,-0.93204 0.35705,-1.52789 0.14753,-0.5305 0.32994,-1.1176 0.54681,-1.76006 0.398,-1.17905 0.88777,-2.47251 1.42194,-3.79727 0.50434,-1.25076 1.01775,-2.45377 1.46606,-3.47934 0.41489,-0.94848 0.94014,-2.12792 1.47245,-3.31657 0.28879,-0.64486 1.36504,-3.03608 1.65382,-3.68094 0.73091,-1.62555 1.17696,-2.62315 1.42216,-3.20006 0.40214,-0.94619 0.39092,-1.05847 0.37546,-1.0655 z"
           id="path28984"
           sodipodi:nodetypes="cssssc"
           inkscape:path-effect="#path-effect28986"
           inkscape:original-d="m 492.20776,146.42576 c 0,0 -3.41244,7.50267 -5.0257,11.21887 -1.76639,4.06895 -4.66699,11.18 -3.74931,12.56274 0.91766,1.38273 5.66773,0.35782 7.45524,-1.68914 3.45942,-3.96156 3.85483,-9.25512 3.55886,-9.57427 -0.29596,-0.31914 -2.0561,2.10834 -2.64253,4.01901" /><path
           style="opacity:1;fill:#020202;fill-opacity:1;fill-rule:nonzero;stroke:none;stroke-width:0.499999;stroke-linejoin:round;stroke-opacity:1;paint-order:fill markers stroke"
           d="m 474.12542,174.4147 c -0.006,-0.007 -0.12239,0.0451 -0.5839,0.51218 -0.32744,0.33135 -1.20492,1.25586 -2.11478,2.64233 -0.63337,0.96514 -1.30689,2.19142 -1.80561,3.62055 -0.5022,1.4391 -0.79618,2.99509 -0.76237,4.63084 8.8e-4,0.0453 2e-5,9.4e-4 9e-4,0.0462 0.0188,0.96634 0.0216,2.34362 0.34318,3.63495 0.15349,0.61628 0.38309,1.24485 0.73336,1.87334 0.3492,0.62657 0.81059,1.23918 1.41644,1.83424 1.34203,1.31813 3.2673,2.42382 5.72548,3.36423 3.38146,1.29362 7.30924,2.07175 9.14127,2.35279 1.00605,0.15433 1.61781,0.17574 1.90717,0.2047 -0.32046,-0.0789 -0.83546,-0.24356 -1.85427,-0.47979 -1.85176,-0.42937 -5.6456,-1.22622 -9.01777,-2.53543 -2.42099,-0.93992 -4.27879,-2.00511 -5.56985,-3.24788 -0.5808,-0.55908 -1.02302,-1.13071 -1.35998,-1.71331 -0.33816,-0.58469 -0.56583,-1.17279 -0.7226,-1.75615 -0.33176,-1.23453 -0.35925,-2.55733 -0.38625,-3.54005 5e-5,0.002 -0.001,-0.0483 -0.001,-0.0463 -0.0422,-1.58858 0.22554,-3.10623 0.69607,-4.52388 0.46738,-1.40815 1.10502,-2.62726 1.70756,-3.59683 0.85299,-1.37256 1.71189,-2.35926 2.00307,-2.69026 0.43064,-0.48955 0.51028,-0.57983 0.50416,-0.58655 z"
           id="path35483"
           sodipodi:nodetypes="csc"
           inkscape:path-effect="#path-effect35485"
           inkscape:original-d="m 474.12542,174.4147 c 0,0 -5.24496,4.77452 -5.08876,11.40171 0.11242,4.76973 0.14294,10.05146 19.0899,13.31469" /><path
           style="opacity:1;fill:#000000;fill-opacity:1;fill-rule:nonzero;stroke:none;stroke-width:0.499999;stroke-linejoin:round;stroke-opacity:1;paint-order:fill markers stroke"
           d="m 502.16456,148.24683 c -0.006,0.0237 0.61211,0.22267 3.27443,1.12182 0.753,0.25431 1.88958,0.64517 3.14122,1.12855 1.51124,0.58363 3.43322,1.39461 5.18767,2.37643 0.791,0.44266 1.55755,0.9253 2.24043,1.44263 0.65633,0.49722 1.23368,1.02521 1.68116,1.57906 0.43841,0.54261 0.79959,1.14608 1.089,1.80443 0.28677,0.65234 0.50087,1.35358 0.65035,2.09441 0.30385,1.50584 0.33493,3.1466 0.18844,4.81211 -0.29714,3.37812 -1.32106,6.80273 -2.18034,9.21498 -0.13272,0.37259 -0.26548,0.73206 -0.39647,1.07656 -0.67364,1.7722 -0.97813,3.60517 -1.08412,5.19954 -0.11665,1.75472 -0.0147,3.53429 0.2833,5.18593 0.23239,1.2879 0.60877,2.62827 1.16223,3.80662 0.0711,0.15142 0.1454,0.30054 0.22285,0.44658 0.29403,0.55444 0.63576,1.0681 1.02378,1.49035 0.3619,0.39383 0.77007,0.71441 1.21941,0.90488 0.77331,0.3267 1.57848,0.55945 2.38481,0.67995 0.77776,0.11624 1.53757,0.12509 2.24881,0.024 0.7198,-0.10228 1.37191,-0.3145 1.93629,-0.62432 0.57406,-0.31514 1.03974,-0.7212 1.40175,-1.19295 0.0424,0.0153 0.0876,0.0395 0.13486,0.0738 0.0781,0.0566 0.15736,0.13738 0.23433,0.23928 0.0291,0.0385 0.0576,0.0798 0.0856,0.1236 0.12889,0.2023 0.24316,0.45791 0.3341,0.74933 0.11785,0.37765 0.19516,0.8103 0.2211,1.27181 0.0273,0.48581 -0.002,1.00087 -0.0984,1.52525 -0.19995,1.09116 -0.68841,2.23144 -1.57653,3.28717 -0.68459,0.81378 -1.63764,1.61472 -2.95779,2.31283 -0.37194,0.19669 -0.77729,0.38729 -1.21941,0.56852 -1.20144,0.49604 -2.40557,0.76357 -3.58322,0.86744 -1.20283,0.10609 -2.31942,0.036 -3.26824,-0.0951 -0.85444,-0.11804 -1.59391,-0.28888 -2.13238,-0.43326 -0.17515,-0.047 -0.34308,-0.0943 -0.50327,-0.1411 -0.3814,-0.11142 -0.72282,-0.22104 -0.97478,-0.30242 -0.4109,-0.13272 -0.53998,-0.17438 -0.69168,-0.2174 0.0153,0.007 0.39664,0.17557 0.66526,0.28858 0.25016,0.10525 0.57377,0.2366 0.95401,0.37513 0.15787,0.0575 0.32389,0.11567 0.49749,0.17349 0.53342,0.17766 1.26856,0.40185 2.13084,0.57659 0.95587,0.19371 2.10496,0.33387 3.35569,0.27956 1.22836,-0.0533 2.50705,-0.29136 3.7824,-0.79832 0.46221,-0.18499 0.8877,-0.3819 1.2793,-0.58767 1.39399,-0.7325 2.40032,-1.6014 3.11377,-2.50136 0.9252,-1.16705 1.38553,-2.42066 1.5377,-3.58888 0.0731,-0.5613 0.0756,-1.10651 0.0222,-1.61601 -0.0507,-0.4842 -0.15201,-0.93636 -0.29086,-1.33219 -0.107,-0.305 -0.23708,-0.57829 -0.38295,-0.80067 -0.0318,-0.0484 -0.0645,-0.0947 -0.0981,-0.13858 -0.0882,-0.11496 -0.18386,-0.21472 -0.28562,-0.29031 -0.0975,-0.0724 -0.20462,-0.12565 -0.31854,-0.14452 a 0.12701374,0.13263848 24.015405 0 0 -0.12376,0.0506 c -0.35477,0.46303 -0.82137,0.84744 -1.39515,1.1291 -0.53845,0.26431 -1.1572,0.43105 -1.83528,0.49273 -0.67038,0.061 -1.38317,0.0178 -2.11071,-0.12324 -0.75448,-0.14631 -1.50512,-0.39399 -2.22737,-0.72251 -0.34264,-0.15654 -0.67548,-0.42147 -0.99124,-0.77374 -0.33778,-0.37683 -0.6476,-0.84405 -0.92505,-1.36422 -0.0728,-0.13643 -0.14316,-0.2762 -0.21117,-0.41866 -0.53039,-1.11104 -0.91947,-2.39319 -1.17807,-3.63995 -0.33103,-1.59594 -0.49154,-3.33232 -0.43012,-5.05409 0.0559,-1.56745 0.30503,-3.3687 0.93915,-5.11823 0.12617,-0.34798 0.25483,-0.71117 0.38401,-1.08684 0.8344,-2.42644 1.86674,-5.87887 2.17797,-9.28411 0.15366,-1.68126 0.13208,-3.34981 -0.16942,-4.89153 -0.14847,-0.75917 -0.36378,-1.48234 -0.65589,-2.1587 -0.2949,-0.68282 -0.66576,-1.31258 -1.11945,-1.88125 -0.46479,-0.58255 -1.0603,-1.13136 -1.72861,-1.64218 -0.69592,-0.53192 -1.4745,-1.02547 -2.27405,-1.47536 -1.77387,-0.99815 -3.71048,-1.81469 -5.23291,-2.39421 -1.27361,-0.4848 -2.39498,-0.85612 -3.16957,-1.09748 -2.6942,-0.83952 -3.35912,-0.86599 -3.36517,-0.84226 z"
           id="path36038"
           sodipodi:nodetypes="cssscsc"
           inkscape:path-effect="#path-effect36040"
           inkscape:original-d="m 502.16456,148.24683 c 0,0 12.05132,3.07015 15.64761,7.54999 3.5963,4.47984 1.77813,12.65924 -0.63312,19.15246 -2.41125,6.49322 -0.27255,15.35003 2.81197,16.70139 3.08451,1.35137 6.27917,1.04124 7.79581,-0.9789 1.38249,0.21034 3.29226,7.35902 -4.67339,10.58483 -5.02025,2.03303 -9.87595,-0.10878 -11.26963,-0.60845" /><path
           style="opacity:1;fill:#020202;fill-opacity:1;fill-rule:nonzero;stroke:none;stroke-width:0.499999;stroke-linejoin:round;stroke-opacity:1;paint-order:fill markers stroke"
           d="m 492.26112,198.38237 h 0 c -0.0214,0.0257 0.0602,0.31507 0.82037,0.83663 0.437,0.29981 1.05422,0.64146 1.8085,0.93815 0.33055,0.13001 0.66994,0.24454 1.01393,0.34204 0.70575,0.20005 1.43015,0.33348 2.18269,0.38266 0.20999,0.0137 0.42722,0.0212 0.65186,0.0212 1.31474,2e-5 2.50688,-0.28329 3.38756,-0.54682 -0.61432,0.10204 -2.3554,0.17468 -3.36515,0.0763 -0.21461,-0.0209 -0.42221,-0.0458 -0.62135,-0.0735 -0.7063,-0.0982 -1.40636,-0.24518 -2.06898,-0.43892 -0.32756,-0.0958 -0.64919,-0.20263 -0.96729,-0.32069 -0.73221,-0.27174 -1.32021,-0.5558 -1.78285,-0.78571 -0.62974,-0.31294 -1.03423,-0.46158 -1.05929,-0.43144 z"
           id="path37148"
           inkscape:path-effect="#path-effect37150"
           inkscape:original-d="m 492.26112,198.38237 c 0,0 4.00638,3.33128 9.86491,1.97389" /><path
           style="opacity:1;fill:#020202;fill-opacity:1;fill-rule:nonzero;stroke:none;stroke-width:0.499999;stroke-linejoin:round;stroke-opacity:1;paint-order:fill markers stroke"
           d="m 507.66032,201.58907 0,0 c -0.002,-0.0173 -0.0432,-0.0647 -0.32848,-0.0747 -0.16045,-0.006 -0.28606,-0.007 -0.44651,-0.0123 -0.35924,-0.013 -1.0184,-0.0487 -1.71115,-0.22661 -0.30773,-0.079 -0.62787,-0.18729 -0.93843,-0.33687 -0.30253,-0.14571 -0.59218,-0.3288 -0.85231,-0.55899 -0.26203,-0.23188 -0.49026,-0.50812 -0.67297,-0.83678 -0.19114,-0.34382 -0.32889,-0.7386 -0.40663,-1.1889 -0.0322,-0.18633 -0.0802,-0.37894 -0.13835,-0.57083 -0.0444,-0.14679 -0.0962,-0.29723 -0.1541,-0.44978 -0.13806,-0.3639 -0.31202,-0.74273 -0.50809,-1.11846 -0.39744,-0.76163 -0.8927,-1.52408 -1.39178,-2.15622 -0.25029,-0.31703 -0.50378,-0.60415 -0.74881,-0.84351 -0.24239,-0.2368 -0.47956,-0.42985 -0.69883,-0.55753 -0.10862,-0.0633 -0.21449,-0.11143 -0.31565,-0.14044 -0.10053,-0.0288 -0.19782,-0.0392 -0.28957,-0.0252 -0.0456,0.007 -0.0894,0.02 -0.131,0.0396 -0.008,0.004 -0.0165,0.008 -0.0245,0.0125 -0.0318,0.0174 -0.0621,0.0388 -0.0907,0.0645 -0.0686,0.0617 -0.12615,0.14714 -0.17142,0.25848 -0.0373,0.092 -0.0858,0.22771 -0.12886,0.40267 -0.0414,0.16808 -0.0781,0.37435 -0.0946,0.61423 -0.0337,0.49112 0.0203,1.08982 0.25822,1.76326 0.28089,0.79515 0.77118,1.5618 1.42528,2.27723 0.40372,0.44157 0.82978,0.81957 1.21033,1.12014 0.83592,0.66023 1.67627,1.11648 2.07941,1.34193 -0.38685,-0.25237 -1.16296,-0.8026 -1.95934,-1.48761 -0.36407,-0.31316 -0.77224,-0.68924 -1.16456,-1.12494 -0.63441,-0.70456 -1.11196,-1.4379 -1.39538,-2.19778 -0.23944,-0.64194 -0.30603,-1.2126 -0.28653,-1.68297 0.01,-0.2298 0.0393,-0.4278 0.0749,-0.58895 0.0371,-0.16792 0.0808,-0.29688 0.11574,-0.38237 0.039,-0.0956 0.0857,-0.16002 0.13483,-0.20215 0.0205,-0.0175 0.0416,-0.0314 0.0631,-0.0421 0.005,-0.003 0.011,-0.005 0.0166,-0.008 0.0279,-0.0118 0.0576,-0.0192 0.0891,-0.0225 0.0637,-0.007 0.13638,0.004 0.21791,0.0323 0.0824,0.0286 0.17205,0.075 0.26788,0.13796 0.19395,0.12747 0.4079,0.31976 0.63097,0.56007 0.22476,0.24213 0.45786,0.53202 0.68883,0.85209 0.46082,0.63857 0.91665,1.40225 1.28326,2.1542 0.1808,0.37084 0.34038,0.73986 0.46742,1.089 0.0532,0.14623 0.10068,0.28887 0.14157,0.42654 0.0536,0.1804 0.0968,0.35687 0.12558,0.52355 0.0848,0.49138 0.23799,0.93038 0.45592,1.31678 0.20843,0.36956 0.46922,0.67886 0.76676,0.93537 0.29475,0.25411 0.6191,0.45087 0.95125,0.60274 0.34077,0.15581 0.68736,0.26336 1.01563,0.33757 0.74367,0.16812 1.41996,0.17136 1.79507,0.15282 0.20444,-0.0101 0.35799,-0.0283 0.45831,-0.0448 0.29656,-0.0489 0.31667,-0.12068 0.31472,-0.13459 z"
           id="path37152"
           sodipodi:nodetypes="cssc"
           inkscape:path-effect="#path-effect37154"
           inkscape:original-d="m 507.66032,201.58907 c 0,0 -4.88662,0.68412 -5.55707,-3.20052 -0.41064,-2.37924 -3.73791,-7.1075 -4.39494,-5.49413 -0.30303,0.74411 -1.08363,4.00447 4.68246,7.49204" /></g></g></g></svg>
