<?xml version="1.0" encoding="UTF-8" standalone="no"?>
<!-- Created with Inkscape (http://www.inkscape.org/) -->

<svg
   width="117.41484mm"
   height="55.374836mm"
   viewBox="0 0 117.41484 55.374835"
   version="1.1"
   id="svg310393"
   xml:space="preserve"
   sodipodi:docname="badger.svg"
   inkscape:version="1.2.2 (b0a8486541, 2022-12-01)"
   xmlns:inkscape="http://www.inkscape.org/namespaces/inkscape"
   xmlns:sodipodi="http://sodipodi.sourceforge.net/DTD/sodipodi-0.dtd"
   xmlns="http://www.w3.org/2000/svg"
   xmlns:svg="http://www.w3.org/2000/svg"><sodipodi:namedview
     id="namedview310395"
     pagecolor="#ffffff"
     bordercolor="#000000"
     borderopacity="0.25"
     inkscape:showpageshadow="2"
     inkscape:pageopacity="0.0"
     inkscape:pagecheckerboard="0"
     inkscape:deskcolor="#d1d1d1"
     inkscape:document-units="mm"
     showgrid="false"
     inkscape:zoom="0.5253601"
     inkscape:cx="1435.2061"
     inkscape:cy="460.63643"
     inkscape:window-width="1920"
     inkscape:window-height="979"
     inkscape:window-x="0"
     inkscape:window-y="32"
     inkscape:window-maximized="1"
     inkscape:current-layer="layer1"
     showguides="true"><sodipodi:guide
       position="-239.99239,168.11671"
       orientation="0,-1"
       id="guide986"
       inkscape:locked="false" /><sodipodi:guide
       position="-240.27826,167.83067"
       orientation="1,0"
       id="guide988"
       inkscape:locked="false" /><sodipodi:guide
       position="-240.87878,169.31435"
       orientation="1,0"
       id="guide990"
       inkscape:locked="false" /><sodipodi:guide
       position="-242.25635,164.3613"
       orientation="1,0"
       id="guide992"
       inkscape:locked="false" /><sodipodi:guide
       position="-240.36077,160.8618"
       orientation="0,-1"
       id="guide994"
       inkscape:locked="false" /></sodipodi:namedview><defs
     id="defs310390"><inkscape:path-effect
       effect="powerstroke"
       id="path-effect25718"
       is_visible="true"
       lpeversion="1"
       offset_points="0.19330352,0.097006491 | 1.9870357,0.18323123 | 3.8175736,0.25919912 | 3.1487318,0.050406163"
       not_jump="false"
       sort_points="true"
       interpolator_type="CentripetalCatmullRom"
       interpolator_beta="0.2"
       start_linecap_type="zerowidth"
       linejoin_type="round"
       miter_limit="4"
       scale_width="1"
       end_linecap_type="zerowidth" /><inkscape:path-effect
       effect="powerstroke"
       id="path-effect25220"
       is_visible="true"
       lpeversion="1"
       offset_points="0.18130114,0.13861132 | 1.5080259,0.085012192 | 2.797432,0.16131732"
       not_jump="false"
       sort_points="true"
       interpolator_type="CentripetalCatmullRom"
       interpolator_beta="0.2"
       start_linecap_type="zerowidth"
       linejoin_type="round"
       miter_limit="4"
       scale_width="1"
       end_linecap_type="zerowidth" /><inkscape:path-effect
       effect="powerstroke"
       id="path-effect25216"
       is_visible="true"
       lpeversion="1"
       offset_points="0.12321183,0.072494828 | 0.49771324,0.17956233 | 0.78842499,0.12167927"
       not_jump="false"
       sort_points="true"
       interpolator_type="CentripetalCatmullRom"
       interpolator_beta="0.2"
       start_linecap_type="zerowidth"
       linejoin_type="round"
       miter_limit="4"
       scale_width="1"
       end_linecap_type="zerowidth" /><inkscape:path-effect
       effect="powerstroke"
       id="path-effect24722"
       is_visible="true"
       lpeversion="1"
       offset_points="0.29175345,0.096461879 | 1.2217716,0.34456424 | 1.9521107,0.24072674 | 2.8293398,0.11082514 | 3.9084011,0.20620014 | 4.9018577,0.25097385 | 5.4906067,0.23281849 | 6.7337268,0.22238375 | 6.9940336,0.17091114 | 7.9252837,0.055655007 | 9.5,0.24631175 | 10.902983,0.11173777 | 11.884709,0.21347079 | 12.948503,0.095176469 | 13.429148,0.23630486 | 19,0.14484786 | 18.226412,0.051981401 | 17.065901,0.21583777 | 16.279477,0.048596235 | 14.652394,0.24807213"
       not_jump="false"
       sort_points="true"
       interpolator_type="CentripetalCatmullRom"
       interpolator_beta="0.2"
       start_linecap_type="zerowidth"
       linejoin_type="round"
       miter_limit="4"
       scale_width="1"
       end_linecap_type="zerowidth" /><inkscape:path-effect
       effect="powerstroke"
       id="path-effect24718"
       is_visible="true"
       lpeversion="1"
       offset_points="0.22518402,0.2356359 | 1.3758726,0.2542353 | 2.6535509,0.14724148 | 5,0.24631175 | 9.7651356,0.14018001 | 9.0505658,0.21300161 | 6.8763952,0.19976049 | 5.5352787,0.16310698"
       not_jump="false"
       sort_points="true"
       interpolator_type="CentripetalCatmullRom"
       interpolator_beta="0.2"
       start_linecap_type="zerowidth"
       linejoin_type="round"
       miter_limit="4"
       scale_width="1"
       end_linecap_type="zerowidth" /><inkscape:path-effect
       effect="powerstroke"
       id="path-effect24228"
       is_visible="true"
       lpeversion="1"
       offset_points="0.11678402,0.087831371 | 0.46286681,0.12700595 | 0.74738233,0.13234606"
       not_jump="false"
       sort_points="true"
       interpolator_type="CentripetalCatmullRom"
       interpolator_beta="0.2"
       start_linecap_type="zerowidth"
       linejoin_type="round"
       miter_limit="4"
       scale_width="1"
       end_linecap_type="zerowidth" /><inkscape:path-effect
       effect="powerstroke"
       id="path-effect23738"
       is_visible="true"
       lpeversion="1"
       offset_points="2.1579722,0.18339502 | 3.896532,0.080796201"
       not_jump="false"
       sort_points="true"
       interpolator_type="CentripetalCatmullRom"
       interpolator_beta="0.2"
       start_linecap_type="zerowidth"
       linejoin_type="round"
       miter_limit="4"
       scale_width="1"
       end_linecap_type="zerowidth" /><inkscape:path-effect
       effect="powerstroke"
       id="path-effect23734"
       is_visible="true"
       lpeversion="1"
       offset_points="0.18598133,0.20033075 | 1.6900099,0.077563023 | 2.9553558,0.11526916"
       not_jump="false"
       sort_points="true"
       interpolator_type="CentripetalCatmullRom"
       interpolator_beta="0.2"
       start_linecap_type="zerowidth"
       linejoin_type="round"
       miter_limit="4"
       scale_width="1"
       end_linecap_type="zerowidth" /><inkscape:path-effect
       effect="powerstroke"
       id="path-effect23730"
       is_visible="true"
       lpeversion="1"
       offset_points="0.27660568,0.093923306 | 0.59417854,0.16514284 | 0.83467878,0.091693826"
       not_jump="false"
       sort_points="true"
       interpolator_type="CentripetalCatmullRom"
       interpolator_beta="0.2"
       start_linecap_type="zerowidth"
       linejoin_type="round"
       miter_limit="4"
       scale_width="1"
       end_linecap_type="zerowidth" /><inkscape:path-effect
       effect="powerstroke"
       id="path-effect23726"
       is_visible="true"
       lpeversion="1"
       offset_points="0.31584602,0.083726529 | 0.73885033,0.17708423 | 0.95249907,0.041558736"
       not_jump="false"
       sort_points="true"
       interpolator_type="CentripetalCatmullRom"
       interpolator_beta="0.2"
       start_linecap_type="zerowidth"
       linejoin_type="round"
       miter_limit="4"
       scale_width="1"
       end_linecap_type="zerowidth" /><inkscape:path-effect
       effect="powerstroke"
       id="path-effect22518"
       is_visible="true"
       lpeversion="1"
       offset_points="0.2,0.24631175 | 4.1389756,0.17925401 | 3.2299238,0.063404388 | 7.8097577,0.18375283 | 7.4784222,0.24732171 | 7.249656,0.11040214 | 6.5683994,0.34539207 | 5.5670332,0.22066748"
       not_jump="false"
       sort_points="true"
       interpolator_type="CentripetalCatmullRom"
       interpolator_beta="0.2"
       start_linecap_type="zerowidth"
       linejoin_type="round"
       miter_limit="4"
       scale_width="1"
       end_linecap_type="zerowidth" /></defs><g
     inkscape:label="Layer 1"
     inkscape:groupmode="layer"
     id="layer1"
     transform="translate(-564.28276,-124.16167)"><g
       id="g28003"
       transform="translate(83.767651,41.616489)"><path
         style="fill:#505050;fill-opacity:1;stroke-width:0.492623;stroke-linejoin:round;paint-order:fill markers stroke"
         d="m 545.08434,128.43336 c 0,0 1.69291,2.15728 2.67607,3.16448 0.98315,1.00719 1.74822,1.6198 1.74822,1.6198 l -3.72468,-0.33562 c 0,0 0.19143,-1.40887 -0.18209,-2.60258 -0.37349,-1.19371 -0.51752,-1.84608 -0.51752,-1.84608 z"
         id="path12258" /><path
         style="fill:#505050;fill-opacity:1;stroke-width:0.492623;stroke-linejoin:round;paint-order:fill markers stroke"
         d="m 516.384,92.656292 c 0,0 -6.31095,2.425625 -7.91848,3.610958 -1.60757,1.185327 -5.37474,4.29464 -5.37474,4.29464 0,0 -4.89712,4.81577 -5.68662,5.01753 -0.78949,0.20176 -6.32715,1.37168 -7.1325,1.24587 -0.80534,-0.12581 -3.25398,-0.21579 -4.0723,-0.94008 -0.8183,-0.72429 2.56108,2.28134 4.7521,2.92501 2.19105,0.64367 2.20606,0.6672 2.43956,0.96642 0.2335,0.29921 1.43629,1.89533 2.00044,2.2846 0.56413,0.38926 1.50657,1.06105 2.35462,0.85151 0.84802,-0.20952 1.46942,-0.76068 1.46942,-0.76068 0,0 6.59313,3.476 9.12051,3.38645 2.5274,-0.0896 10.16268,-1.7683 12.2384,-2.60533 2.07573,-0.83704 4.82845,-2.03031 4.07147,-2.60077 -0.75697,-0.57047 -4.91761,-3.93028 -5.05416,-4.21455 -0.13658,-0.28428 -1.71252,-4.36115 -3.24198,-5.53319 -1.52944,-1.172047 -2.0894,-1.836737 -2.0894,-1.836737 0,0 1.12215,-2.05413 1.40348,-2.87247 0.28132,-0.818325 0.89012,-2.300464 0.72018,-3.219181 z"
         id="path11547" /><path
         style="fill:#c7c7c7;fill-opacity:1;stroke-width:0.492623;stroke-linejoin:round;paint-order:fill markers stroke"
         d="m 520.37445,106.66632 c 0,0 0.16117,-1.97712 0.93265,-3.92198 0.77146,-1.94484 2.42754,-5.400683 4.56199,-6.936199 2.13443,-1.535495 5.32231,-2.649932 7.24733,-1.768154 1.925,0.881788 3.30934,2.267412 4.25019,3.783436 0.94087,1.51603 2.86444,-7.789696 3.00538,-9.364143 0.14095,-1.574447 0.0836,-5.151549 0.0836,-5.151549 0,0 -0.52056,-1.516069 1.00312,0.355468 1.52371,1.871537 3.49992,5.208832 3.60044,7.669599 0.10046,2.460768 -0.50797,4.184664 -1.51406,5.212854 -1.00612,1.028199 1.7585,-1.070111 3.95126,-1.887796 2.19274,-0.817678 7.7222,-2.948653 10.31093,-2.949353 2.58874,-7.78e-4 6.05757,0.200055 8.66761,3.706731 2.61006,3.506679 4.46973,7.790036 5.14525,8.577306 0.67553,0.78726 2.32569,1.8824 5.03753,1.85651 2.71182,-0.0259 5.24114,-0.33974 5.70001,-0.45388 0.45887,-0.11413 0.68798,-0.1289 0.68798,-0.1289 0,0 0.35894,1.33384 -0.0447,2.45452 -0.40359,1.12067 -1.78334,2.87786 -2.9158,3.3444 -1.13244,0.46655 -3.97174,1.35783 -3.97174,1.35783 0,0 -0.23858,0.49547 1.11953,1.74239 1.35812,1.2469 5.85103,5.05764 6.82102,5.61468 0.97,0.55704 3.64935,1.93874 6.33261,1.79071 2.68326,-0.14803 2.82419,-0.21497 1.3098,0.94687 -1.51441,1.16185 -5.56499,4.39107 -7.96505,5.16754 -2.40006,0.77646 -6.63327,1.25544 -8.75501,0.73172 -2.12172,-0.52372 -3.6161,-1.17049 -3.80578,-1.24713 -0.18966,-0.0767 -4.91875,4.17996 -4.91875,4.17996 0,0 -5.68554,4.70694 -6.87281,5.07153 -1.18727,0.36461 -4.15564,0.86991 -6.37301,-0.47082 -2.21738,-1.34072 -5.02193,-4.2652 -5.8308,-5.09387 -0.80885,-0.82868 -2.19068,-2.52083 -2.19068,-2.52083 0,0 0.71406,2.18118 0.74767,2.83043 0.0336,0.64925 0.32311,3.10269 -0.62301,4.05576 -0.94609,0.95309 -3.11174,2.3498 -4.36247,2.47766 -1.25071,0.12785 -1.68357,0.009 -1.68709,-0.0654 -0.003,-0.0737 0.0354,-0.28828 0.76554,-0.85414 0.73011,-0.56585 1.15568,-1.9106 1.11048,-2.48333 -0.0452,-0.57274 -0.86109,-2.99923 -1.0792,-3.37793 -0.21811,-0.37871 -2.04121,-2.76087 -4.60028,-3.62675 -2.55907,-0.86589 -7.14231,-2.09838 -9.4975,-4.79786 -2.35519,-2.69949 -6.58062,-7.2285 -7.17703,-7.74484 -0.59641,-0.51635 -1.26836,-0.75781 -1.26836,-0.75781 0,0 4.78739,-1.58148 5.40269,-1.93077 0.61533,-0.34928 2.03077,-1.14373 2.03052,-1.47742 -2.3e-4,-0.33369 -1.84787,-1.81676 -1.84787,-1.81676 z"
         id="path12856" /><path
         style="fill:#c7c7c7;fill-opacity:1;stroke-width:0.492623;stroke-linejoin:round;paint-order:fill markers stroke"
         d="m 493.1974,109.54211 c 0,0 -3.16989,-1.18804 -3.8658,-1.5234 -0.69592,-0.33534 -3.24781,-1.97587 -3.24781,-1.97587 l -0.095,-0.36038 c 0,0 1.32563,1.2075 3.55909,1.12104 2.23343,-0.0864 8.54777,-1.42474 8.54777,-1.42474 l 5.314,-3.94503 c 0,0 7.56653,-4.192847 11.87217,-1.688697 1.22741,0.713837 3.69254,4.694967 3.82379,5.090467 0.13122,0.39551 -1.36027,-1.46952 -4.75528,-1.01551 -3.39502,0.45401 -8.08991,2.38322 -9.41795,4.65946 -1.32806,2.27624 -4.86761,4.00053 -4.86761,4.00053 l -0.8532,-0.36567 c 0,0 -0.28915,-1.54795 -0.90768,-2.02258 -0.61858,-0.47465 -1.61498,-1.59841 -3.17732,-1.31411 -1.56233,0.2843 -1.92921,0.76449 -1.92921,0.76449 z"
         id="path11977"
         sodipodi:nodetypes="csccsccssssccsscc" /><path
         style="fill:#505050;fill-opacity:1;stroke-width:0.492623;stroke-linejoin:round;paint-order:fill markers stroke"
         d="m 500.62132,113.65176 c -0.0706,-0.0106 -6.74471,0.58584 -8.45313,0.37897 -1.70845,-0.20689 -9.06173,-0.22698 -10.01631,-0.0774 -0.95461,0.14967 -2.64885,0.21403 0.22604,0.91639 2.87489,0.70238 16.24216,3.87578 16.24216,3.87578 0,0 6.14504,1.33318 9.33541,1.21089 3.19037,-0.12231 8.50958,0.52888 10.75398,1.54149 2.24439,1.0126 8.63033,4.53943 9.88404,5.24144 1.25369,0.702 8.32063,3.57751 9.61246,3.92108 1.29183,0.34357 2.08766,0.66121 1.4345,-0.16347 -0.65316,-0.82469 -2.27824,-2.63505 -4.3432,-3.16633 -2.06497,-0.53127 -7.07608,-2.32623 -9.59243,-4.86125 -2.51636,-2.53505 -6.09362,-6.97475 -7.08164,-7.63387 -0.98801,-0.65911 -1.11093,-0.99621 -1.94067,-0.84787 -0.82978,0.14834 -5.50758,1.6572 -7.39486,1.5363 -1.8873,-0.12091 -2.76753,-0.25855 -2.76753,-0.25855 z"
         id="path12256" /><path
         style="fill:#505050;fill-opacity:1;stroke-width:0.492623;stroke-linejoin:round;paint-order:fill markers stroke"
         d="m 566.53378,131.24326 4.15155,1.84523 3.57434,2.07081 c 0,0 0.85877,0.56555 -0.63439,0.33189 -1.49315,-0.23365 -4.55408,-0.98584 -5.54689,-0.98584 -0.9928,0 -4.98442,-0.54244 -4.98442,-0.54244 z"
         id="path12260" /><path
         style="fill:#505050;fill-opacity:1;stroke-width:0.492623;stroke-linejoin:round;paint-order:fill markers stroke"
         d="m 578.06881,111.86963 c 0,0 4.24605,-1.88412 5.34888,-3.67213 1.10281,-1.788 2.40962,-4.7144 1.30121,-6.33273 -0.60231,-1.32344 -1.41705,-2.274537 -1.41705,-2.274537 0,0 4.94122,1.379687 7.14057,2.382897 2.1994,1.00321 6.79183,4.03305 7.2621,7.38925 0.47029,3.3562 -2.63097,6.56714 -5.79423,7.64704 -3.16325,1.07992 -8.37537,2.06636 -8.93713,1.98672 -0.56177,-0.0796 -6.76438,-5.62678 -6.8173,-6.03845 -0.0529,-0.41168 -0.23871,-0.48475 0.50095,-0.72696 0.73968,-0.24221 1.412,-0.3611 1.412,-0.3611 z"
         id="path12262"
         sodipodi:nodetypes="csccssssssc" /><path
         style="fill:#000000;fill-opacity:1;fill-rule:nonzero;stroke:none;stroke-width:0.492624;stroke-linejoin:round;stroke-opacity:1;paint-order:fill markers stroke"
         d="m 503.10592,100.66234 c 0.0261,0.0283 0.13908,0.1254 0.473,-0.0986 0.22877,-0.15349 0.60675,-0.47509 1.3473,-1.115363 0.39196,-0.338886 0.92451,-0.800464 1.43591,-1.230232 0.45484,-0.382246 0.9276,-0.76888 1.32691,-1.067464 0.0911,-0.07018 0.21587,-0.160624 0.37227,-0.268553 0.15116,-0.104317 0.33122,-0.224532 0.53672,-0.357139 0.39687,-0.256106 0.88984,-0.559209 1.44185,-0.876273 0.53839,-0.309243 1.13089,-0.630555 1.73779,-0.930483 0.60469,-0.298833 1.21727,-0.573269 1.80118,-0.793271 0.22491,-0.09217 0.51923,-0.214968 0.82278,-0.342867 0.31813,-0.13404 0.64528,-0.273201 0.93917,-0.399421 0.68796,-0.295461 1.09091,-0.475797 1.0876,-0.484271 a 0.01310832,0.01317735 34.216103 0 0 -0.0254,0.0049 c 0,-0.0051 0.016,0.107872 0.0119,0.278608 l -0.0634,-0.06493 c -0.01,0.264637 -0.0621,0.633106 -0.1845,1.105189 -0.25509,0.983673 -0.83553,2.490379 -2.0775,4.65229 a 0.17037955,0.16285221 36.742939 0 0 0.0344,0.204322 c 0.15738,0.146868 0.32142,0.293462 0.50213,0.45035 0.37798,0.328141 0.88692,0.749662 1.31789,1.147862 0.58911,0.54429 1.18204,1.17353 1.72916,2.02131 0.77287,1.1968 1.17981,2.22412 1.38008,2.84478 0.1724,0.53427 0.20161,0.83149 0.1726,0.82701 l 0.12469,0.18311 c -0.0228,0.0263 0.8874,0.66585 1.91494,1.43924 0.14974,0.1127 0.30212,0.22816 0.45643,0.34606 0.41361,0.31603 0.84497,0.6463 1.27134,0.99041 0.60478,0.48811 1.14564,0.96115 1.57216,1.41037 1.6e-4,0.003 2.4e-4,0.005 2.1e-4,0.008 -2.1e-4,0.0259 -0.009,0.0613 -0.0315,0.10572 -0.0229,0.0453 -0.0579,0.0959 -0.1052,0.15063 -0.0486,0.0563 -0.10863,0.11512 -0.17878,0.17568 -0.14892,0.12858 -0.33902,0.26109 -0.55468,0.39178 -0.23715,0.14372 -0.50365,0.28431 -0.77929,0.41562 0,0 -0.005,0.002 -0.005,0.002 -0.70431,0.33509 -1.45364,0.60025 -2.12659,0.82149 -0.53996,0.17751 -1.38339,0.43933 -2.14461,0.6757 -0.15321,0.0476 -0.31131,0.0962 -0.47431,0.14565 -1.84272,0.55944 -3.80347,1.07628 -5.71484,1.45816 -0.47344,0.0946 -0.9061,0.17331 -1.30206,0.23963 -0.45655,0.0765 -0.89762,0.14491 -1.33138,0.20173 -1.10131,0.14426 -1.79198,0.16293 -2.18482,0.14924 0.3864,0.0633 1.08041,0.15675 2.20686,0.11602 0.43915,-0.0159 0.89831,-0.0508 1.36029,-0.10303 0.40325,-0.0456 0.84588,-0.10645 1.32701,-0.18494 1.89967,-0.3099 3.97783,-0.8262 5.78737,-1.39752 0.16395,-0.0518 0.32296,-0.10312 0.47675,-0.15387 0.83895,-0.27686 1.5228,-0.54917 2.12258,-0.80549 0.61179,-0.26147 1.43211,-0.63575 2.09428,-0.96408 0,0 0.005,-0.002 0.005,-0.002 0.27685,-0.13734 0.54952,-0.27893 0.79683,-0.42022 0.224,-0.12796 0.43078,-0.25773 0.60128,-0.38522 0.0806,-0.0603 0.15463,-0.12116 0.21916,-0.18221 0.0623,-0.0589 0.11802,-0.12012 0.16267,-0.18327 0.0433,-0.0612 0.0792,-0.12854 0.0987,-0.20148 0.0195,-0.0727 0.0225,-0.15077 6.2e-4,-0.23029 a 0.12978787,0.03076122 47.270608 0 0 -0.0322,-0.0572 c -0.38745,-0.52304 -0.89152,-1.08221 -1.47399,-1.64178 -0.40286,-0.38703 -0.8266,-0.75804 -1.23746,-1.08882 -0.15421,-0.12415 -0.30786,-0.24456 -0.45932,-0.36049 -1.02655,-0.78578 -1.99798,-1.39323 -2.02323,-1.364 a 0.1462463,0.10536659 19.9757 0 0 0.12469,0.18311 c -0.029,-0.004 -0.11857,-0.30627 -0.32004,-0.85462 -0.22579,-0.61456 -0.66503,-1.69726 -1.45948,-2.91957 -0.57378,-0.88229 -1.19248,-1.53659 -1.80292,-2.09076 -0.45584,-0.413831 -0.95651,-0.813254 -1.35127,-1.134065 -0.14787,-0.120169 -0.28251,-0.229976 -0.41372,-0.338872 1.17019,-2.14148 1.67476,-3.661276 1.88874,-4.654567 0.10468,-0.485928 0.14357,-0.865569 0.14663,-1.141159 a 0.05921587,0.02472477 68.35362 0 0 -0.0634,-0.06493 c 0.004,-0.166246 -0.0119,-0.282935 -0.0119,-0.287991 l -0.0254,0.0049 c -0.004,-0.0093 -0.41839,0.140976 -1.12256,0.392662 -0.29656,0.105998 -0.63935,0.227908 -0.96022,0.338834 -0.31121,0.107589 -0.60984,0.207647 -0.83875,0.277103 -0.60627,0.204079 -1.24018,0.463282 -1.8638,0.746632 -0.626,0.284437 -1.23732,0.591254 -1.79281,0.886708 -0.56918,0.302735 -1.08048,0.593922 -1.49357,0.839639 -0.21404,0.127321 -0.40339,0.243424 -0.56379,0.344535 -0.16537,0.104246 -0.30229,0.194022 -0.40664,0.265839 -0.42398,0.299422 -0.91725,0.689968 -1.37702,1.069733 -0.53206,0.439481 -1.04715,0.887446 -1.44603,1.244287 -0.71616,0.640685 -1.10493,1.025987 -1.265,1.221287 -0.25636,0.31281 -0.16696,0.43558 -0.14157,0.46311 z"
         id="path22516"
         sodipodi:nodetypes="cssccsccc"
         inkscape:path-effect="#path-effect22518"
         inkscape:original-d="m 503.10592,100.66234 c 0,0 2.8337,-2.612847 4.40637,-3.755058 0.79854,-0.579969 3.61951,-2.30449 6.00521,-3.154536 0.90051,-0.320861 2.88554,-1.117579 2.88554,-1.117579 0,0 0.31356,1.710553 -2.16985,6.120136 1.20895,1.06997 2.5022,1.925517 3.60882,3.633537 1.31774,2.03387 1.6661,3.72299 1.6661,3.72299 0,0 3.51325,2.29446 5.21294,4.32957 0.47942,1.3984 -12.0663,5.53602 -17.08845,5.03945" /><path
         style="fill:#000000;fill-opacity:1;stroke:none;stroke-width:0.492624;stroke-linejoin:round;stroke-opacity:1;paint-order:fill markers stroke"
         d="m 502.15381,95.704211 c 0.53275,-0.03283 1.63824,4.099152 1.16336,7.087319 -0.5087,3.20095 -0.97869,3.52784 -0.97869,3.52784 0,0 2.02022,0.99879 3.68624,2.29058 1.85919,1.44157 4.0401,3.82826 4.42198,5.66507 -0.61405,1.16452 -6.77695,2.07805 -8.56226,0.72293 -2.20356,-1.67257 -2.1257,-3.04097 -2.29907,-4.37814 -0.14151,-1.09133 -0.30895,-2.13129 0.0466,-3.4031 -0.65969,-0.0262 -2.17921,-1.65223 -2.2209,-2.73214 -0.13471,-3.48876 3.72685,-8.756389 4.74272,-8.780359 1.01587,-0.02397 2e-5,0 2e-5,0 z"
         id="path22992"
         sodipodi:nodetypes="zscscsscszz" /><path
         style="fill:#ffffff;fill-opacity:1;stroke:none;stroke-width:0.492624;stroke-linejoin:round;stroke-opacity:1;paint-order:fill markers stroke"
         d="m 497.7861,103.81949 c 0,0 1.54754,-0.40996 2.18051,-0.61357 0.60731,-0.19536 2.5728,-1.26082 2.65114,-1.13862 0.0783,0.12219 0.15082,2.41768 -0.50889,2.75959 -0.6597,0.3419 -2.93202,0.97753 -3.66149,0.59542 -0.72943,-0.38212 -0.66729,-1.08539 -0.66127,-1.60282 z"
         id="path22994"
         sodipodi:nodetypes="cssssc" /><path
         style="fill:#ffffff;fill-opacity:1;stroke:none;stroke-width:0.492624;stroke-linejoin:round;stroke-opacity:1;paint-order:fill markers stroke"
         d="m 500.68631,112.59647 c 0,0 1.52983,-0.0327 3.56241,-0.35456 2.03255,-0.32181 3.56764,-1.18348 4.15655,-0.35838 0.5889,0.82511 1.78943,1.57725 -0.28605,2.22151 -2.07549,0.64427 -4.74761,0.99243 -5.5736,0.56547 -0.826,-0.42697 -1.59044,-1.59524 -1.85931,-2.07404 z"
         id="path23722" /><path
         style="fill:#000000;fill-opacity:1;fill-rule:nonzero;stroke:none;stroke-width:0.492624;stroke-linejoin:round;stroke-opacity:1;paint-order:fill markers stroke"
         d="m 503.23281,97.583765 0,0 c 0.003,0.01107 0.0567,0.01787 0.22347,0.07711 0.0385,0.01367 0.0794,0.02987 0.12324,0.04948 0.11555,0.05167 0.27448,0.147626 0.46988,0.310168 0.287,0.238734 0.56285,0.540742 0.90383,0.950798 0.0173,0.02086 0.0349,0.04198 0.0526,0.06345 0.43013,0.519938 0.81049,1.032416 1.13106,1.550226 0.13653,0.22053 0.24529,0.40043 0.30056,0.49538 -0.0403,-0.0979 -0.12138,-0.30059 -0.2272,-0.53446 -0.23423,-0.5176 -0.5421,-1.182961 -0.92771,-1.723521 -0.0169,-0.0237 -0.0338,-0.04696 -0.0508,-0.06977 -0.32218,-0.433907 -0.68351,-0.761503 -1.01986,-0.963131 -0.24368,-0.146073 -0.44068,-0.207423 -0.58087,-0.238457 -0.0528,-0.01169 -0.10259,-0.01885 -0.14863,-0.02198 -0.22549,-0.01532 -0.24972,0.05438 -0.24964,0.05472 z"
         id="path23724"
         inkscape:path-effect="#path-effect23726"
         inkscape:original-d="m 503.23281,97.583765 c 0,0 1.32608,-0.308904 3.20468,3.496605"
         sodipodi:nodetypes="cc" /><path
         style="fill:#000000;fill-opacity:1;fill-rule:nonzero;stroke:none;stroke-width:0.492624;stroke-linejoin:round;stroke-opacity:1;paint-order:fill markers stroke"
         d="m 508.15222,106.00768 0,0 c -0.0149,0.005 0.0571,0.39592 0.21693,1.03197 0.12246,0.48716 0.2735,1.11584 0.43701,1.80189 0.0663,0.27797 0.14247,0.59847 0.20538,0.85842 0.12254,0.50632 0.23362,0.95298 0.33024,1.38206 0.0557,0.24728 0.10272,0.47227 0.13948,0.67582 0.0177,0.0978 0.0346,0.19473 0.0503,0.29168 0.0245,0.15163 0.0428,0.28497 0.0552,0.40445 0.0172,0.16496 0.0199,0.27449 0.0189,0.3389 0.0156,-0.0625 0.04,-0.17046 0.0555,-0.33927 0.0112,-0.12139 0.0165,-0.26034 0.0144,-0.41648 -0.001,-0.0996 -0.006,-0.20123 -0.0123,-0.30166 -0.0141,-0.21027 -0.0369,-0.44303 -0.0705,-0.69807 -0.0569,-0.43149 -0.14307,-0.91241 -0.25986,-1.41374 -0.0649,-0.27849 -0.14097,-0.56889 -0.22346,-0.86105 -0.19117,-0.67703 -0.39986,-1.30548 -0.56013,-1.77618 -0.26458,-0.77708 -0.37825,-0.98478 -0.39708,-0.97874 z"
         id="path23728"
         inkscape:path-effect="#path-effect23730"
         inkscape:original-d="m 508.15222,106.00768 c 0,0 1.66372,5.18998 1.45342,6.78519" /><path
         style="fill:#000000;fill-opacity:1;fill-rule:nonzero;stroke:none;stroke-width:0.492624;stroke-linejoin:round;stroke-opacity:1;paint-order:fill markers stroke"
         d="m 497.90898,105.34428 v 0 c -0.009,-0.0336 -0.0829,-0.13542 -0.64934,-0.0389 -0.44444,0.0757 -1.41048,0.31622 -2.89089,0.62996 -0.85339,0.18086 -1.88281,0.38278 -2.82866,0.51189 -0.43923,0.06 -0.86169,0.1044 -1.24049,0.12369 -0.37033,0.0189 -0.69246,0.0133 -0.9463,-0.0229 -0.53801,-0.0778 -0.92083,-0.12147 -1.2101,-0.15204 -0.30401,-0.0321 -0.48943,-0.0485 -0.65578,-0.074 -0.0865,-0.0133 -0.16256,-0.0284 -0.23717,-0.0477 -0.041,-0.0106 -0.0814,-0.0224 -0.12201,-0.0357 -0.0375,-0.0122 -0.0769,-0.0263 -0.1193,-0.0426 -0.16622,-0.0641 -0.36326,-0.15672 -0.68361,-0.30938 -0.0388,-0.0185 -0.0735,-0.034 -0.10343,-0.0462 -0.0292,-0.0119 -0.0569,-0.0219 -0.081,-0.028 -0.0121,-0.003 -0.0256,-0.006 -0.0394,-0.007 -0.007,-5.6e-4 -0.015,-7.6e-4 -0.0236,-1.4e-4 -0.008,6.2e-4 -0.0187,0.002 -0.0296,0.006 -0.0112,0.003 -0.0239,0.009 -0.0366,0.0187 -0.013,0.01 -0.0246,0.0227 -0.0332,0.0386 -0.009,0.0157 -0.0126,0.0318 -0.014,0.0463 -0.001,0.0142 -2.3e-4,0.0269 0.002,0.0371 0.004,0.0195 0.0106,0.036 0.0164,0.0475 0.006,0.0121 0.0133,0.0236 0.0205,0.0339 0.0144,0.0206 0.0327,0.0422 0.0535,0.0644 0.0211,0.0225 0.0462,0.047 0.0748,0.0732 0.0287,0.0264 0.0614,0.0548 0.0976,0.0851 0.14721,0.12307 0.35617,0.2787 0.61149,0.45404 0.2666,0.18309 0.57924,0.3846 0.92256,0.59257 0.80593,0.48819 1.68097,0.9523 2.52341,1.33604 1.13478,0.5169 2.00878,0.79534 2.45906,0.88939 0.31267,0.0653 0.48591,0.0417 0.57061,0.0468 -0.0842,-0.0428 -0.2034,-0.14038 -0.50189,-0.26688 -0.40288,-0.17073 -1.29048,-0.49071 -2.38041,-0.99147 -0.83688,-0.38449 -1.69273,-0.82384 -2.50714,-1.29131 -0.34428,-0.19761 -0.65745,-0.38681 -0.92619,-0.55737 -0.25783,-0.16363 -0.46665,-0.30498 -0.6137,-0.41284 -0.036,-0.0264 -0.0678,-0.0505 -0.0955,-0.0721 -0.0277,-0.0217 -0.0505,-0.0403 -0.0689,-0.0562 -0.0199,-0.0172 -0.0297,-0.0266 -0.0386,-0.035 -0.004,-0.003 -0.005,-0.005 -0.005,-0.004 -8e-5,0.001 0.002,0.005 0.004,0.0179 9.3e-4,0.006 0.002,0.0148 6.3e-4,0.0254 -0.001,0.011 -0.004,0.0239 -0.0115,0.0368 -0.007,0.0131 -0.0167,0.0236 -0.0271,0.0313 -0.01,0.007 -0.0195,0.0114 -0.0269,0.0136 -0.007,0.002 -0.0129,0.003 -0.0163,0.003 -0.004,7e-5 -0.006,-3.3e-4 -0.007,-6.7e-4 -0.002,-8.2e-4 10e-4,-0.001 0.006,-9.9e-4 0.0104,7.1e-4 0.0288,0.005 0.0542,0.0126 0.0254,0.008 0.0567,0.0194 0.0939,0.0346 0.33106,0.13588 0.53125,0.21529 0.70615,0.27993 0.0441,0.0163 0.0849,0.031 0.12394,0.0448 0.0422,0.0149 0.084,0.0293 0.12665,0.0432 0.0776,0.0254 0.15616,0.0489 0.24492,0.0724 0.1672,0.0442 0.35905,0.0856 0.65543,0.14455 0.37135,0.0738 0.81995,0.15978 1.1913,0.23361 0.28382,0.0558 0.63208,0.075 1.01541,0.069 0.39428,-0.006 0.83035,-0.0389 1.27888,-0.0882 0.96599,-0.10604 2.01171,-0.29067 2.87303,-0.46376 1.49614,-0.30065 2.46423,-0.55727 2.89393,-0.70252 0.55107,-0.18628 0.55982,-0.31729 0.55115,-0.34953 z"
         id="path23732"
         sodipodi:nodetypes="cssc"
         inkscape:path-effect="#path-effect23734"
         inkscape:original-d="m 497.90898,105.34428 c 0,0 -6.4524,1.73436 -8.58404,1.36935 -2.13166,-0.36501 -1.80576,-0.19394 -3.03818,-0.73998 -1.22142,-0.54115 3.03312,2.51392 7.02931,3.60085" /><path
         style="fill:#000000;fill-opacity:1;fill-rule:nonzero;stroke:none;stroke-width:0.492624;stroke-linejoin:round;stroke-opacity:1;paint-order:fill markers stroke"
         d="m 493.20606,109.58921 c 9.3e-4,0.005 0.19873,-0.14977 0.80314,-0.40167 0.22134,-0.0922 0.49443,-0.18923 0.78743,-0.2513 0.27354,-0.058 0.56511,-0.0856 0.84831,-0.0503 0.28147,0.035 0.61171,0.11268 0.95565,0.24716 0.34261,0.13396 0.69208,0.32165 1.01657,0.57268 0.33278,0.25745 0.63152,0.57542 0.8724,0.96055 0.25584,0.40905 0.43961,0.88286 0.53794,1.42433 -0.002,-0.008 -3.4e-4,-0.014 -8.5e-4,-0.0126 -7.4e-4,0.002 -0.003,0.01 -0.0124,0.023 -0.005,0.007 -0.0107,0.0151 -0.0182,0.024 -0.0211,0.0251 -0.0523,0.0554 -0.096,0.0898 -0.0567,0.0447 -0.1299,0.0928 -0.21876,0.14204 -0.0855,0.0474 -0.18327,0.0947 -0.29013,0.13948 -0.20862,0.0875 -0.44535,0.16283 -0.67727,0.20983 -0.11476,0.0233 -0.2264,0.0392 -0.33118,0.0464 -0.10594,0.007 -0.20262,0.006 -0.28756,-0.005 -0.21415,-0.0319 -0.42759,-0.0987 -0.63748,-0.19135 -0.21658,-0.0956 -0.42797,-0.21823 -0.63057,-0.35646 -0.43726,-0.29836 -0.83663,-0.67191 -1.16003,-1.00854 -0.38758,-0.40344 -0.72128,-0.81307 -0.91103,-1.0499 -0.12948,-0.16159 -0.27269,-0.34487 -0.32301,-0.40921 0.002,0.003 -0.0473,-0.0606 -0.0449,-0.0575 -0.0149,-0.0191 -0.0608,-0.0782 -0.0757,-0.0973 -0.0503,-0.0647 -0.0762,-0.0978 -0.0914,-0.11551 z m -0.11181,-0.0131 c 0.0134,0.0141 0.0409,0.0418 0.0911,0.10288 0.0203,0.0247 0.0445,0.0551 0.0751,0.0948 0.0131,0.0169 0.0276,0.0359 0.0439,0.0575 0.109,0.14387 0.20465,0.27387 0.31365,0.41774 0.18506,0.2441 0.50961,0.66531 0.8947,1.08689 0.31948,0.34974 0.72167,0.74586 1.17064,1.06895 0.20847,0.15003 0.43041,0.2868 0.66224,0.39637 0.22463,0.10617 0.46023,0.18762 0.70333,0.23025 0.10767,0.0205 0.22482,0.0283 0.34681,0.0258 0.12101,-0.002 0.24747,-0.0149 0.375,-0.0353 0.2569,-0.0411 0.51816,-0.11428 0.74948,-0.20284 0.11888,-0.0455 0.23012,-0.0952 0.3299,-0.14704 0.10308,-0.0536 0.19506,-0.11016 0.27201,-0.16832 0.0589,-0.0445 0.11111,-0.0915 0.15339,-0.14097 0.0154,-0.018 0.0302,-0.0371 0.0437,-0.0572 0.0246,-0.0366 0.0468,-0.0791 0.0602,-0.1266 0.0133,-0.0468 0.0183,-0.0994 0.008,-0.1543 -0.10796,-0.58444 -0.31133,-1.10119 -0.59735,-1.54853 -0.26908,-0.42083 -0.60155,-0.76487 -0.96835,-1.03943 -0.35718,-0.26735 -0.7389,-0.46281 -1.10967,-0.59858 -0.37203,-0.13623 -0.72941,-0.21108 -1.03617,-0.23958 -0.32512,-0.0303 -0.64806,0.0126 -0.93764,0.0841 -0.31133,0.0769 -0.59573,0.18984 -0.82171,0.29473 -0.61946,0.28751 -0.8083,0.46597 -0.80737,0.47132 z"
         id="path23736"
         sodipodi:nodetypes="csssc"
         inkscape:path-effect="#path-effect23738"
         inkscape:original-d="m 493.15764,109.51897 c 0,0 1.31308,-0.90508 2.5028,-0.77672 1.18975,0.12836 3.11865,0.97717 3.54705,3.31543 0.0669,0.36489 -1.35981,0.95815 -2.13542,0.8318 -1.80741,-0.29443 -3.50683,-2.91797 -3.91443,-3.37051 z" /><path
         style="fill:#000000;fill-opacity:1;stroke:none;stroke-width:0.492624;stroke-linejoin:round;stroke-opacity:1;paint-order:fill markers stroke"
         d="m 486.52035,106.11535 c 0,0 0.30259,-0.62476 -1.21736,-3.07753 -0.62268,-1.00483 -2.04809,-1.08344 -1.21512,0.6414 0.97294,2.01468 2.13156,2.64738 2.43248,2.43613 z"
         id="path23740"
         sodipodi:nodetypes="cssc" /><path
         style="fill:#000000;fill-opacity:1;fill-rule:nonzero;stroke:none;stroke-width:0.492624;stroke-linejoin:round;stroke-opacity:1;paint-order:fill markers stroke"
         d="m 499.08976,112.04748 c 0.0134,0.0231 0.0364,0.0927 0.0804,0.13836 0.0695,0.072 0.22781,0.14951 0.33713,0.21221 0.0989,0.0567 0.18729,0.12366 0.28916,0.15043 0.10065,0.0265 0.26501,0.009 0.31801,0.0109 -0.0333,-0.0413 -0.11812,-0.18312 -0.19972,-0.24772 -0.0826,-0.0654 -0.18919,-0.0959 -0.29393,-0.14087 -0.11579,-0.0498 -0.27287,-0.1298 -0.37215,-0.14213 -0.0629,-0.008 -0.13243,0.0157 -0.15892,0.0188 z"
         id="path24226"
         inkscape:path-effect="#path-effect24228"
         inkscape:original-d="m 499.08976,112.04748 1.02472,0.51193"
         sodipodi:nodetypes="cc" /><path
         style="fill:#000000;fill-opacity:1;fill-rule:nonzero;stroke:none;stroke-width:0.492624;stroke-linejoin:round;stroke-opacity:1;paint-order:fill markers stroke"
         d="m 501.08494,113.62662 c -0.004,-0.0413 -0.0618,-0.17288 -0.47262,-0.19233 -0.26969,-0.0128 -0.73245,0.0127 -1.45156,0.0674 -0.49631,0.0378 -1.09538,0.0881 -1.70645,0.13719 -0.56909,0.0457 -1.13519,0.0891 -1.61841,0.11882 -0.74351,0.0456 -1.57127,0.0627 -2.35842,0.055 -0.27657,-0.003 -0.55302,-0.007 -0.8255,-0.0125 -1.09857,-0.0225 -2.1885,-0.0685 -3.05981,-0.13646 -0.22154,-0.0175 -0.50272,-0.0289 -0.82861,-0.0354 -0.31827,-0.006 -0.68204,-0.008 -1.07849,-0.005 -0.75477,0.005 -1.63313,0.0241 -2.52204,0.0536 -0.51268,0.017 -1.02809,0.0373 -1.51234,0.0596 -0.2868,0.0132 -0.56844,0.0273 -0.83285,0.0421 -0.32029,0.0179 -0.61549,0.0368 -0.85717,0.0559 -0.11546,0.009 -0.21924,0.0183 -0.30746,0.0275 -0.0854,0.009 -0.15889,0.018 -0.21463,0.0273 -0.0954,0.0158 -0.20677,0.0309 -0.31756,0.0475 -0.0537,0.008 -0.10813,0.0167 -0.15985,0.0261 -0.0508,0.009 -0.10118,0.0196 -0.14734,0.0315 -0.0448,0.0115 -0.0908,0.0259 -0.13164,0.0446 -0.0205,0.009 -0.0424,0.0211 -0.0632,0.036 -0.0205,0.0146 -0.0437,0.0349 -0.0632,0.0626 -0.0201,0.0287 -0.0362,0.0654 -0.0398,0.10879 -0.004,0.0432 0.006,0.0826 0.0213,0.11546 0.0147,0.0316 0.0347,0.0576 0.0543,0.0784 0.0197,0.0209 0.0421,0.0396 0.0652,0.0565 0.0458,0.0334 0.1034,0.0657 0.17151,0.098 0.0686,0.0325 0.15162,0.0668 0.25055,0.10318 0.19738,0.0727 0.46321,0.1559 0.81269,0.25234 0.70487,0.19453 1.75129,0.4431 3.25217,0.76367 1.52841,0.32648 3.3193,0.76963 5.13342,1.22911 2.03434,0.51527 3.81613,0.97803 5.75032,1.45297 2.0767,0.50993 3.87849,0.92066 5.44964,1.21911 0.88162,0.16746 1.65331,0.29232 2.32937,0.37804 0.77645,0.0984 1.40655,0.14268 1.92102,0.14463 1.40792,0.005 2.56364,-0.007 3.64926,0.0129 1.08325,0.0198 2.54827,0.0711 4.14453,0.27536 0.19371,0.0248 0.39561,0.0526 0.60442,0.0839 1.13225,0.1697 2.39341,0.42895 3.67977,0.83892 1.33214,0.42455 2.72769,1.02195 4.06509,1.88248 3.45695,2.22133 7.43337,4.13343 11.00473,5.60928 1.65088,0.68222 3.13102,1.23615 4.29299,1.64243 0.57212,0.20003 1.06216,0.36254 1.45078,0.48498 1e-5,0 0.0129,0.004 0.013,0.004 0.18525,0.0583 0.35009,0.10835 0.49033,0.14913 0.13828,0.0402 0.25358,0.0717 0.33992,0.0927 0.0461,0.0112 0.0905,0.0196 0.13264,0.0246 0.0414,0.005 0.0831,0.007 0.12391,0.004 0.04,-0.003 0.0834,-0.0112 0.12587,-0.0292 0.043,-0.0183 0.085,-0.0468 0.11879,-0.0885 0.0335,-0.0414 0.0527,-0.0881 0.0615,-0.13415 0.008,-0.0443 0.007,-0.087 0.002,-0.12486 -0.005,-0.0376 -0.0155,-0.0743 -0.0278,-0.10904 -0.0123,-0.0346 -0.0276,-0.0696 -0.045,-0.10438 -0.0343,-0.0685 -0.0791,-0.14151 -0.13158,-0.21741 -0.0519,-0.0752 -0.11282,-0.15528 -0.18091,-0.23904 -0.13385,-0.16464 -0.29783,-0.34613 -0.48061,-0.53482 -0.3576,-0.36915 -0.78928,-0.76774 -1.19604,-1.10892 -0.2012,-0.16876 -0.39645,-0.32361 -0.573,-0.4533 -0.0883,-0.0649 -0.17243,-0.12381 -0.2507,-0.17526 -0.0782,-0.0514 -0.15201,-0.0963 -0.21938,-0.13241 -0.25126,-0.13482 -0.5503,-0.27293 -0.91054,-0.42303 -0.37483,-0.15617 -0.81671,-0.32562 -1.32835,-0.51316 -1.12239,-0.41138 -2.80456,-0.98869 -4.43518,-1.54686 -0.27349,-0.0939 -0.54017,-0.20503 -0.79861,-0.32832 -0.39804,-0.18989 -0.78821,-0.41443 -1.16814,-0.66285 -0.67038,-0.43834 -1.31595,-0.95574 -1.92295,-1.49816 -1.32938,-1.18794 -2.60536,-2.61991 -3.60009,-3.75808 -0.59731,-0.68344 -1.1406,-1.3158 -1.63444,-1.87398 -0.56863,-0.64271 -1.0537,-1.16822 -1.50271,-1.61091 -0.0585,-0.0576 -0.11593,-0.11349 -0.17247,-0.1676 -0.43855,-0.41974 -0.83261,-0.74178 -1.18842,-0.97403 -0.23427,-0.15291 -0.43796,-0.25774 -0.61567,-0.32878 -0.25215,-0.1008 -0.43601,-0.12688 -0.55378,-0.13555 0.11642,0.0258 0.28797,0.0827 0.51593,0.21388 0.16051,0.0924 0.34245,0.21769 0.55302,0.38854 0.32153,0.26086 0.67647,0.60048 1.0906,1.03411 0.0532,0.0557 0.10742,0.11308 0.16273,0.17218 0.42792,0.4573 0.88893,0.98364 1.44701,1.6374 0.48209,0.56475 1.0175,1.20329 1.61052,1.89394 0.98636,1.14875 2.26702,2.59991 3.61442,3.81354 0.61517,0.5541 1.27535,1.08798 1.96602,1.54397 0.39168,0.25859 0.79717,0.49479 1.21394,0.69636 0.27067,0.13092 0.55199,0.24995 0.84241,0.35112 1.61503,0.56435 3.31908,1.15477 4.4221,1.5594 0.50886,0.18666 0.94447,0.35309 1.31168,0.50472 0.35346,0.14595 0.63899,0.2763 0.87461,0.40032 0.0526,0.0277 0.11506,0.0647 0.18633,0.11092 0.0709,0.0459 0.149,0.0999 0.23294,0.16078 0.16799,0.12188 0.35657,0.26965 0.55334,0.43291 0.39882,0.33089 0.82109,0.71688 1.16982,1.07246 0.17823,0.18174 0.33473,0.35294 0.46002,0.5046 0.0637,0.0771 0.11833,0.14796 0.16343,0.21189 0.046,0.0652 0.0803,0.12074 0.10389,0.16637 0.0118,0.0229 0.0203,0.042 0.026,0.0573 0.006,0.0159 0.008,0.0253 0.009,0.0299 8e-4,0.004 -3.5e-4,5.1e-4 0.002,-0.0107 0.002,-0.0122 0.009,-0.0297 0.0228,-0.0468 0.0141,-0.0172 0.0295,-0.0261 0.0389,-0.03 0.008,-0.003 0.0109,-0.002 0.002,-0.001 -0.008,8.7e-4 -0.0229,0.001 -0.0454,-0.001 -0.0226,-0.002 -0.0507,-0.007 -0.0849,-0.0151 -0.0778,-0.0181 -0.18663,-0.047 -0.3224,-0.0857 -0.13687,-0.0391 -0.29898,-0.0876 -0.48227,-0.14453 10e-6,1e-5 -0.0128,-0.004 -0.0128,-0.004 -0.38456,-0.11969 -0.87129,-0.27898 -1.441,-0.4756 -1.15703,-0.39931 -2.63284,-0.9444 -4.2799,-1.61689 -3.56348,-1.45496 -7.53011,-3.3423 -10.97061,-5.53838 -1.36968,-0.8732 -2.79369,-1.47702 -4.14584,-1.90734 -1.30546,-0.41545 -2.58335,-0.68127 -3.72585,-0.86109 -0.21083,-0.0332 -0.41475,-0.0631 -0.61015,-0.0902 -1.58299,-0.21932 -3.11234,-0.31874 -4.17475,-0.36788 -1.22567,-0.0567 -2.0995,-0.0651 -3.65892,-0.0843 -0.48981,-0.006 -1.09896,-0.0506 -1.86182,-0.14807 -0.66387,-0.0848 -1.42512,-0.20726 -2.29996,-0.37173 -1.56112,-0.2935 -3.35141,-0.69531 -5.42852,-1.1964 -1.83471,-0.44261 -3.81568,-0.94521 -5.754,-1.42514 -1.8171,-0.4499 -3.61733,-0.88393 -5.15715,-1.20112 -1.50051,-0.30907 -2.54116,-0.54471 -3.23861,-0.72545 -0.34604,-0.0897 -0.60303,-0.16466 -0.78944,-0.22761 -0.0933,-0.0315 -0.16711,-0.0594 -0.2247,-0.084 -0.0588,-0.0251 -0.0958,-0.0447 -0.11892,-0.059 -0.0108,-0.007 -0.0169,-0.0114 -0.0182,-0.0119 -0.001,-4.3e-4 0.003,0.004 0.008,0.0161 0.006,0.0131 0.0113,0.0336 0.009,0.0588 -0.002,0.0254 -0.012,0.045 -0.0211,0.0573 -0.009,0.0118 -0.0151,0.0155 -0.0165,0.0158 -0.002,3.5e-4 0.002,-0.003 0.008,-0.007 0.0145,-0.008 0.0395,-0.0189 0.0744,-0.0299 0.0348,-0.011 0.076,-0.0216 0.12205,-0.0319 0.0465,-0.0104 0.0967,-0.0203 0.14864,-0.03 0.10637,-0.0198 0.21824,-0.0382 0.31957,-0.0579 0.0455,-0.009 0.11096,-0.0185 0.19379,-0.0282 0.0845,-0.01 0.18526,-0.0198 0.29898,-0.0296 0.23768,-0.0205 0.53037,-0.0401 0.84924,-0.058 0.26302,-0.0147 0.54354,-0.0282 0.8294,-0.0401 0.48292,-0.0201 0.99648,-0.0365 1.50803,-0.0482 0.8876,-0.0204 1.76114,-0.027 2.51218,-0.0167 0.39416,0.005 0.75399,0.0154 1.06742,0.0304 0.32193,0.0154 0.59306,0.0358 0.80151,0.0615 0.88133,0.10762 1.97481,0.19451 3.08425,0.23883 0.27493,0.011 0.55358,0.0195 0.833,0.025 0.79602,0.0158 1.63063,0.0207 2.39245,-0.005 0.48963,-0.0166 1.06453,-0.0481 1.63538,-0.0863 0.615,-0.0412 1.21634,-0.0894 1.71342,-0.13633 0.71542,-0.0675 1.1857,-0.12898 1.44446,-0.18991 0.40142,-0.0945 0.43318,-0.23621 0.42926,-0.27694 z"
         id="path24716"
         sodipodi:nodetypes="csssssssssc"
         inkscape:path-effect="#path-effect24718"
         inkscape:original-d="m 501.08494,113.62662 c 0,0 -3.31862,0.31915 -5.23577,0.41026 -1.91712,0.091 -4.53649,-0.002 -6.27671,-0.17631 -1.74026,-0.17458 -7.30442,0.0323 -8.10708,0.17705 -0.80267,0.14474 -2.32554,0.20181 3.72139,1.47036 6.04695,1.26855 16.16536,4.34818 20.54261,4.38316 4.37727,0.035 11.04958,-0.11513 16.22929,3.20218 7.19305,4.60674 16.25729,7.61554 17.55034,7.92382 1.29305,0.30828 -1.72933,-2.52134 -2.69072,-3.03244 -0.96139,-0.51109 -2.72511,-1.11929 -6.64123,-2.47374 -5.43563,-1.87998 -10.37083,-11.14266 -13.08694,-11.54165" /><path
         style="fill:#000000;fill-opacity:1;fill-rule:nonzero;stroke:none;stroke-width:0.492624;stroke-linejoin:round;stroke-opacity:1;paint-order:fill markers stroke"
         d="m 520.42711,106.02501 v 0 c 0.0159,0.002 0.0708,-0.29882 0.38794,-1.40757 0.13908,-0.48618 0.39141,-1.30174 0.78129,-2.24786 0.39267,-0.95289 0.95167,-2.10504 1.73024,-3.246478 0.75193,-1.102378 1.67619,-2.147521 2.81028,-3.013015 1.29752,-0.994811 2.43516,-1.519273 3.39296,-1.781798 0.13232,-0.03627 0.26237,-0.06784 0.39011,-0.09504 0.57953,-0.123394 1.11932,-0.158449 1.61877,-0.12976 0.51714,0.02971 1.00252,0.12842 1.45533,0.278202 0.91601,0.303 1.73506,0.827297 2.43646,1.477327 0.54908,0.508863 1.03394,1.102466 1.43336,1.735811 0.0914,0.144865 0.17783,0.290554 0.25923,0.436276 a 0.23691256,0.22897338 60.518274 0 0 0.31759,0.09404 c 0.1491,-0.08537 0.28898,-0.204727 0.42045,-0.348434 0.13091,-0.143085 0.25695,-0.314114 0.37832,-0.508168 0.24003,-0.383762 0.46864,-0.868627 0.6832,-1.429687 0.212,-0.554372 0.41204,-1.187859 0.59598,-1.878245 0.18142,-0.680931 0.34752,-1.418538 0.49355,-2.189985 0.28547,-1.508088 0.49576,-3.154477 0.58819,-4.739324 0.0288,-0.49351 0.0461,-0.981432 0.0506,-1.456861 0.003,-0.270826 9.5e-4,-0.538542 -0.005,-0.801639 -0.0165,-0.706719 -0.0659,-1.381275 -0.15584,-1.992251 a 0.05660837,0.00881424 68.76885 0 0 -0.003,-0.01469 c -0.007,-0.02565 -0.008,-0.04123 -0.008,-0.04659 4.3e-4,-0.0035 7.2e-4,5.98e-4 -1.9e-4,0.005 -0.001,0.0056 -0.005,0.01591 -0.0134,0.02699 -0.004,0.0055 -0.01,0.01063 -0.0158,0.01507 -0.006,0.0044 -0.0123,0.0077 -0.0182,0.01008 -0.0117,0.0047 -0.0207,0.0052 -0.025,0.0054 -0.004,1.72e-4 -0.005,1.4e-5 -0.002,0.0013 0.003,0.0014 0.007,0.0032 0.0148,0.0072 0.0147,0.0078 0.0344,0.02006 0.0602,0.03876 0.0253,0.01837 0.0545,0.04158 0.0876,0.07 0.066,0.05666 0.14466,0.131638 0.23463,0.224672 0.17879,0.184894 0.39792,0.436813 0.64185,0.745919 0.24305,0.307989 0.50931,0.670972 0.78281,1.077647 0.55273,0.821867 1.12482,1.806881 1.59675,2.866699 0.30491,0.684723 0.56375,1.391033 0.751,2.099434 0.10867,0.411131 0.19411,0.827789 0.24922,1.244953 0.1115,0.853885 0.0979,1.543919 0.006,2.12119 -0.0925,0.579906 -0.26397,1.044264 -0.46362,1.444394 -0.20782,0.416511 -0.45727,0.783151 -0.68274,1.121644 -0.15216,0.228434 -0.29189,0.44135 -0.41975,0.665868 -0.09,0.15802 -0.16795,0.311473 -0.23527,0.466327 a 0.25091139,0.25034856 81.726143 0 0 0.39086,0.292305 c 0.33273,-0.280794 0.73807,-0.563976 1.18068,-0.838478 0.46128,-0.286078 0.98739,-0.577868 1.56545,-0.869099 0.97117,-0.489283 2.22887,-1.046748 3.74186,-1.601244 0.0523,-0.01916 0.1051,-0.0384 0.15844,-0.05771 1.22433,-0.443203 2.71739,-0.919622 4.29763,-1.304467 1.3601,-0.331236 2.72896,-0.580219 3.9392,-0.671179 0.8451,-0.06369 1.63436,-0.01559 2.37407,0.127094 0.74804,0.144294 1.43991,0.384267 2.08249,0.697391 1.38137,0.673126 2.52021,1.678149 3.46038,2.739911 1.11247,1.256354 1.99863,2.658942 2.57932,3.636346 0.0561,0.09446 0.11012,0.186246 0.16175,0.2747 0.78876,1.351339 1.53685,2.791299 2.23862,4.187129 0.004,0.009 0.0463,0.0922 0.0507,0.10092 0.11737,0.23132 0.27048,0.4527 0.46485,0.65989 0.17642,0.18806 0.38437,0.36179 0.62583,0.51974 0.43778,0.28636 0.97503,0.51379 1.60959,0.68277 1.13197,0.30144 2.49977,0.39691 3.94263,0.35737 1.31921,-0.0362 2.59316,-0.18233 3.57318,-0.32757 0.66476,-0.0985 1.16437,-0.19218 1.40417,-0.23851 0.0432,-0.008 0.0783,-0.0152 0.10438,-0.0202 0.028,0.10571 0.0959,0.38674 0.11776,0.80373 0.0264,0.50406 -0.0196,1.21642 -0.34193,1.98539 -0.15707,0.37479 -0.38063,0.76519 -0.69604,1.15321 -0.31216,0.38402 -0.71522,0.76685 -1.235,1.1306 -1.03333,0.72316 -2.52602,1.36948 -4.67563,1.80007 -0.0295,0.001 -0.0595,0.005 -0.0891,0.0117 -0.0349,0.008 -0.0705,0.0211 -0.10465,0.0414 -0.0347,0.0206 -0.0662,0.0479 -0.092,0.0822 -0.0257,0.0343 -0.043,0.0718 -0.0534,0.1099 -0.0103,0.0376 -0.0136,0.0748 -0.0129,0.10944 6.6e-4,0.0347 0.005,0.0686 0.0124,0.1008 0.0139,0.0639 0.0385,0.12914 0.0689,0.19351 0.0308,0.0652 0.0697,0.1341 0.11502,0.20572 0.0455,0.072 0.0985,0.14833 0.15789,0.22821 0.11931,0.16051 0.26673,0.33842 0.43666,0.52933 0.34463,0.38718 0.78657,0.83312 1.28664,1.30495 0.51283,0.48387 1.08735,0.99554 1.68677,1.50437 1.212,1.02883 2.571,2.08478 3.8171,2.93809 0.62188,0.42586 1.21614,0.80157 1.75024,1.09818 0.26751,0.14856 0.52077,0.27774 0.75559,0.38364 0.23492,0.10594 0.45358,0.18957 0.65115,0.2458 1.53013,0.43428 2.77228,0.47632 3.76831,0.44028 0.50759,-0.0184 1.00191,-0.0604 1.39637,-0.0843 0.26276,-0.0159 0.50155,-0.0256 0.72588,-0.0221 0.0472,7.5e-4 0.0934,0.002 0.13884,0.004 -1.47546,1.2362 -3.26224,2.56374 -4.99544,3.68458 -0.93386,0.60393 -1.88293,1.16804 -2.78517,1.63487 -0.4739,0.24519 -0.94023,0.46631 -1.38728,0.65223 -0.36899,0.15346 -0.72912,0.28509 -1.07192,0.38571 -1.00724,0.29294 -2.08681,0.462 -3.19439,0.5237 -1.09432,0.061 -2.17588,0.0148 -3.17874,-0.1016 -1.05894,-0.12292 -2.00467,-0.32099 -2.77853,-0.54274 -0.42587,-0.12203 -0.79838,-0.25074 -1.11579,-0.37912 -0.20313,-0.0822 -0.38333,-0.16401 -0.54156,-0.24415 -0.12064,-0.0611 -0.22697,-0.12043 -0.32056,-0.17739 a 0.096076,0.10777664 48.339298 0 0 -0.10129,-9e-5 c -0.11125,0.0591 -0.24067,0.14217 -0.37657,0.23643 -0.1489,0.10329 -0.31436,0.22621 -0.48661,0.35902 -0.35691,0.27522 -0.78212,0.6231 -1.25751,1.02561 -0.65341,0.55323 -1.25492,1.08236 -2.26514,1.97088 -0.30936,0.27208 -0.64333,0.56468 -0.98646,0.862 -1.06226,0.92046 -2.34563,2.00301 -3.55944,2.8919 -0.55992,0.41003 -1.11488,0.78633 -1.63831,1.09373 -0.50458,0.29634 -0.97458,0.52549 -1.38826,0.6606 -1.3007,0.4248 -2.45701,0.54245 -3.51876,0.41095 -1.03943,-0.12874 -1.98097,-0.49519 -2.87816,-1.03207 -0.54936,-0.32873 -1.07837,-0.71916 -1.59746,-1.15166 -0.32877,-0.27392 -0.65956,-0.569 -0.99964,-0.88662 -0.8691,-0.81168 -1.63235,-1.60794 -2.61111,-2.57365 -1.65656,-1.59767 -2.58905,-2.87081 -2.61098,-2.85325 a 0.10049878,0.12904932 66.252683 0 0 -0.0483,0.0895 c 0,-0.008 0.15898,0.36345 0.32555,0.86854 l -0.0452,-0.0326 c 0.0211,0.0644 0.0422,0.13096 0.0634,0.19938 0.17816,0.57706 0.3332,1.23101 0.42379,1.89922 0.0569,0.41962 0.0876,0.83897 0.0854,1.24763 -0.002,0.42285 -0.0399,0.83815 -0.12221,1.23185 -0.0811,0.38783 -0.20745,0.76313 -0.39318,1.10657 -0.17461,0.32288 -0.40819,0.62975 -0.72313,0.89508 -0.16451,0.13874 -0.33277,0.27227 -0.5046,0.40033 -0.44922,0.3348 -0.90885,0.62132 -1.37359,0.86013 -0.58776,0.30202 -1.15472,0.51265 -1.66969,0.64666 -0.24841,0.0647 -0.47994,0.11019 -0.68983,0.13948 -0.20951,0.0292 -0.39545,0.042 -0.55339,0.0419 -0.16006,-1e-4 -0.28838,-0.0134 -0.38339,-0.0348 -0.0482,-0.0109 -0.0862,-0.0234 -0.11522,-0.0366 -0.0296,-0.0134 -0.0474,-0.0262 -0.058,-0.0364 -0.006,-0.001 -0.007,-0.007 -0.004,-0.0174 0.003,-0.0105 0.01,-0.0239 0.0204,-0.0401 0.0107,-0.0162 0.0249,-0.0342 0.0422,-0.0538 0.0355,-0.0402 0.083,-0.0856 0.13858,-0.13583 0.0354,-0.032 0.0743,-0.0661 0.11514,-0.10162 0.0248,-0.0216 0.0509,-0.0439 0.0787,-0.0676 0.13169,-0.11188 0.31346,-0.26189 0.49515,-0.43929 0.17408,-0.16998 0.35897,-0.37502 0.52638,-0.62335 0.16803,-0.24926 0.3147,-0.53662 0.41752,-0.86901 0.10972,-0.35467 0.16326,-0.7407 0.15244,-1.15693 -0.0127,-0.48955 -0.11356,-0.98143 -0.27255,-1.4519 -0.29987,-0.88735 -0.7778,-1.60167 -0.93439,-1.68063 -0.0698,-0.0352 -0.10407,0.0617 -0.12461,0.0738 -0.0208,0.0123 -0.12118,-0.003 -0.12461,0.0738 -0.008,0.17899 0.38983,0.89501 0.67386,1.708 0.15177,0.4344 0.26361,0.87099 0.30861,1.30639 0.0381,0.36851 0.0258,0.71311 -0.0351,1.03795 -0.0572,0.30509 -0.15493,0.58018 -0.28036,0.8294 -0.1252,0.24877 -0.27378,0.46328 -0.42345,0.6455 -0.15792,0.19227 -0.31817,0.34971 -0.44824,0.46692 -0.0268,0.0241 -0.0527,0.0469 -0.0774,0.0683 -0.0349,0.03 -0.0824,0.0706 -0.11724,0.1006 -0.0569,0.049 -0.10964,0.0952 -0.15146,0.13664 -0.0206,0.0204 -0.0396,0.0406 -0.0558,0.0604 -0.0159,0.0194 -0.0302,0.0398 -0.0408,0.0609 -0.0106,0.021 -0.0186,0.0448 -0.0197,0.0711 -5.2e-4,0.0131 7.4e-4,0.0265 0.004,0.0399 0.003,0.0133 0.009,0.026 0.0156,0.038 0.0212,0.0376 0.0542,0.0701 0.0942,0.0981 0.0396,0.0277 0.088,0.0523 0.144,0.0739 0.11016,0.0424 0.25383,0.0744 0.42622,0.0924 0.17092,0.0179 0.37077,0.0222 0.59461,0.009 0.22435,-0.0134 0.4717,-0.0444 0.73676,-0.0965 0.54888,-0.108 1.15582,-0.30312 1.78006,-0.60443 0.4936,-0.23825 0.98017,-0.53421 1.4473,-0.88772 0.17876,-0.13528 0.35244,-0.27736 0.52098,-0.42568 0.35574,-0.31276 0.60777,-0.67315 0.78553,-1.04289 0.18847,-0.39204 0.30054,-0.80913 0.3611,-1.22461 0.0615,-0.42195 0.0721,-0.85785 0.0482,-1.29168 -0.0232,-0.41955 -0.0792,-0.8457 -0.15749,-1.26745 -0.12487,-0.67242 -0.30465,-1.32425 -0.491,-1.90275 -0.0221,-0.0686 -0.044,-0.13535 -0.0657,-0.20005 a 0.03750538,0.01208133 53.697569 0 0 -0.0452,-0.0326 c -0.0484,-0.14573 -0.0962,-0.28117 -0.13961,-0.40019 0.33437,0.51715 1.03696,1.49512 2.17477,2.68741 0.94141,0.96501 1.72183,1.80552 2.57866,2.62663 0.34103,0.32681 0.676,0.63234 1.01145,0.9166 0.52937,0.44857 1.07677,0.86013 1.65209,1.21019 0.94174,0.573 1.95023,0.97629 3.07629,1.12063 1.15064,0.14749 2.38772,0.0197 3.7524,-0.42588 0.46499,-0.15184 0.97204,-0.40247 1.49331,-0.71036 0.54345,-0.32099 1.11279,-0.71049 1.6797,-1.12988 1.2306,-0.91038 2.51475,-2.01085 3.57,-2.94853 0.34172,-0.30365 0.67098,-0.60057 0.97733,-0.8792 0.88038,-0.8007 1.69237,-1.56834 2.19865,-2.04465 0.45327,-0.42645 0.8493,-0.7975 1.18313,-1.09337 0.16105,-0.14274 0.31358,-0.27327 0.4512,-0.38324 0.10678,-0.0853 0.20601,-0.15938 0.2928,-0.21639 0.0859,0.0454 0.18004,0.0927 0.28289,0.14178 0.16454,0.0784 0.34961,0.16027 0.55651,0.24392 0.32327,0.13069 0.7,0.26583 1.1288,0.39725 0.77967,0.23896 1.73048,0.46501 2.79999,0.61918 1.01224,0.14591 2.11046,0.2242 3.22853,0.18948 1.13103,-0.0351 2.24645,-0.18483 3.29312,-0.47571 0.36366,-0.10019 0.741,-0.23448 1.12172,-0.3925 0.46159,-0.19159 0.93792,-0.42155 1.41751,-0.67684 0.91321,-0.4861 1.86154,-1.07639 2.78891,-1.70617 1.80053,-1.22275 3.65502,-2.68657 5.16,-3.98896 a 0.1137753,0.11489608 27.265782 0 0 -0.0632,-0.20089 c -0.13895,-0.0122 -0.2832,-0.0184 -0.43467,-0.0206 -0.2319,-0.003 -0.47526,0.003 -0.7404,0.0125 -0.4073,0.0144 -0.88145,0.0369 -1.38958,0.0341 -0.97951,-0.005 -2.17671,-0.10225 -3.64284,-0.56258 -0.17092,-0.0538 -0.36782,-0.13375 -0.58815,-0.23837 -0.21953,-0.10423 -0.45972,-0.23173 -0.71711,-0.37964 -0.5142,-0.29549 -1.09201,-0.66957 -1.70257,-1.09524 -1.22343,-0.85294 -2.56515,-1.90376 -3.76878,-2.92275 -0.59491,-0.50365 -1.16541,-1.00733 -1.6752,-1.48111 -0.49779,-0.46263 -0.93457,-0.89389 -1.27397,-1.26262 -0.16734,-0.1818 -0.30938,-0.34665 -0.42265,-0.49118 -0.0562,-0.0718 -0.10475,-0.13772 -0.14542,-0.19757 -0.0407,-0.0599 -0.0724,-0.11203 -0.0961,-0.15666 -0.024,-0.0454 -0.037,-0.0778 -0.0439,-0.10012 -0.003,-0.0103 -0.005,-0.0169 -0.005,-0.0186 -8.4e-4,-0.002 -0.001,0.002 -0.004,0.009 -0.003,0.008 -0.008,0.0187 -0.0166,0.0296 -0.009,0.0109 -0.0187,0.0183 -0.0269,0.0224 -0.008,0.004 -0.0118,0.004 -0.0105,0.003 0.002,-0.001 0.008,-0.003 0.0203,-0.005 a 7.2809754e-4,0.03958934 84.087512 0 0 0.032,-0.004 c 2.19513,-0.46367 3.73159,-1.15488 4.79721,-1.93624 0.53441,-0.39185 0.94759,-0.80434 1.26533,-1.21834 0.32097,-0.41822 0.54388,-0.83712 0.69628,-1.23677 0.31213,-0.81853 0.33181,-1.56484 0.28424,-2.08265 -0.0513,-0.558 -0.17524,-0.8743 -0.17932,-0.87663 a 0.06750619,3.7700721e-4 29.810167 0 0 -0.0656,-0.0371 c 4.8e-4,9e-4 -0.0556,0.0131 -0.15547,0.0324 -0.23816,0.0459 -0.7373,0.1348 -1.40053,0.22521 -0.97854,0.13338 -2.24866,0.26102 -3.55909,0.27518 -1.43654,0.0155 -2.7781,-0.10677 -3.87146,-0.42569 -0.61144,-0.17836 -1.11359,-0.40895 -1.51171,-0.68552 -0.2191,-0.1522 -0.40317,-0.31586 -0.55615,-0.48859 -0.16834,-0.19006 -0.29777,-0.38965 -0.39525,-0.59502 0.001,0.002 -0.0501,-0.10395 -0.049,-0.10183 -0.69142,-1.43537 -1.3665,-2.85349 -2.16296,-4.256281 -0.0512,-0.0901 -0.10471,-0.183529 -0.16053,-0.279757 -0.5761,-0.993201 -1.47149,-2.427217 -2.61221,-3.72103 -0.96338,-1.092673 -2.14944,-2.145213 -3.60463,-2.853831 -0.67771,-0.330012 -1.40901,-0.583309 -2.20006,-0.735271 -0.78225,-0.15027 -1.61336,-0.199617 -2.49831,-0.132135 -1.24395,0.09511 -2.63896,0.351511 -4.01372,0.687277 -1.59927,0.390601 -3.10805,0.872125 -4.34567,1.317394 -0.0539,0.01941 -0.10737,0.03874 -0.16025,0.05799 -1.52854,0.556424 -2.8078,1.115209 -3.79809,1.60664 -0.58996,0.292763 -1.1309,0.587899 -1.60868,0.880316 -0.45724,0.279852 -0.88567,0.574994 -1.24413,0.875738 l 0.39086,0.292306 c 0.0602,-0.136248 0.13029,-0.273934 0.21272,-0.41962 0.11834,-0.209168 0.24774,-0.409615 0.39814,-0.640179 0.21849,-0.334959 0.481,-0.731231 0.69859,-1.184478 0.21175,-0.441099 0.39117,-0.953709 0.48226,-1.587049 0.0903,-0.628107 0.0919,-1.361104 -0.0347,-2.246764 -0.0618,-0.436532 -0.15495,-0.869865 -0.2715,-1.294678 -0.20076,-0.731729 -0.47674,-1.455614 -0.79885,-2.15129 -0.49837,-1.076344 -1.10003,-2.069583 -1.67897,-2.892087 -0.28679,-0.407441 -0.56634,-0.770586 -0.82231,-1.078392 -0.2566,-0.308547 -0.48956,-0.561559 -0.68296,-0.748408 -0.0972,-0.09393 -0.18524,-0.171914 -0.26206,-0.232284 -0.0386,-0.03034 -0.075,-0.05668 -0.10875,-0.07857 -0.0336,-0.02178 -0.0663,-0.04021 -0.0974,-0.05372 -0.0157,-0.0068 -0.032,-0.01283 -0.0486,-0.01732 -0.0164,-0.0045 -0.0349,-0.0079 -0.0545,-0.0085 -0.02,-5.73e-4 -0.0428,0.0017 -0.0664,0.01071 -0.0119,0.0045 -0.0236,0.01061 -0.0346,0.01848 -0.0111,0.0079 -0.0208,0.0171 -0.0292,0.02733 -0.0168,0.02055 -0.0262,0.04296 -0.0312,0.06325 -0.005,0.02007 -0.006,0.03963 -0.006,0.05709 9.7e-4,0.03218 0.008,0.06611 0.0178,0.09957 0.0912,0.596833 0.14156,1.258902 0.15732,1.955849 0.006,0.260433 0.007,0.525642 0.004,0.794123 -0.006,0.471344 -0.0259,0.955352 -0.058,1.445133 -0.10322,1.573808 -0.33286,3.206129 -0.64119,4.697684 -0.15767,0.762726 -0.336,1.489373 -0.52938,2.157508 -0.19618,0.677829 -0.40738,1.293849 -0.62804,1.827398 -0.22406,0.541779 -0.45578,0.99341 -0.68865,1.338229 -0.11741,0.173865 -0.23331,0.317852 -0.34638,0.431679 -0.0426,0.04286 -0.0842,0.08093 -0.12494,0.114458 -0.0446,-0.08033 -0.0907,-0.160549 -0.13826,-0.240546 -0.40148,-0.67539 -0.89181,-1.321597 -1.45799,-1.885727 -0.72244,-0.719834 -1.59445,-1.332171 -2.60772,-1.696766 -0.50141,-0.180415 -1.04446,-0.302626 -1.62658,-0.342752 -0.56254,-0.03878 -1.16652,-0.0012 -1.80808,0.138624 -0.14114,0.03076 -0.28427,0.06651 -0.42934,0.107556 -1.05381,0.298155 -2.25875,0.89014 -3.59142,1.956217 -1.17389,0.942896 -2.10376,2.070033 -2.83581,3.234705 -0.75819,1.206286 -1.27593,2.406126 -1.62764,3.396836 -0.34995,0.98575 -0.55218,1.81379 -0.66198,2.31818 -0.24777,1.13814 -0.21678,1.45248 -0.20084,1.45461 z"
         id="path24720"
         sodipodi:nodetypes="csccscsscczcscsscssc"
         inkscape:path-effect="#path-effect24722"
         inkscape:original-d="m 520.42711,106.02501 c 0,0 0.87006,-6.517747 5.51801,-10.159627 5.59658,-4.385167 9.69238,-1.08389 11.38346,2.05501 1.9945,-1.091834 3.76905,-10.340943 3.05002,-15.123103 -0.28812,-0.990999 4.0207,3.700841 4.6547,8.332298 0.47819,3.493294 -1.0933,4.38965 -1.77631,5.948757 2.6516,-2.230953 10.28287,-5.024083 15.0269,-5.383768 6.91964,-0.524636 10.33443,6.264876 13.11755,11.921813 1.81814,3.69554 11.61386,1.64294 11.61386,1.64294 0,0 1.86078,5.34792 -6.84985,7.13693 -1.48465,0.0603 7.47333,7.80504 10.42411,8.68612 2.95079,0.88108 4.84519,0.30683 6.25666,0.44772 -2.86528,2.45648 -7.46946,5.79782 -10.47061,6.65088 -4.18543,1.18969 -9.26184,0.0992 -11.2373,-1.03334 -1.58879,0.90686 -8.46478,8.13751 -11.92526,9.26759 -5.42477,1.77154 -8.26337,-1.74583 -11.83801,-5.34061 -1.64576,-1.65503 -2.50999,-2.96995 -2.50999,-2.96995 0,0 2.34254,5.40076 -0.24771,7.63333 -2.59024,2.23256 -5.28942,2.24707 -5.54591,1.86092 -0.25646,-0.38617 3.6555,-1.63561 0.7116,-6.60374" /><path
         style="fill:#000000;fill-opacity:1;fill-rule:nonzero;stroke:none;stroke-width:0.492624;stroke-linejoin:round;stroke-opacity:1;paint-order:fill markers stroke"
         d="m 545.78963,132.76909 c -0.001,0.0138 0.0107,0.0493 0.12174,0.0854 0.18189,0.0592 0.78518,0.18242 1.45379,0.25431 0,0 0.0115,0.001 0.0115,0.001 0.44067,0.047 0.88307,0.0696 1.2316,0.0741 0.0581,7.6e-4 0.11368,0.001 0.16665,8.8e-4 0.11523,-3.4e-4 0.23096,-0.006 0.33111,-0.015 0.0757,-0.007 0.13895,-0.0151 0.19067,-0.0238 0.0734,-0.0124 0.11518,-0.0242 0.13997,-0.031 -0.0241,-0.009 -0.0639,-0.0256 -0.13426,-0.0483 -0.0495,-0.016 -0.11047,-0.0339 -0.18357,-0.0529 -0.0965,-0.0251 -0.20957,-0.0507 -0.32223,-0.0714 -0.0519,-0.01 -0.10647,-0.0192 -0.16356,-0.029 -0.34174,-0.0586 -0.77822,-0.1208 -1.22104,-0.16116 10e-6,0 -0.0115,-0.001 -0.0115,-0.001 -0.66894,-0.0604 -1.28419,-0.0622 -1.4743,-0.0412 -0.11604,0.0128 -0.13514,0.045 -0.13657,0.0588 z"
         id="path25214"
         inkscape:path-effect="#path-effect25216"
         inkscape:original-d="m 545.78963,132.76909 c 0,0 3.06353,0.31707 3.64703,0.3462"
         sodipodi:nodetypes="cc" /><path
         style="fill:#000000;fill-opacity:1;fill-rule:nonzero;stroke:none;stroke-width:0.492624;stroke-linejoin:round;stroke-opacity:1;paint-order:fill markers stroke"
         d="m 563.17592,134.01811 c -0.002,0.023 0.0251,0.10869 0.44537,0.17904 0.36826,0.0617 1.07539,0.12799 2.38096,0.25732 0.71788,0.0711 1.58884,0.15902 2.4239,0.25453 0.77715,0.0889 1.52189,0.1842 2.08649,0.27859 0.56046,0.0937 1.15183,0.2118 1.68016,0.31789 0.28044,0.0563 0.53198,0.10701 0.77202,0.15358 0.25134,0.0488 0.46962,0.089 0.65996,0.12017 0.0126,0.002 0.0251,0.004 0.0374,0.006 0.17342,0.0279 0.33382,0.0497 0.46461,0.0589 0.0671,0.005 0.12923,0.006 0.18285,0.003 0.0265,-0.002 0.0522,-0.005 0.0762,-0.009 0.0236,-0.005 0.0475,-0.0113 0.0699,-0.0215 0.0222,-0.0101 0.0455,-0.0248 0.065,-0.0466 0.01,-0.011 0.0184,-0.0236 0.0253,-0.0377 0.007,-0.0141 0.0115,-0.029 0.0141,-0.0444 0.005,-0.0306 0.002,-0.0601 -0.006,-0.0864 -0.007,-0.026 -0.019,-0.0508 -0.0328,-0.0741 -0.0273,-0.046 -0.0679,-0.0943 -0.11915,-0.14507 -0.0517,-0.0512 -0.11699,-0.10764 -0.19628,-0.16975 -0.20887,-0.16149 -0.47406,-0.34174 -0.77695,-0.53275 -0.30919,-0.195 -0.65711,-0.40083 -1.02255,-0.60808 -0.78651,-0.44605 -1.6486,-0.89567 -2.40265,-1.27013 -0.95986,-0.47666 -1.73373,-0.82732 -2.24351,-1.03465 -0.13064,-0.0531 -0.24575,-0.0977 -0.34674,-0.13451 -0.19521,-0.0712 -0.35635,-0.11947 -0.48758,-0.15122 -0.12996,-0.0314 -0.22973,-0.0465 -0.30614,-0.0525 -0.0481,-0.004 -0.0868,-0.004 -0.11787,-0.003 -0.0419,0.002 -0.0702,0.007 -0.089,0.01 0.0169,0.01 0.0389,0.0257 0.0726,0.0489 0.0248,0.017 0.0556,0.0379 0.0949,0.063 0.0625,0.0399 0.14602,0.0903 0.2607,0.15327 0.11572,0.0636 0.26227,0.13952 0.44693,0.22868 0.0956,0.0462 0.20573,0.0982 0.33225,0.1575 0.48109,0.22539 1.27257,0.58889 2.2202,1.04748 0.75542,0.36558 1.61789,0.79549 2.40994,1.21994 0.36746,0.19693 0.71666,0.39105 1.02705,0.57374 0.30453,0.17924 0.56848,0.34559 0.77486,0.49161 0.0778,0.0542 0.13901,0.1007 0.18589,0.14029 0.0479,0.0405 0.0765,0.0701 0.0937,0.0915 0.008,0.01 0.0122,0.0167 0.014,0.0184 0.002,0.002 0.001,-0.002 0.004,-0.01 0.001,-0.004 0.003,-0.008 0.005,-0.012 0.002,-0.004 0.005,-0.007 0.007,-0.009 0.004,-0.004 0.008,-0.004 0.004,-2.1e-4 -0.004,0.003 -0.0116,0.007 -0.0244,0.0111 -0.0129,0.004 -0.0293,0.008 -0.0494,0.0103 -0.0411,0.006 -0.0937,0.007 -0.15627,0.006 -0.12187,-0.004 -0.27549,-0.0213 -0.44706,-0.0482 -0.0121,-0.002 -0.0244,-0.004 -0.0368,-0.006 -0.18668,-0.0302 -0.40375,-0.0721 -0.65257,-0.12429 -0.2357,-0.0494 -0.49051,-0.10603 -0.76707,-0.16814 -0.52476,-0.11786 -1.11594,-0.25298 -1.67711,-0.36458 -0.56821,-0.11298 -1.31665,-0.22728 -2.0934,-0.33224 -0.83567,-0.11292 -1.70751,-0.21547 -2.42581,-0.29362 -1.26843,-0.13801 -2.0543,-0.20221 -2.38965,-0.2076 -0.42671,-0.007 -0.46854,0.074 -0.47054,0.097 z"
         id="path25218"
         inkscape:path-effect="#path-effect25220"
         inkscape:original-d="m 563.17592,134.01811 c 0,0 5.12933,0.44491 7.35806,0.85295 2.22871,0.40805 4.85135,1.17516 3.59538,0.24497 -1.65054,-1.22242 -6.99605,-3.74578 -7.71623,-3.88039"
         sodipodi:nodetypes="cssc" /><path
         style="fill:#000000;fill-opacity:1;fill-rule:nonzero;stroke:none;stroke-width:0.492624;stroke-linejoin:round;stroke-opacity:1;paint-order:fill markers stroke"
         d="m 582.74525,118.8778 c 2.1e-4,0.0162 0.0275,0.0784 0.6298,0.0722 0.32877,-0.003 1.42586,-0.0396 2.96812,-0.26243 0.93341,-0.13489 2.13033,-0.35388 3.38934,-0.71082 1.13503,-0.32179 2.35108,-0.7643 3.47515,-1.37551 1.67173,-0.91102 2.86515,-1.91768 3.63487,-2.98883 0.38279,-0.53267 0.65706,-1.07618 0.83442,-1.62438 0.17974,-0.55557 0.2585,-1.11149 0.2527,-1.66027 -0.006,-0.56289 -0.10078,-1.11493 -0.26373,-1.64858 -0.16967,-0.55568 -0.41286,-1.09045 -0.70574,-1.59732 -0.61398,-1.06258 -1.44329,-2.00012 -2.2953,-2.78067 -0.0512,-0.0469 -0.1027,-0.0934 -0.15464,-0.13971 -0.40228,-0.358 -0.87919,-0.69571 -1.39873,-1.01148 -0.52819,-0.32102 -1.10417,-0.62165 -1.69763,-0.90003 -1.21855,-0.57159 -2.5294,-1.05814 -3.69833,-1.44506 -2.54118,-0.841147 -4.40762,-1.234864 -4.40987,-1.229205 a 0.00649489,0.07616349 22.698611 0 0 -0.0419,0.08022 c 3e-5,-0.0026 0.13397,0.11963 0.31407,0.335951 0.12591,0.151245 0.27586,0.352955 0.42791,0.599185 0.19032,0.30821 0.37908,0.67826 0.53035,1.10037 0.15728,0.43888 0.26809,0.9173 0.30729,1.42869 0.0422,0.55036 -2.3e-4,1.11571 -0.13659,1.69515 -0.15578,0.66193 -0.42612,1.30903 -0.79122,1.94698 -0.23308,0.40726 -0.49686,0.79708 -0.77803,1.1714 -1.17813,1.56845 -2.67037,2.87913 -3.7146,3.65569 1.05275,-0.65934 2.83819,-1.78596 4.12136,-3.33431 0.31236,-0.37692 0.60112,-0.78492 0.84959,-1.21902 0.39002,-0.68142 0.66164,-1.39355 0.7929,-2.12161 0.11499,-0.63776 0.11609,-1.25312 0.0242,-1.83771 -0.0853,-0.54225 -0.24712,-1.03639 -0.44902,-1.47746 -0.19419,-0.42423 -0.42036,-0.78834 -0.63672,-1.0881 -0.17311,-0.23984 -0.33788,-0.43564 -0.47102,-0.58506 -0.077,-0.08642 -0.14536,-0.158033 -0.19949,-0.21287 0.51173,0.137545 2.12614,0.5783 4.18389,1.31504 1.15427,0.41327 2.44402,0.92387 3.63727,1.50934 0.58122,0.28517 1.14149,0.58904 1.65272,0.909 0.50339,0.31505 0.95824,0.64509 1.33778,0.9872 0.0505,0.0455 0.10063,0.0912 0.15037,0.13711 0.82831,0.76523 1.62935,1.67774 2.21748,2.69899 0.28016,0.48649 0.51045,0.99524 0.67044,1.51957 0.15356,0.50329 0.24192,1.01951 0.248,1.54248 0.006,0.50948 -0.0662,1.02507 -0.23199,1.54126 -0.1636,0.50946 -0.41832,1.01931 -0.77869,1.52392 -0.72566,1.01612 -1.86772,1.99398 -3.50443,2.89329 -1.09132,0.60103 -2.27896,1.04295 -3.39621,1.36994 -1.23732,0.36213 -2.41981,0.59233 -3.34194,0.74059 -1.39283,0.22394 -2.74246,0.33616 -2.93498,0.35535 -0.5948,0.0593 -0.61941,0.10539 -0.6192,0.12156 z"
         id="path25716"
         sodipodi:nodetypes="csscc"
         inkscape:path-effect="#path-effect25718"
         inkscape:original-d="m 582.74525,118.8778 c 0,0 6.077,-0.0789 10.37737,-2.43202 6.67467,-3.65226 5.21956,-8.60761 1.2657,-12.14819 -3.10538,-2.7808 -11.09342,-4.676507 -11.09342,-4.676507 0,0 5.91011,5.283347 -3.87193,11.968217" /></g></g></svg>
