<?xml version="1.0" encoding="UTF-8" standalone="no"?>
<!-- Created with Inkscape (http://www.inkscape.org/) -->

<svg
   width="22.343719mm"
   height="55.253075mm"
   viewBox="0 0 22.343719 55.253076"
   version="1.1"
   id="svg5"
   xml:space="preserve"
   inkscape:export-filename="beefy miracle v4.svg"
   inkscape:export-xdpi="96"
   inkscape:export-ydpi="96"
   inkscape:version="1.2.2 (b0a8486541, 2022-12-01)"
   sodipodi:docname="beefy_miracle_v4.svg"
   xmlns:inkscape="http://www.inkscape.org/namespaces/inkscape"
   xmlns:sodipodi="http://sodipodi.sourceforge.net/DTD/sodipodi-0.dtd"
   xmlns="http://www.w3.org/2000/svg"
   xmlns:svg="http://www.w3.org/2000/svg"><sodipodi:namedview
     id="namedview7"
     pagecolor="#ffffff"
     bordercolor="#999999"
     borderopacity="1"
     inkscape:showpageshadow="0"
     inkscape:pageopacity="0"
     inkscape:pagecheckerboard="0"
     inkscape:deskcolor="#d1d1d1"
     inkscape:document-units="mm"
     showgrid="false"
     showguides="true"
     inkscape:zoom="1.5587434"
     inkscape:cx="71.211208"
     inkscape:cy="221.33213"
     inkscape:window-width="1920"
     inkscape:window-height="1011"
     inkscape:window-x="0"
     inkscape:window-y="0"
     inkscape:window-maximized="1"
     inkscape:current-layer="layer1"><inkscape:grid
       type="xygrid"
       id="grid105985"
       originx="0"
       originy="0" /></sodipodi:namedview><defs
     id="defs2"><inkscape:path-effect
       effect="powerstroke"
       id="path-effect150842"
       is_visible="true"
       lpeversion="1"
       offset_points="0.2,0.15000001 | 0.2791684,0.16781025 | 0.67893227,0.15231138"
       not_jump="false"
       sort_points="true"
       interpolator_type="CentripetalCatmullRom"
       interpolator_beta="0.2"
       start_linecap_type="round"
       linejoin_type="round"
       miter_limit="4"
       scale_width="1.1"
       end_linecap_type="zerowidth" /><inkscape:path-effect
       effect="powerstroke"
       id="path-effect150838"
       is_visible="true"
       lpeversion="1"
       offset_points="0.2,0.15000001 | 0.5,0.15000001 | 0.8,0.15000001"
       not_jump="false"
       sort_points="true"
       interpolator_type="CentripetalCatmullRom"
       interpolator_beta="0.2"
       start_linecap_type="round"
       linejoin_type="round"
       miter_limit="4"
       scale_width="1.1"
       end_linecap_type="zerowidth" /><inkscape:path-effect
       effect="powerstroke"
       id="path-effect150826"
       is_visible="true"
       lpeversion="1"
       offset_points="0.31297989,0.1558065 | 0.5,0.15000001 | 0.95433708,0.082034575"
       not_jump="false"
       sort_points="true"
       interpolator_type="CentripetalCatmullRom"
       interpolator_beta="0.2"
       start_linecap_type="round"
       linejoin_type="round"
       miter_limit="4"
       scale_width="1.1"
       end_linecap_type="round" /><inkscape:path-effect
       effect="powerstroke"
       id="path-effect25244"
       is_visible="true"
       lpeversion="1"
       offset_points="0.19511623,0.13545478 | 0.51392465,0.19001747 | 0.84421122,0.13099536"
       not_jump="false"
       sort_points="true"
       interpolator_type="CentripetalCatmullRom"
       interpolator_beta="0.2"
       start_linecap_type="square"
       linejoin_type="round"
       miter_limit="4"
       scale_width="1"
       end_linecap_type="square" /><inkscape:path-effect
       effect="powerstroke"
       id="path-effect23141"
       is_visible="true"
       lpeversion="1"
       offset_points="0.064771154,0.13345224 | 0.40448769,0.20363331 | 0.91571413,0.12148776"
       not_jump="false"
       sort_points="true"
       interpolator_type="CentripetalCatmullRom"
       interpolator_beta="0.2"
       start_linecap_type="round"
       linejoin_type="round"
       miter_limit="4"
       scale_width="1"
       end_linecap_type="square" /><inkscape:path-effect
       effect="powerstroke"
       id="path-effect23125"
       is_visible="true"
       lpeversion="1"
       offset_points="0.072170325,0.16843497 | 0.51305169,0.23228274 | 0.85278285,0.21546633"
       not_jump="false"
       sort_points="true"
       interpolator_type="CentripetalCatmullRom"
       interpolator_beta="0.2"
       start_linecap_type="zerowidth"
       linejoin_type="round"
       miter_limit="4"
       scale_width="1"
       end_linecap_type="round" /><inkscape:path-effect
       effect="powerstroke"
       id="path-effect23121"
       is_visible="true"
       lpeversion="1"
       offset_points="0.093466292,0.1481211 | 0.48819102,0.28546714 | 0.99351062,0.10478037"
       not_jump="false"
       sort_points="true"
       interpolator_type="CentripetalCatmullRom"
       interpolator_beta="0.2"
       start_linecap_type="round"
       linejoin_type="round"
       miter_limit="4"
       scale_width="1"
       end_linecap_type="zerowidth" /><inkscape:path-effect
       effect="powerstroke"
       id="path-effect22812"
       is_visible="true"
       lpeversion="1"
       offset_points="0.48394275,0.32074541 | 2.1266735,0.29748142 | 3.7797485,0.20770481"
       not_jump="false"
       sort_points="true"
       interpolator_type="CentripetalCatmullRom"
       interpolator_beta="0.2"
       start_linecap_type="zerowidth"
       linejoin_type="round"
       miter_limit="4"
       scale_width="1"
       end_linecap_type="zerowidth" /><inkscape:path-effect
       effect="powerstroke"
       id="path-effect22808"
       is_visible="true"
       lpeversion="1"
       offset_points="0.21946063,0.099316071 | 0.57321755,0.12259497 | 0.82301189,0.11416381"
       not_jump="false"
       sort_points="true"
       interpolator_type="CentripetalCatmullRom"
       interpolator_beta="0.2"
       start_linecap_type="zerowidth"
       linejoin_type="round"
       miter_limit="4"
       scale_width="1"
       end_linecap_type="zerowidth" /><inkscape:path-effect
       effect="powerstroke"
       id="path-effect22802"
       is_visible="true"
       lpeversion="1"
       offset_points="0.23285724,0.13434314 | 1.044886,0.13496819 | 1.7478287,0.11295382"
       not_jump="false"
       sort_points="true"
       interpolator_type="CentripetalCatmullRom"
       interpolator_beta="0.2"
       start_linecap_type="round"
       linejoin_type="round"
       miter_limit="4"
       scale_width="1"
       end_linecap_type="zerowidth" /><inkscape:path-effect
       effect="powerstroke"
       id="path-effect22769"
       is_visible="true"
       lpeversion="1"
       offset_points="0.096306928,0.059420336 | 0.5144651,0.10704277 | 0.88617495,0.10437039"
       not_jump="false"
       sort_points="true"
       interpolator_type="CentripetalCatmullRom"
       interpolator_beta="0.2"
       start_linecap_type="zerowidth"
       linejoin_type="round"
       miter_limit="4"
       scale_width="1"
       end_linecap_type="round" /><linearGradient
       id="linearGradient38280"
       inkscape:swatch="solid"><stop
         style="stop-color:#000000;stop-opacity:1;"
         offset="0"
         id="stop38278" /></linearGradient></defs><g
     inkscape:label="Layer 1"
     inkscape:groupmode="layer"
     id="layer1"
     transform="translate(-97.934225,-44.540859)"><g
       id="g150995"><g
         id="g150889"><path
           style="fill:#000000;fill-opacity:1;fill-rule:nonzero;stroke:none;stroke-width:0.354285;stroke-linecap:round;stroke-linejoin:round;stroke-dasharray:none"
           d="m 102.53688,68.008908 c -0.0395,0.09617 -0.16054,0.286687 -0.22987,0.541254 -0.0748,0.274565 -0.13369,0.714772 -0.16472,1.104387 -0.0372,0.467649 -0.0343,0.821799 -0.0307,1.122279 -1.7e-4,-0.01444 7.7e-4,0.0648 5.9e-4,0.05036 0.003,0.310023 0.0323,0.597516 0.0629,0.882132 0.0158,0.146982 0.0306,0.278915 0.0432,0.411645 0.0276,0.28966 0.0447,0.517652 0.0581,0.694636 a 0.21546633,0.21546633 90 0 0 0.4297,-0.03266 c -0.01,-0.131186 -0.0376,-0.448617 -0.0586,-0.700283 -0.0106,-0.12756 -0.0208,-0.271071 -0.0296,-0.411189 -0.0184,-0.292769 -0.0302,-0.549934 -0.0413,-0.855254 -5.7e-4,-0.01567 -0.001,-0.0317 -0.002,-0.04808 -0.007,-0.289555 0.008,-0.622641 0.0337,-1.081943 0.0206,-0.369634 0.0482,-0.829378 0.0331,-1.100465 -0.0145,-0.261561 -0.0888,-0.474158 -0.10511,-0.576814 z"
           id="path23123"
           sodipodi:nodetypes="cc"
           inkscape:path-effect="#path-effect23125"
           inkscape:original-d="m 102.53688,68.008908 c -0.32057,2.754914 -0.18024,3.017821 -0.0455,4.790364" /><g
           id="g150822"
           transform="matrix(0.75523378,0,0,0.75523378,-215.5294,54.23863)"><path
             style="fill:#e8e8e8;fill-opacity:1;fill-rule:evenodd;stroke:#000000;stroke-width:0.397228;stroke-linecap:round;stroke-linejoin:round;stroke-dasharray:none"
             d="m 423.66296,32.601068 c 0.10451,-0.209018 0.47836,2.215505 -1.4641,2.114823 -1.85635,-0.09622 -0.69138,-3.009556 -0.0814,-3.131566 0.61005,-0.122008 1.54545,1.016743 1.54545,1.016743 z"
             id="path150816"
             sodipodi:nodetypes="csscc" /><path
             style="fill:#e8e8e8;fill-opacity:1;fill-rule:evenodd;stroke:#000000;stroke-width:0.397228;stroke-linecap:round;stroke-linejoin:round;stroke-dasharray:none"
             d="m 420.4157,26.388949 c 0,0 -1.04983,-1.019412 0.0244,-2.082384 1.12647,-1.114651 2.30158,-0.187905 1.84649,1.427575 0,0 5.42557,3.086962 1.21607,6.92228 0,0 -0.81579,0.595363 -1.14114,-0.42138 0,0 0.48805,3.578934 -0.77272,3.578934 -1.26077,0 -3.20027,-3.558247 -1.17311,-9.425025 z"
             id="path150818"
             sodipodi:nodetypes="cscccsc" /><path
             style="fill:#000000;fill-opacity:1;fill-rule:nonzero;stroke:none;stroke-width:0.3;stroke-linecap:round;stroke-linejoin:round;stroke-dasharray:none"
             d="m 422.4589,32.070963 c 0.0176,0.01172 0.0313,0.02586 0.0413,0.04015 0.008,0.01093 0.0124,0.02085 0.0153,0.02808 0.005,0.01226 0.005,0.01784 0.005,0.01771 3e-5,-1.2e-4 -4.2e-4,-0.0044 -5.8e-4,-0.01207 -1.4e-4,-0.0072 -7e-5,-0.01685 4.2e-4,-0.02938 9.4e-4,-0.02415 0.003,-0.0551 0.007,-0.09381 0.004,-0.039 0.009,-0.08263 0.0151,-0.129206 0.007,-0.05329 0.0145,-0.108854 0.0215,-0.158563 0.009,-0.06131 0.0178,-0.122492 0.0262,-0.178625 0.0173,-0.114762 0.0357,-0.236922 0.0565,-0.410244 0.0253,-0.209711 0.0604,-0.57498 0.0727,-0.902337 0.006,-0.164732 0.006,-0.303311 0.002,-0.422839 -0.004,-0.110909 -0.0111,-0.18712 -0.0156,-0.238002 -0.005,-0.06045 -0.009,-0.108032 -0.0111,-0.123466 a 0.09023803,0.09023803 90 0 0 -0.1791,0.02226 c 0.002,0.01593 0.008,0.0534 0.01,0.111855 0.001,0.04566 -5e-5,0.119919 -0.008,0.22368 -0.008,0.112856 -0.0235,0.246424 -0.0462,0.404303 -0.0471,0.327845 -0.11215,0.656557 -0.1513,0.875828 -0.0321,0.179965 -0.0488,0.282581 -0.068,0.407506 -0.008,0.05036 -0.019,0.124308 -0.0275,0.180637 -0.008,0.05048 -0.016,0.107781 -0.0234,0.163524 -0.006,0.04853 -0.0121,0.09591 -0.0165,0.139494 -0.004,0.0429 -0.007,0.08177 -0.008,0.115805 -6e-4,0.01791 -7.2e-4,0.03482 -2.5e-4,0.05067 5e-4,0.01701 0.002,0.03383 0.004,0.05008 0.003,0.01822 0.007,0.03936 0.0156,0.06092 0.005,0.01326 0.0125,0.02777 0.0226,0.04226 0.0131,0.01874 0.0298,0.03567 0.0502,0.04921 a 0.17138715,0.17138715 90 0 0 0.18978,-0.285438 z"
             id="path150820"
             sodipodi:nodetypes="cc"
             inkscape:path-effect="#path-effect150826"
             inkscape:original-d="m 422.36401,32.213682 c -0.10346,-0.06879 0.34259,-1.93122 0.24155,-2.744181"
             inkscape:linked-fill="path69979"
             class="UnoptimicedTransforms" /></g></g><g
         id="g12338"><path
           style="fill:#d09151;fill-opacity:1;fill-rule:evenodd;stroke:#000000;stroke-width:0.434226;stroke-linecap:square;stroke-linejoin:round;stroke-dasharray:none"
           d="m 110.84931,71.540116 c 0,0 -10.15158,4.812599 -8.87323,-8.121262 0,0 -3.985441,-12.633073 3.83504,-13.084254 7.82047,-0.45118 12.03149,9.174017 12.18189,11.354727 0.15039,2.180708 -0.0751,7.970866 -0.60158,8.572443 -0.52638,0.601573 -2.33111,1.729527 -2.93269,1.729527 -0.60157,0 -3.08306,-0.150394 -3.60943,-0.451181 z"
           id="path22523"
           sodipodi:nodetypes="ccsscsc" /><path
           style="fill:#aa430f;fill-opacity:1;fill-rule:evenodd;stroke:#000000;stroke-width:0.434226;stroke-linecap:square;stroke-linejoin:round;stroke-dasharray:none"
           d="m 112.80442,62.591689 c 0,0 0.30078,7.218898 -2.33112,6.993309 -2.63188,-0.225592 -3.75983,-2.707089 -3.98542,-7.294096 -0.2256,-4.58701 -0.30079,-9.775593 -0.30079,-9.775593 0,0 -0.90237,-7.218898 3.38386,-7.444487 4.28622,-0.225592 4.13583,9.625197 4.13583,9.625197 z"
           id="path22594" /><path
           style="fill:#f7c202;fill-opacity:1;fill-rule:nonzero;stroke:none;stroke-width:0.434226;stroke-linecap:round;stroke-linejoin:round;stroke-dasharray:none"
           d="m 109.93567,55.538207 c -0.007,-0.01819 -0.17578,-0.08593 -0.7424,0.138354 -0.18687,0.07397 -0.41028,0.181223 -0.63103,0.32657 -0.17951,0.118196 -0.36314,0.26554 -0.5203,0.444048 -0.0226,0.02564 -0.0449,0.05224 -0.0668,0.07979 -0.0807,0.101455 -0.15746,0.217948 -0.21976,0.34921 -0.0583,0.122853 -0.10482,0.260512 -0.12882,0.411757 -0.0228,0.143485 -0.025,0.297577 0.001,0.460079 0.025,0.155093 0.0754,0.314623 0.15509,0.477155 0.15039,0.306554 0.40368,0.620852 0.78698,0.942434 0.36238,0.304032 0.84918,0.621537 1.49658,0.951753 l -0.16399,-0.165491 c -0.005,-0.01 -0.007,-0.01933 -0.008,-0.02599 -7.2e-4,-0.0061 1.9e-4,-0.0079 1.6e-4,-0.0036 -6e-5,0.01001 -0.005,0.0385 -0.025,0.08768 -0.0198,0.04781 -0.0509,0.106527 -0.0955,0.176652 -0.0438,0.06882 -0.0977,0.144317 -0.16138,0.226462 -0.12652,0.163258 -0.28184,0.340771 -0.45425,0.531784 -0.16899,0.187214 -0.34996,0.382431 -0.52275,0.577792 -0.17139,0.193769 -0.33738,0.390777 -0.47386,0.580848 -0.0686,0.0956 -0.13153,0.191792 -0.18466,0.28717 -0.0531,0.09534 -0.0989,0.194152 -0.13026,0.294263 -0.0315,0.100471 -0.051,0.210055 -0.0435,0.32287 0.004,0.05729 0.0146,0.115102 0.034,0.172061 0.0196,0.0574 0.0472,0.111566 0.0826,0.161624 0.0355,0.05018 0.0774,0.09424 0.12389,0.13261 0.0466,0.03846 0.0975,0.07094 0.15115,0.09848 0.10726,0.05511 0.23043,0.09307 0.36394,0.119073 0.2344,0.04523 0.45337,0.09253 0.65643,0.140915 0.19587,0.04667 0.38675,0.09666 0.57028,0.149523 0.34968,0.100714 0.66275,0.208994 0.92482,0.318991 0.12552,0.05268 0.23684,0.104722 0.33311,0.155183 0.0956,0.05013 0.17372,0.0973 0.23495,0.140333 0.0622,0.04374 0.10092,0.07894 0.1226,0.103625 0.0102,0.01163 0.0149,0.01929 0.0154,0.02022 4.4e-4,9.32e-4 -0.004,-0.0054 -0.007,-0.02026 a 0.30006942,0.3003049 32.173036 0 0 0.58533,-0.133515 c -0.008,-0.03441 -0.0226,-0.06898 -0.0445,-0.10109 -0.0218,-0.03196 -0.0479,-0.05689 -0.0743,-0.07566 -0.0506,-0.03597 -0.10004,-0.04765 -0.12778,-0.05201 -0.0293,-0.0046 -0.0533,-0.004 -0.0677,-0.003 -0.0154,0.001 -0.0281,0.0031 -0.0369,0.0047 -0.0172,0.0033 -0.0309,0.0074 -0.0387,0.0099 -0.009,0.0028 -0.0161,0.0055 -0.0217,0.0077 -0.0111,0.0043 -0.0213,0.0088 -0.0294,0.01255 -0.008,0.0039 -0.0171,0.0081 -0.0256,0.01232 -0.0169,0.0084 -0.036,0.01844 -0.0564,0.02945 -0.0208,0.0112 -0.0439,0.024 -0.0691,0.03813 -0.10314,0.05793 -0.24489,0.141283 -0.40715,0.240041 -0.3667,0.223193 -0.8023,0.502911 -1.20487,0.783101 -0.23376,0.162698 -0.44601,0.318248 -0.63183,0.463642 -0.22702,0.17763 -0.40334,0.331278 -0.53628,0.463457 -0.0382,0.03794 -0.0724,0.07378 -0.10306,0.107615 -0.0368,0.0406 -0.0695,0.07979 -0.0983,0.117488 -0.0617,0.08053 -0.10559,0.153803 -0.13537,0.219444 -0.0366,0.08061 -0.0513,0.148572 -0.0522,0.203172 -5.7e-4,0.03455 0.004,0.06278 0.0121,0.0852 0.0102,0.02995 0.0246,0.04765 0.0352,0.05894 0.005,-0.01538 0.0163,-0.03082 0.0345,-0.04686 0.0135,-0.01189 0.0305,-0.02382 0.0515,-0.03761 0.0473,-0.03109 0.089,-0.05696 0.13631,-0.08806 0.0489,-0.0322 0.10826,-0.07224 0.18186,-0.123592 0.0344,-0.02398 0.0718,-0.05039 0.11227,-0.07932 0.0767,-0.05485 0.0346,-0.02475 0.11134,-0.0796 0.14385,-0.102651 0.3201,-0.226955 0.55313,-0.384264 0.18961,-0.128 0.4015,-0.267477 0.63703,-0.418174 0.40656,-0.260129 0.83563,-0.522794 1.20024,-0.736566 0.16073,-0.09424 0.29759,-0.172252 0.39362,-0.224683 0.0232,-0.01266 0.0435,-0.02358 0.0608,-0.03265 0.0173,-0.0091 0.0307,-0.01587 0.0402,-0.02048 0.005,-0.0023 0.008,-0.0037 0.009,-0.0044 0.001,-6.26e-4 0.001,-3.75e-4 -0.004,0.0016 -0.002,8.4e-4 -0.006,0.0025 -0.0124,0.0044 -0.005,0.0016 -0.0165,0.0051 -0.0319,0.008 -0.008,0.0015 -0.0198,0.0034 -0.0344,0.0044 -0.0137,9.25e-4 -0.0371,0.0016 -0.0659,-0.0029 -0.0272,-0.0043 -0.0762,-0.01582 -0.12658,-0.05157 -0.0263,-0.01866 -0.0522,-0.04347 -0.0739,-0.07529 -0.0218,-0.03198 -0.0363,-0.0664 -0.0443,-0.10064 l 0.58533,-0.133515 c -0.0126,-0.05675 -0.0348,-0.107433 -0.0605,-0.151401 -0.0254,-0.04356 -0.0558,-0.08309 -0.0881,-0.118758 -0.0633,-0.07005 -0.14231,-0.134426 -0.22914,-0.193849 -0.0877,-0.06001 -0.18923,-0.118926 -0.30184,-0.176541 -0.11399,-0.05832 -0.241,-0.116179 -0.37904,-0.17314 -0.28771,-0.118721 -0.62206,-0.233075 -0.98682,-0.340185 -0.19199,-0.05638 -0.39039,-0.110163 -0.5931,-0.161325 -0.21017,-0.05304 -0.43591,-0.106044 -0.677,-0.157766 -0.095,-0.02063 -0.15828,-0.04533 -0.19798,-0.06795 -0.0191,-0.01091 -0.0313,-0.0205 -0.0386,-0.02764 -0.007,-0.0071 -0.009,-0.01139 -0.01,-0.01347 0.002,-0.0044 0.002,-0.0062 0.002,-0.01301 0.001,-0.01357 0.005,-0.04117 0.0218,-0.0876 0.017,-0.04583 0.0446,-0.101924 0.0856,-0.169269 0.0406,-0.06655 0.0915,-0.13947 0.15254,-0.218722 0.12235,-0.158914 0.27607,-0.33166 0.4477,-0.515186 0.17075,-0.182595 0.3553,-0.371621 0.53342,-0.559193 0.17933,-0.188845 0.35431,-0.378528 0.50266,-0.560492 0.0753,-0.09242 0.14548,-0.184867 0.20677,-0.276143 0.0617,-0.0919 0.11722,-0.186685 0.16017,-0.282654 0.0432,-0.09649 0.0781,-0.203895 0.0889,-0.317621 0.006,-0.05844 0.005,-0.119866 -0.005,-0.182685 -0.0102,-0.06381 -0.0296,-0.126963 -0.0597,-0.187524 a 0.37630571,0.36855249 0.85733578 0 0 -0.16399,-0.165492 c -0.61151,-0.313654 -1.04787,-0.60205 -1.35752,-0.859875 -0.32746,-0.272655 -0.50937,-0.507886 -0.60871,-0.699121 -0.0524,-0.100807 -0.083,-0.191723 -0.0997,-0.27296 -0.0174,-0.08497 -0.0205,-0.164397 -0.0135,-0.239254 0.007,-0.07962 0.0264,-0.157509 0.0549,-0.234045 0.0306,-0.0822 0.0721,-0.162468 0.12096,-0.240304 0.0132,-0.02098 0.0269,-0.04174 0.041,-0.06224 0.0997,-0.144697 0.22387,-0.283155 0.35809,-0.413069 0.16299,-0.157767 0.3372,-0.299321 0.48473,-0.414383 0.41679,-0.325053 0.56024,-0.450454 0.54887,-0.480846 z"
           id="path22810"
           inkscape:path-effect="#path-effect22812"
           inkscape:original-d="m 109.93567,55.538207 c 0,0 -4.6246,1.729528 0.30079,4.248625 0.40622,0.812428 -3.45887,3.233834 -1.61672,3.609451 1.84237,0.375664 3.00787,0.90236 3.08306,1.240747 -0.0101,-0.04316 -3.53624,2.040203 -3.42145,2.556692"
           sodipodi:nodetypes="ccscc" /><path
           style="fill:#d09151;fill-opacity:1;fill-rule:evenodd;stroke:#000000;stroke-width:0.434226;stroke-linecap:round;stroke-linejoin:round;stroke-dasharray:none"
           d="m 111.82684,69.960983 c 0,0 -2.1055,-3.308665 0.2256,-9.700397 0,0 -2.25591,-9.850787 2.70709,-11.053939 4.96299,-1.203152 5.18858,10.602756 5.18858,10.602756 0,0 1.35354,13.309845 -5.33898,12.181893"
           id="path22665"
           sodipodi:nodetypes="ccscc" /><g
           id="g22749"
           transform="matrix(2.1480586,0,0,2.1480586,-221.28407,-72.134302)"><ellipse
             style="fill:#000000;fill-opacity:1;fill-rule:evenodd;stroke:none;stroke-width:0.120482;stroke-linecap:round;stroke-linejoin:miter;stroke-dasharray:none;stroke-opacity:1"
             id="ellipse22745"
             cx="153.02603"
             cy="57.083111"
             rx="0.17697299"
             ry="0.2703754" /><ellipse
             style="fill:#ffffff;fill-opacity:1;fill-rule:evenodd;stroke:none;stroke-width:0.0481928;stroke-linecap:round;stroke-linejoin:miter;stroke-dasharray:none;stroke-opacity:1"
             id="ellipse22747"
             cx="152.96901"
             cy="57.029037"
             rx="0.070789196"
             ry="0.10815016" /></g><g
           id="g22755"
           transform="matrix(2.1480586,0,0,2.1480586,-220.67582,-71.93769)"><ellipse
             style="fill:#000000;fill-opacity:1;fill-rule:evenodd;stroke:none;stroke-width:0.120482;stroke-linecap:round;stroke-linejoin:miter;stroke-dasharray:none;stroke-opacity:1"
             id="ellipse22751"
             cx="154.10753"
             cy="57.083111"
             rx="0.17697299"
             ry="0.2703754" /><ellipse
             style="fill:#ffffff;fill-opacity:1;fill-rule:evenodd;stroke:none;stroke-width:0.0472065;stroke-linecap:round;stroke-linejoin:miter;stroke-dasharray:none;stroke-opacity:1"
             id="ellipse22753"
             cx="154.03764"
             cy="57.039143"
             rx="0.067750268"
             ry="0.10842326" /></g><path
           style="fill:#000000;fill-opacity:1;fill-rule:nonzero;stroke:none;stroke-width:0.3;stroke-linecap:square;stroke-linejoin:round;stroke-dasharray:none"
           d="m 104.55701,49.610226 c 0.0487,-0.01582 0.1653,-0.04221 0.29249,-0.09491 0.26261,-0.108821 0.79378,-0.395919 1.1676,-0.595895 0.35233,-0.18848 0.77455,-0.434159 1.016,-0.56902 0.13361,-0.07463 0.2596,-0.144609 0.31152,-0.173531 a 0.10437039,0.10437039 90 0 0 -0.10158,-0.182356 c -0.0519,0.02892 -0.17774,0.09921 -0.31152,0.17353 -0.24176,0.134307 -0.67289,0.363989 -1.0186,0.564351 -0.3668,0.212583 -0.8905,0.513094 -1.12125,0.679102 -0.11176,0.0804 -0.19555,0.165611 -0.23466,0.198733 z"
           id="path22765"
           inkscape:path-effect="#path-effect22769"
           inkscape:original-d="m 104.55701,49.610226 2.73682,-1.524538"
           inkscape:linked-fill="path22763"
           class="UnoptimicedTransforms"
           transform="matrix(1.4474198,0,0,1.4474198,-44.324021,-17.348877)"
           sodipodi:nodetypes="cc" /><path
           style="fill:#000000;fill-opacity:1;fill-rule:nonzero;stroke:none;stroke-width:0.434226;stroke-linecap:square;stroke-linejoin:round;stroke-dasharray:none"
           d="m 109.65887,49.150537 0,0 c 7e-5,3.44e-4 0.003,0.01522 0.0144,0.07028 3.6e-4,0.0017 0.002,0.0079 0.002,0.0096 0.007,0.03523 0.0221,0.104357 0.0406,0.177903 0.008,0.03205 0.0172,0.06612 0.027,0.09948 0.01,0.03226 0.02,0.0645 0.0312,0.09413 0.011,0.02921 0.0238,0.05869 0.0388,0.08436 0.008,0.01325 0.0174,0.02783 0.0293,0.04162 0.006,0.0072 0.0138,0.01492 0.0227,0.0224 0.009,0.0076 0.0206,0.01571 0.0345,0.02256 0.0156,0.0077 0.0296,0.0111 0.0374,0.01269 0.009,0.0018 0.0168,0.0027 0.0229,0.0031 0.006,4.39e-4 0.0111,6.4e-4 0.016,7.14e-4 0.006,9.5e-5 0.0129,7e-6 0.0193,-1.85e-4 0.0214,-6.49e-4 0.0477,-0.0027 0.076,-0.0055 0.0564,-0.0056 0.13086,-0.01505 0.21711,-0.02745 0.17589,-0.02529 0.40091,-0.0627 0.60781,-0.101472 0.24775,-0.04642 0.45407,-0.09162 0.58246,-0.132021 0.2245,-0.07064 0.25275,-0.1417 0.24869,-0.16259 v 0 c -0.004,-0.0213 -0.0567,-0.07554 -0.29071,-0.05938 -0.13571,0.0094 -0.33996,0.04172 -0.5888,0.08435 -0.20847,0.03571 -0.4268,0.07492 -0.60003,0.10238 -0.0845,0.0134 -0.15394,0.02328 -0.20355,0.02843 -0.0254,0.0026 -0.0437,0.0038 -0.0546,0.0038 -0.003,0 -0.005,-9.1e-5 -0.006,-2.12e-4 0.001,-1.41e-4 0.004,4e-5 0.009,0.001 0.004,7.77e-4 0.0147,0.0031 0.028,0.0097 0.009,0.0045 0.0161,0.0094 0.0203,0.01292 0.004,0.0035 0.007,0.0063 0.008,0.0078 0.003,0.0028 0.002,0.0029 1.7e-4,-9.93e-4 -0.004,-0.0081 -0.0111,-0.02221 -0.0199,-0.04503 -0.008,-0.02179 -0.017,-0.04749 -0.0257,-0.0758 -0.009,-0.029 -0.0175,-0.05942 -0.0254,-0.08895 -0.0182,-0.06813 -0.033,-0.132486 -0.0404,-0.166357 -7e-4,-0.0032 -0.001,-0.0062 -0.002,-0.0091 -0.0111,-0.0521 -0.0134,-0.06534 -0.0133,-0.065 a 0.13434314,0.13434314 90 0 0 -0.26386,0.05069 z"
           id="path22798"
           inkscape:path-effect="#path-effect22802"
           inkscape:original-d="m 109.7908,49.125192 c 0,0 0.0939,0.488779 0.16919,0.526375 0.0753,0.0376 1.76713,-0.291385 1.76713,-0.291385" /><path
           style="fill:#000000;fill-opacity:1;fill-rule:nonzero;stroke:none;stroke-width:0.3;stroke-linecap:square;stroke-linejoin:round;stroke-dasharray:none"
           d="m 104.68558,45.47744 c -0.003,0.0028 -0.007,0.0081 -0.01,0.01792 -0.002,0.007 -0.002,0.01547 -9e-4,0.02523 0.002,0.01639 0.008,0.03533 0.0188,0.05547 0.01,0.0185 0.0235,0.03739 0.0403,0.05536 0.009,0.0093 0.018,0.01819 0.028,0.02653 0.009,0.0078 0.0197,0.01572 0.031,0.02367 0.0417,0.02933 0.0955,0.05889 0.15716,0.08833 0.0592,0.02825 0.12317,0.05521 0.18576,0.08018 0.0395,0.01576 0.0773,0.03028 0.1128,0.04383 0.0954,0.03643 0.18154,0.07272 0.25575,0.09155 0.034,0.0086 0.0654,0.01357 0.0942,0.01325 0.0208,-2.33e-4 0.042,-0.0041 0.0617,-0.01067 0.0246,-0.0081 0.046,-0.01998 0.0625,-0.03313 0.01,-0.0077 0.0173,-0.0155 0.0231,-0.02292 0.008,-0.01052 0.0118,-0.01895 0.0137,-0.02454 -0.004,-0.0046 -0.008,-0.0115 -0.0142,-0.022 -0.004,-0.0072 -0.008,-0.0157 -0.0138,-0.0247 -0.009,-0.01559 -0.0204,-0.03238 -0.0353,-0.04866 -0.0119,-0.01298 -0.0258,-0.02514 -0.0411,-0.03459 -0.0212,-0.01309 -0.0471,-0.02422 -0.0773,-0.03499 -0.0657,-0.02346 -0.15226,-0.04554 -0.24393,-0.07848 -0.0341,-0.01227 -0.0707,-0.02609 -0.10859,-0.04087 -0.0629,-0.02449 -0.11913,-0.04739 -0.17943,-0.07149 -0.0594,-0.02375 -0.11386,-0.04505 -0.15679,-0.05893 -0.0118,-0.0038 -0.0229,-0.0071 -0.0333,-0.0099 -0.011,-0.0029 -0.0221,-0.0053 -0.0328,-0.0071 -0.0207,-0.0035 -0.0399,-0.0049 -0.0566,-0.0049 -0.0185,4e-5 -0.0327,0.0018 -0.0449,0.004 -0.007,0.0013 -0.0133,0.0026 -0.0187,0.0034 -0.008,0.0011 -0.0131,9.24e-4 -0.0173,-9.55e-4 z"
           id="path22804"
           inkscape:path-effect="#path-effect22808"
           inkscape:original-d="m 104.68558,45.47744 c 0.0122,0.09243 0.95003,0.455516 1.07407,0.430071"
           inkscape:linked-fill="path22777"
           class="UnoptimicedTransforms"
           transform="matrix(1.4474198,0,0,1.4474198,-44.604674,-16.959323)"
           sodipodi:nodetypes="cc" /><path
           id="path23021"
           style="fill:#000000;stroke-width:0.0538458"
           d="m 102.27302,44.542509 -0.001,0.0022 c -0.0831,-2.57e-4 -0.48776,0.281481 -0.64605,0.456227 -0.056,0.06186 -0.12549,0.113203 -0.15531,0.113203 -0.0297,0 -0.013,-0.04468 0.0355,-0.09882 0.18882,-0.208577 0.0735,-0.161963 -0.30859,0.125448 -0.21873,0.164542 -0.45337,0.310137 -0.52061,0.323025 -0.0672,0.01288 -0.17205,0.07003 -0.23422,0.126519 -0.14585,0.132758 -0.57057,0.39621 -0.57057,0.354107 0,-0.04769 0.19161,-0.202132 0.64606,-0.51839 0.2221,-0.15466 0.37027,-0.23706 0.32967,-0.186451 -0.0413,0.05047 -0.0559,0.09107 -0.0343,0.09107 0.0701,0 0.37802,-0.284532 0.363,-0.335226 -0.009,-0.02792 0.009,-0.03545 0.0365,-0.01718 0.0531,0.03265 0.45795,-0.288012 0.41628,-0.329685 -0.013,-0.01288 -0.14373,0.05027 -0.29083,0.140921 -0.14713,0.09065 -0.30506,0.1654 -0.35189,0.1654 -0.0468,0 -0.0994,0.02255 -0.11884,0.05219 -0.0194,0.02964 -0.0595,0.05435 -0.091,0.05435 -0.0333,0 -0.026,-0.03695 0.0172,-0.09107 0.0405,-0.05005 -0.043,-0.01288 -0.1843,0.08441 -0.14112,0.09644 -0.24258,0.196118 -0.22755,0.222024 0.0151,0.02578 0.001,0.06402 -0.0333,0.0855 -0.0398,0.02427 -0.0496,0.01504 -0.0256,-0.0232 0.0617,-0.09967 0.013,-0.07647 -0.369652,0.179793 -0.357223,0.239509 -0.502993,0.300707 -0.428479,0.179792 0.02388,-0.03824 0.01505,-0.04747 -0.02446,-0.02342 -0.03503,0.02148 -0.04603,0.06509 -0.02663,0.09774 0.02316,0.03759 0.0072,0.04811 -0.04762,0.02663 -0.04646,-0.01718 -0.128531,0.0019 -0.183229,0.04447 -0.05457,0.04145 -0.07063,0.07668 -0.03546,0.07775 0.03517,8.6e-4 0.07946,-0.0232 0.09886,-0.05328 0.0194,-0.02921 0.05717,-0.04167 0.08554,-0.02449 0.02837,0.01718 -0.111885,0.151654 -0.311919,0.297506 -0.534561,0.38968 -0.3675,0.322446 0.281958,-0.113203 0.309965,-0.207932 0.5628,-0.368177 0.5628,-0.357436 0,0.05735 -0.826766,0.688989 -0.992395,0.758157 -0.223988,0.09366 -0.262504,0.162823 -0.04444,0.07991 l 0.147579,-0.05435 -0.157668,0.164327 c -0.1624,0.170771 -0.157233,0.292522 0.0072,0.159815 0.07382,-0.06036 0.0715,-0.04769 -0.01303,0.06767 -0.05775,0.07904 -0.171635,0.183444 -0.253081,0.232011 -0.08149,0.04855 -0.147579,0.125665 -0.147579,0.169911 0,0.04425 -0.06846,0.141992 -0.149924,0.217578 l -0.145436,0.136622 0.155525,-0.112132 c 0.08554,-0.06208 0.182375,-0.112985 0.215347,-0.112131 0.07671,0.0019 -0.296214,0.318879 -0.377415,0.320813 -0.06557,0.0014 -0.220369,0.161963 -0.156596,0.161963 0.02142,0 0.107254,-0.05091 0.193115,-0.112131 0.08598,-0.06123 0.158738,-0.08764 0.158738,-0.05992 0,0.0277 -0.09712,0.113637 -0.215347,0.192036 -0.118544,0.07841 -0.215347,0.154874 -0.215347,0.169911 0,0.04425 0.02649,0.03115 0.217562,-0.109975 0.161098,-0.119007 0.192246,-0.126736 0.244208,-0.05542 0.03286,0.04425 0.08033,0.0638 0.104359,0.0421 0.02359,-0.02191 0.02533,-0.01071 0.0072,0.02556 -0.02142,0.03523 -0.066,0.05392 -0.102043,0.04104 -0.03604,-0.01288 -0.150358,0.04789 -0.254195,0.135333 -0.247944,0.208792 -0.106096,0.207504 0.222019,-0.0043 0.14522,-0.09323 0.286937,-0.148645 0.323035,-0.126519 0.03908,0.02492 0.04921,0.01934 0.02765,-0.01718 -0.0398,-0.06422 0.337278,-0.400033 0.418478,-0.372968 0.133886,0.04446 0.0728,0.15595 -0.138807,0.251967 -0.128531,0.05821 -0.199773,0.105908 -0.160896,0.106545 0.03894,6.44e-4 0.113044,-0.02255 0.166483,-0.05112 0.07266,-0.03888 0.119701,-0.02707 0.186442,0.04661 0.08424,0.09301 0.07932,0.108686 -0.102043,0.267519 -0.105662,0.09301 -0.171404,0.168623 -0.145423,0.168623 0.02605,0 0.09177,-0.04833 0.145423,-0.107616 0.0935,-0.103114 0.241979,-0.146713 0.241979,-0.0711 0,0.01934 -0.0414,0.08592 -0.09321,0.146498 -0.0935,0.109555 -0.09365,0.110409 0.03995,0.01718 0.07411,-0.05134 0.170781,-0.106979 0.215347,-0.122003 0.04444,-0.01504 0.178076,-0.07841 0.296389,-0.139836 l 0.215348,-0.112131 -0.213091,0.222001 c -0.117096,0.12222 -0.191609,0.222002 -0.166482,0.222002 0.07888,0 0.517233,-0.382676 0.489533,-0.427356 -0.0151,-0.02342 0.0273,-0.0885 0.0932,-0.144352 l 0.11985,-0.100957 -0.10205,0.120932 c -0.0706,0.08356 -0.0808,0.120932 -0.0323,0.120932 0.0507,0 0.0447,0.02707 -0.0194,0.09882 -0.198264,0.218888 -0.013,0.310395 0.23422,0.116633 0.0741,-0.058 0.20836,-0.105893 0.29861,-0.106544 0.0902,-6.45e-4 0.19331,-0.03008 0.22866,-0.06551 0.0496,-0.05112 0.0656,-0.05049 0.0656,0.0065 0,0.03953 0.0496,0.0085 0.11101,-0.07003 0.13968,-0.177644 0.17851,-0.178289 0.25977,0 0.058,0.12717 0.0496,0.158957 -0.0821,0.296389 -0.19289,0.201918 -0.11637,0.198051 0.1433,-0.0085 0.12245,-0.09688 0.22043,-0.140486 0.23976,-0.107615 0.0194,0.03029 0.009,0.05542 -0.0221,0.05542 -0.0314,0 -0.0577,0.03608 -0.0577,0.08098 0,0.06101 0.0372,0.07153 0.13663,0.04661 0.11174,-0.02814 0.13316,-0.01504 0.13316,0.07991 0,0.152728 0.26808,0.156594 0.40405,0.0065 0.0536,-0.05907 0.12795,-0.106545 0.16433,-0.106545 0.0363,0 0.0955,-0.03674 0.13316,-0.08205 0.12072,-0.144568 0.12347,-0.03715 0.004,0.115345 -0.18108,0.230057 -0.0585,0.282856 0.25753,0.11106 0.3345,-0.181725 0.36372,-0.180006 0.22645,0.01288 -0.0612,0.08592 -0.11102,0.194614 -0.11102,0.241979 10e-4,0.109121 0.12795,0.106545 0.2209,-0.0043 0.0657,-0.07904 0.0595,-0.08378 -0.0543,-0.04769 -0.13939,0.04425 -0.13317,0.02277 0.0676,-0.253084 0.14972,-0.20557 0.0811,-0.236394 -0.23422,-0.105473 -0.13939,0.058 -0.2559,0.09515 -0.26976,0.09107 0,-0.03931 0.23314,-0.430965 0.31304,-0.52505 0.0476,-0.05564 0.0569,-0.0943 0.0221,-0.0943 -0.0324,0 -0.0738,0.02471 -0.0932,0.05435 -0.0194,0.02964 -0.0586,0.05327 -0.09,0.05327 -0.0314,0 0.006,-0.08249 0.0844,-0.184305 0.14011,-0.183659 0.1158,-0.289343 -0.0511,-0.225331 -0.063,0.02406 -0.0602,0.0012 0.013,-0.116633 l 0.091,-0.146498 -0.15874,0.144351 c -0.15467,0.141124 -0.39703,0.260775 -0.52505,0.258627 -0.035,-6.46e-4 -0.013,-0.04318 0.0488,-0.0943 0.1611,-0.133611 0.41096,-0.591016 0.34522,-0.631615 -0.0297,-0.01934 -0.0747,-0.01934 -0.10088,-0.0043 -0.0835,0.05177 -0.0256,-0.288914 0.0666,-0.390732 0.12824,-0.140907 0.10884,-0.187311 -0.0599,-0.145423 l -0.14756,0.03781 0.1843,-0.192036 c 0.25586,-0.265285 0.16734,-0.305412 -0.13215,-0.05994 -0.32496,0.266295 -0.35533,0.218737 -0.0511,-0.07991 0.26419,-0.259185 0.30272,-0.348888 0.1265,-0.293039 -0.0769,0.02427 -0.10248,0.01718 -0.0777,-0.02449 0.0547,-0.08915 -0.10696,-0.07218 -0.18194,0.01718 -0.0355,0.0421 -0.10088,0.0638 -0.14542,0.04661 -0.0612,-0.02362 -0.0194,-0.09473 0.17528,-0.291941 0.14113,-0.14328 0.24591,-0.27246 0.23087,-0.287497 -0.0151,-0.01504 -0.14417,0.07024 -0.28749,0.188815 -0.14329,0.118355 -0.27255,0.202562 -0.28973,0.185376 -0.0172,-0.01718 0.12332,-0.183658 0.31082,-0.372988 0.26735,-0.269838 0.33233,-0.365556 0.2986,-0.442886 -0.0227,-0.05435 -0.0386,-0.122654 -0.0323,-0.149935 0.006,-0.02663 -0.0232,-0.01934 -0.0656,0.01504 -0.0423,0.03523 -0.11145,0.05047 -0.15424,0.03329 -0.0427,-0.01718 -0.16991,0.04318 -0.28307,0.133177 -0.11305,0.09 -0.22147,0.163253 -0.23865,0.161964 -0.0423,-0.002 0.26651,-0.276197 0.40184,-0.356319 0.0567,-0.03372 0.087,-0.07797 0.0656,-0.09989 v -0.0011 c -0.001,-0.0022 -0.006,-0.0043 -0.013,-0.0043 z m -1.11671,0.08871 c -0.0151,0 -0.0847,0.06337 -0.15424,0.137693 -0.0693,0.07411 -0.11391,0.132106 -0.0989,0.132106 0.0151,0 0.0835,-0.058 0.15315,-0.132106 0.0693,-0.07411 0.11493,-0.137693 0.0999,-0.137693 z m -0.464,0.437365 c 10e-4,-1.93e-4 0.004,-1.51e-4 0.006,0 0.004,3.23e-4 0.007,0.0016 0.009,0.0043 0.0172,0.01718 -0.0376,0.07239 -0.11985,0.124377 l -0.14993,0.0943 0.11984,-0.124376 c 0.054,-0.05628 0.10812,-0.09602 0.13534,-0.09882 z m 1.30651,0.944631 -0.15874,0.170985 c -0.17035,0.184089 -0.19204,0.196762 -0.19204,0.119861 0,-0.0277 0.0793,-0.103534 0.17528,-0.169911 z m 0.3097,0.66491 c 0.001,-1.51e-4 0.004,8.16e-4 0.006,0.0022 0.013,0.01288 -0.0413,0.07046 -0.11984,0.126519 l -0.1433,0.102029 0.11985,-0.126519 c 0.0577,-0.06079 0.11478,-0.103317 0.13664,-0.104403 z m -0.49841,0.861393 c 0.001,-2.16e-4 0.004,2.1e-5 0.006,0 h 0.001 c 0.0292,6.66e-4 0.0395,0.02406 0.0214,0.05326 -0.0194,0.02964 -0.0569,0.05435 -0.0866,0.05435 -0.0301,0 -0.0414,-0.02471 -0.0221,-0.05435 0.0172,-0.0275 0.0527,-0.05027 0.0811,-0.05326 z m -1.17664,0.268635 c 10e-4,-2.79e-4 0.004,0 0.006,0 0.0303,0 0.0243,0.03587 -0.013,0.08098 -0.0369,0.04447 -0.0913,0.08098 -0.121,0.08098 -0.0302,0 -0.0243,-0.03587 0.013,-0.08098 0.0346,-0.04167 0.0848,-0.0769 0.11536,-0.08098 z m -1.534064,0.128676 v 0.0011 c -0.0087,-0.0011 -0.01505,2.79e-4 -0.02345,0.0022 v -0.0011 c -0.01505,0.0043 -0.02808,0.01504 -0.03778,0.03115 -0.0194,0.03008 0.0043,0.05328 0.05008,0.05328 0.09452,0 0.108122,-0.03158 0.03329,-0.07776 -0.0072,-0.0043 -0.01505,-0.0065 -0.02215,-0.0085 z m 3.025974,0.03995 c 0.004,-7.51e-4 0.006,-4.08e-4 0.006,0.0011 0.004,0.0065 -0.013,0.03115 -0.0501,0.07884 -0.043,0.05671 -0.11478,0.134031 -0.15874,0.170985 -0.044,0.03695 -0.10349,0.06767 -0.13215,0.06767 -0.0693,0 0.12463,-0.21051 0.26084,-0.28307 0.0376,-0.01934 0.0618,-0.03222 0.0732,-0.03438 z m 0.20428,0.07669 h 10e-4 c 0.004,-3.43e-4 0.006,2.14e-4 0.009,0.0011 0.004,0.0022 0.009,0.0065 0.009,0.01718 0,0.03416 -0.0275,0.06208 -0.0621,0.06208 -0.0356,0 -0.0494,0.01504 -0.0323,0.03222 0.0172,0.01718 -0.009,0.07754 -0.0564,0.134249 -0.11,0.129529 -0.19311,0.13296 -0.12549,0.0085 0.0598,-0.11148 0.20751,-0.249154 0.25866,-0.254201 z m -0.98461,0.03329 c -0.0302,0.0043 -0.12289,0.06401 -0.22424,0.144352 -0.11579,0.0915 -0.22362,0.153801 -0.23866,0.138764 -0.0151,-0.01504 -0.0427,0.01071 -0.0599,0.05542 -0.0194,0.04575 -0.0151,0.08334 0.001,0.08334 0.0559,0 0.5553,-0.396016 0.5306,-0.420719 -10e-4,-0.0016 -0.004,-0.0017 -0.009,-0.0011 z" /></g><path
         style="fill:#000000;fill-opacity:1;fill-rule:nonzero;stroke:none;stroke-width:0.289484;stroke-linecap:round;stroke-linejoin:round;stroke-dasharray:none"
         d="m 113.7146,72.130076 c -0.0349,0.225531 -0.10363,0.700021 -0.1827,1.306518 -0.22359,1.715301 -0.45502,3.897191 -0.42874,6.529428 0.005,0.537298 0.0222,1.124375 0.0531,1.756936 0.14356,2.943335 0.54182,5.771756 0.75204,7.375021 0.0677,0.516527 0.12223,0.949439 0.18996,1.465965 l 0.0159,0.120444 0.24089,-0.0318 -0.0159,-0.120443 c -0.0287,-0.217504 -0.10824,-0.795306 -0.18978,-1.464658 -0.19457,-1.597138 -0.49293,-4.444303 -0.59737,-7.361276 -0.0226,-0.631941 -0.0349,-1.208333 -0.0416,-1.744763 -0.0328,-2.630047 0.0788,-4.761337 0.28634,-6.491715 0.0722,-0.602063 0.14725,-1.07644 0.18164,-1.298888 a 0.13345224,0.13345224 90 0 0 -0.26378,-0.04077 z"
         id="path23139"
         sodipodi:nodetypes="cc"
         inkscape:path-effect="#path-effect23141"
         inkscape:original-d="m 113.84649,72.150463 c -1.0453,6.762186 -0.39176,12.609616 0.3722,18.397584" /><path
         style="fill:#e8e8e8;fill-opacity:1;fill-rule:evenodd;stroke:#000000;stroke-width:0.3;stroke-linecap:round;stroke-linejoin:round;stroke-dasharray:none"
         d="m 113.31478,92.250094 c 0,0 -3.34985,3.083988 3.19033,7.337763 0,0 3.72205,1.169793 -1.32931,-7.178249 0.37751,0 0.49032,-2.286403 -1.01027,-1.967369 -1.186,0.252151 -1.48882,1.063443 -0.85075,1.807855 z"
         id="path25240"
         sodipodi:nodetypes="cccsc" /><g
         id="g25318"
         transform="matrix(1.4474198,0,0,1.4474198,-67.214658,-14.092079)"><path
           style="fill:#000000;fill-opacity:1;fill-rule:nonzero;stroke:none;stroke-width:0.211264;stroke-linecap:round;stroke-linejoin:round;stroke-dasharray:none"
           d="m 120.4693,60.051094 c -0.0141,-0.0024 -0.0261,-0.0068 -0.0357,-0.01165 -0.009,-0.0043 -0.0153,-0.0089 -0.0203,-0.01292 -0.009,-0.0069 -0.0138,-0.01304 -0.016,-0.01586 -0.002,-0.003 -0.003,-0.0039 -0.002,-0.0038 2.6e-4,2.66e-4 0.001,0.0018 0.003,0.0044 0.003,0.005 0.007,0.01329 0.0126,0.02575 0.005,0.01128 0.0109,0.02543 0.0177,0.04295 0.0125,0.03223 0.0275,0.07427 0.0452,0.127937 0.0165,0.05014 0.035,0.109102 0.0553,0.177187 0.0454,0.152214 0.0975,0.341512 0.15194,0.552684 0.0418,0.162165 0.0875,0.349339 0.13718,0.560728 0.21267,0.904927 0.46655,2.113504 0.73718,3.413325 0.0389,0.186836 0.005,0.02189 0.0435,0.208727 0.11257,0.540572 0.22638,1.085807 0.33576,1.636125 0.12217,0.614616 0.22523,1.168075 0.30168,1.644126 0.0415,0.258578 0.0735,0.483862 0.0964,0.67824 0.0129,0.108975 0.0227,0.206894 0.0299,0.294722 0.007,0.08872 0.0122,0.172103 0.0149,0.249083 0.003,0.07883 0.003,0.149037 0.001,0.210729 -0.002,0.06542 -0.007,0.118904 -0.0127,0.162183 -0.007,0.04956 -0.0156,0.0824 -0.0233,0.103542 -0.005,0.0125 -0.009,0.02019 -0.0111,0.02443 -0.003,0.0055 -0.004,0.0053 -0.003,0.0039 l -0.0925,0.09277 0.18555,0.184963 0.0925,-0.09277 c 0.0157,-0.01569 0.0311,-0.03576 0.0453,-0.06158 0.0107,-0.01953 0.0203,-0.0417 0.0288,-0.067 0.014,-0.04173 0.025,-0.0922 0.033,-0.153746 0.007,-0.05409 0.0117,-0.116598 0.014,-0.188597 0.002,-0.06808 0.002,-0.143591 -4e-5,-0.226643 -0.002,-0.08121 -0.006,-0.168034 -0.0117,-0.259809 -0.006,-0.09093 -0.0128,-0.191519 -0.0222,-0.303326 -0.0168,-0.199613 -0.0402,-0.428828 -0.0721,-0.692313 -0.0584,-0.483439 -0.14119,-1.04664 -0.24703,-1.667133 -0.0936,-0.548698 -0.20049,-1.113972 -0.31168,-1.649268 -0.0145,-0.06958 -0.0292,-0.139445 -0.044,-0.209516 -0.27309,-1.284331 -0.59148,-2.523517 -0.83044,-3.405528 -0.0573,-0.21158 -0.1084,-0.396674 -0.15368,-0.56029 -0.0591,-0.213626 -0.11221,-0.401252 -0.15939,-0.558745 -0.0209,-0.06969 -0.0398,-0.130752 -0.0569,-0.183608 -0.0182,-0.05636 -0.0341,-0.102656 -0.0479,-0.140138 -0.008,-0.02043 -0.0146,-0.03842 -0.0212,-0.05416 -0.007,-0.01717 -0.0141,-0.03235 -0.0209,-0.0456 -0.004,-0.0073 -0.008,-0.01447 -0.0119,-0.02131 -0.004,-0.0074 -0.01,-0.01512 -0.0157,-0.02274 -0.007,-0.0083 -0.0157,-0.01844 -0.0277,-0.02797 -0.007,-0.0055 -0.0155,-0.01125 -0.0256,-0.01636 -0.0114,-0.0057 -0.0251,-0.01071 -0.0406,-0.01333 l -0.13357,-0.02251 -0.045,0.26714 z"
           id="path25242"
           inkscape:path-effect="#path-effect25244"
           inkscape:original-d="m 120.49181,59.917524 c 0.20218,0.03408 2.48438,9.745802 1.92928,10.302652"
           sodipodi:nodetypes="cc" /><path
           style="fill:#e8e8e8;fill-opacity:1;fill-rule:evenodd;stroke:#000000;stroke-width:0.207265;stroke-linecap:round;stroke-linejoin:round;stroke-dasharray:none"
           d="m 122.99733,71.504257 c 0,0 2.75519,2.277623 -3.15929,3.45317 0,0 -1.882,0.740956 -2.20415,0.293888 -0.491,-0.681399 1.19885,-2.738615 4.07768,-3.710323 0,0 -0.74557,-1.260678 0.36736,-1.359227 1.19869,-0.106143 1.17569,0.330215 0.9184,1.322492 z"
           id="path25246"
           sodipodi:nodetypes="ccscsc" /></g><g
         id="g150878"><path
           style="fill:#000000;fill-opacity:1;fill-rule:nonzero;stroke:none;stroke-width:0.289484;stroke-linecap:round;stroke-linejoin:round;stroke-dasharray:none"
           d="m 114.70865,58.45006 c 0.0351,0.234651 0.10791,0.693667 0.16062,1.293438 0.15075,1.715059 0.0513,3.010749 0.083,5.454635 1.1e-4,0.0082 0.002,0.154662 0.002,0.162875 0.0144,1.161324 0.0271,2.650747 0.15871,4.063973 0.12864,1.381511 0.36384,2.482817 0.52623,2.706061 0.0434,0.05971 0.1,0.05741 0.11979,0.0687 0.0143,-0.018 0.0673,-0.03664 0.0861,-0.107557 0.0576,-0.216752 -0.0903,-1.398934 -0.1778,-2.711541 -0.0946,-1.41988 -0.12599,-2.837874 -0.14214,-4.027065 -1e-5,-6.18e-4 -0.002,-0.16204 -0.002,-0.162659 -0.0285,-2.316007 -0.17911,-3.884678 -0.35912,-5.477049 -0.0698,-0.61745 -0.12482,-1.056556 -0.1624,-1.307653 a 0.1481211,0.1481211 90 0 0 -0.29298,0.04384 z"
           id="path23119"
           sodipodi:nodetypes="cc"
           inkscape:path-effect="#path-effect23121"
           inkscape:original-d="m 114.85514,58.428139 c 0.69463,4.64191 0.0298,9.245301 0.90392,13.771603" /><g
           id="g150834"
           transform="matrix(0.72822047,0,0,0.72822047,-215.58092,59.045306)"><path
             style="fill:#e8e8e8;fill-opacity:1;fill-rule:evenodd;stroke:#000000;stroke-width:0.411963;stroke-linecap:round;stroke-linejoin:round;stroke-dasharray:none"
             d="m 454.49058,20.359492 c 0,0 -1.99281,-1.464108 0.32536,-2.236832 2.31818,-0.772724 2.07415,2.074153 2.07415,2.074153 0,0 5.32773,3.090897 3.00956,6.547821 0,0 0.81341,2.196161 0.77274,2.60286 -0.0407,0.406696 -0.48805,0.772724 -1.17943,0.813393 0,0 -0.36603,1.626788 -2.15549,-0.08134 0,0 -5.36842,-3.212906 -2.84689,-9.720056 z"
             id="path150828" /><path
             style="fill:#000000;fill-opacity:1;fill-rule:nonzero;stroke:none;stroke-width:0.3;stroke-linecap:round;stroke-linejoin:round;stroke-dasharray:none"
             d="m 459.39436,29.965723 c 0.006,-0.0024 0.0144,-0.0029 -0.002,-0.0014 -0.008,7.36e-4 -0.0197,0.0011 -0.0355,-3.19e-4 -0.0103,-9.45e-4 -0.0231,-0.0027 -0.0381,-0.0061 -0.0346,-0.0077 -0.0847,-0.02445 -0.14825,-0.06163 -0.0633,-0.03701 -0.13797,-0.09316 -0.22225,-0.177436 -0.17738,-0.177379 -0.36491,-0.479954 -0.60595,-0.946518 -0.0512,-0.09908 -0.10177,-0.199387 -0.15512,-0.305593 -0.24256,-0.482856 -0.63667,-1.355431 -0.76887,-1.722113 0.1037,0.499229 0.24635,1.262247 0.46618,1.853566 0.0426,0.114496 0.0887,0.225103 0.13747,0.330583 0.23153,0.501026 0.48491,0.815386 0.69294,1.02342 0.10124,0.101234 0.19795,0.175695 0.28899,0.228943 0.0924,0.05403 0.17425,0.08349 0.24287,0.09883 0.0294,0.0066 0.0562,0.0105 0.08,0.01269 0.0362,0.0033 0.0685,0.0029 0.0965,2.53e-4 0.0567,-0.0053 0.08,-0.01578 0.0865,-0.0182 a 0.16500001,0.16500001 90 0 0 -0.11586,-0.308988 z"
             id="path150830"
             inkscape:path-effect="#path-effect150838"
             inkscape:original-d="m 459.45229,30.120217 c 0,0 -0.97608,0.366027 -2.03348,-3.375584" /><path
             style="fill:#000000;fill-opacity:1;fill-rule:nonzero;stroke:none;stroke-width:0.3;stroke-linecap:round;stroke-linejoin:round;stroke-dasharray:none"
             d="m 456.98133,29.813912 c 0.003,-0.0077 0.01,-0.02159 0.0215,-0.03669 0.01,-0.01271 0.0258,-0.02851 0.0488,-0.04096 0.0208,-0.01127 0.0441,-0.01783 0.068,-0.01896 0.0209,-9.86e-4 0.0394,0.0024 0.0537,0.0069 0.0131,0.0041 0.0234,0.0093 0.0306,0.01358 0.007,0.0041 0.0122,0.0081 0.0158,0.01103 0.007,0.0055 0.0101,0.0096 0.0109,0.01065 0.002,0.0027 -0.002,-0.0013 -0.008,-0.0096 -0.006,-0.0082 -0.0131,-0.01991 -0.0219,-0.035 -0.0197,-0.03388 -0.0424,-0.07858 -0.0627,-0.122853 -0.005,-0.01102 -0.01,-0.02175 -0.0142,-0.0319 -0.0246,-0.05713 -0.0366,-0.09861 -0.0551,-0.151187 -0.01,-0.02702 -0.0209,-0.0576 -0.0383,-0.100461 -0.0342,-0.0843 -0.0869,-0.214846 -0.15198,-0.382513 -0.0661,-0.170325 -0.14102,-0.36842 -0.22153,-0.59102 -0.12591,-0.348089 -0.21519,-0.615051 -0.31353,-0.911144 -0.0388,-0.116913 -0.0756,-0.225987 -0.11504,-0.346894 -0.0669,-0.205173 -0.12178,-0.385817 -0.16257,-0.548126 -0.0558,-0.221841 -0.0709,-0.355638 -0.0707,-0.434793 -0.0279,0.07448 -0.0693,0.207789 -0.0778,0.450031 -0.006,0.173378 0.006,0.375669 0.0364,0.595601 0.0175,0.126377 0.0403,0.252835 0.0665,0.372699 0.063,0.287333 0.16095,0.618894 0.27553,0.950333 0.0784,0.226796 0.1576,0.433467 0.22749,0.604775 0.0698,0.171164 0.12834,0.302108 0.16887,0.388786 0.0201,0.04291 0.0364,0.0742 0.0506,0.09984 0.0294,0.05311 0.0524,0.08825 0.084,0.147628 0.006,0.01044 0.0115,0.02166 0.0176,0.03327 0.0246,0.04684 0.0503,0.09603 0.0754,0.139798 0.011,0.01926 0.0219,0.03744 0.0325,0.05361 0.0105,0.0161 0.0224,0.03298 0.0356,0.048 0.007,0.0081 0.0165,0.01785 0.0281,0.02724 0.006,0.0051 0.014,0.01074 0.0233,0.01617 0.01,0.0057 0.0222,0.01185 0.0373,0.01657 0.0164,0.0051 0.0369,0.0088 0.0595,0.0077 0.0258,-0.0012 0.0507,-0.0083 0.073,-0.02034 0.0247,-0.01335 0.0417,-0.03041 0.0529,-0.04457 0.0133,-0.01689 0.0208,-0.03284 0.0248,-0.04256 a 0.16500001,0.16500001 90 0 0 -0.30558,-0.124576 z"
             id="path150832"
             sodipodi:nodetypes="cc"
             inkscape:path-effect="#path-effect150842"
             inkscape:original-d="m 457.13412,29.8762 c -0.061,0.149633 -1.31275,-2.828794 -1.13876,-3.782281" /></g></g></g></g></svg>
