<?xml version="1.0" encoding="UTF-8" standalone="no"?>
<svg
   xmlns:dc="http://purl.org/dc/elements/1.1/"
   xmlns:cc="http://creativecommons.org/ns#"
   xmlns:rdf="http://www.w3.org/1999/02/22-rdf-syntax-ns#"
   xmlns:svg="http://www.w3.org/2000/svg"
   xmlns="http://www.w3.org/2000/svg"
   xmlns:sodipodi="http://sodipodi.sourceforge.net/DTD/sodipodi-0.dtd"
   xmlns:inkscape="http://www.inkscape.org/namespaces/inkscape"
   width="545.77899"
   height="224"
   viewBox="0 0 144.40402 59.266667"
   version="1.1"
   id="svg83"
   inkscape:version="1.0.2-2 (e86c870879, 2021-01-15)"
   sodipodi:docname="Advocates.svg"
   inkscape:export-filename="C:\Users\pc\Desktop\Fedora\Logos\Advocates.png"
   inkscape:export-xdpi="96"
   inkscape:export-ydpi="96">
  <defs
     id="defs77" />
  <sodipodi:namedview
     id="base"
     pagecolor="#ffffff"
     bordercolor="#666666"
     borderopacity="1.0"
     inkscape:pageopacity="0.0"
     inkscape:pageshadow="2"
     inkscape:zoom="0.8"
     inkscape:cx="336.16537"
     inkscape:cy="200.64382"
     inkscape:document-units="mm"
     inkscape:current-layer="layer1"
     inkscape:document-rotation="0"
     showgrid="false"
     units="px"
     inkscape:window-width="1366"
     inkscape:window-height="705"
     inkscape:window-x="-8"
     inkscape:window-y="-8"
     inkscape:window-maximized="1" />
  <metadata
     id="metadata80">
    <rdf:RDF>
      <cc:Work
         rdf:about="">
        <dc:format>image/svg+xml</dc:format>
        <dc:type
           rdf:resource="http://purl.org/dc/dcmitype/StillImage" />
        <dc:title />
      </cc:Work>
    </rdf:RDF>
  </metadata>
  <g
     inkscape:label="Layer 1"
     inkscape:groupmode="layer"
     id="layer1">
    <rect
       inkscape:export-ydpi="96"
       inkscape:export-xdpi="96"
       ry="2.4178782"
       rx="2.242142"
       y="0"
       x="0"
       height="59.266666"
       width="144.40413"
       id="rect1560"
       style="fill:#ffffff;fill-opacity:1;stroke:none;stroke-width:0.524891;stroke-linecap:round;stroke-linejoin:round;stroke-miterlimit:4;stroke-dasharray:none;stroke-dashoffset:0;stroke-opacity:1"
       inkscape:export-filename="/home/duffy/Cáipéisí/Work/Fedora/Tickets/620 - logo/2020 edits/Set 1/2020-19.png" />
    <text
       id="text1568"
       y="33.753902"
       x="34.232574"
       style="font-style:normal;font-weight:normal;font-size:15.6113px;line-height:1.25;font-family:sans-serif;letter-spacing:0px;word-spacing:0px;fill:#294172;fill-opacity:1;stroke:none;stroke-width:0.390284"
       xml:space="preserve"><tspan
         style="font-style:normal;font-variant:normal;font-weight:600;font-stretch:normal;font-family:Montserrat;-inkscape-font-specification:'Montserrat Semi-Bold';letter-spacing:-0.268273px;fill:#294172;fill-opacity:1;stroke-width:0.390284"
         y="33.753902"
         x="34.232574"
         id="tspan1566"
         sodipodi:role="line">ADVOCATES</tspan></text>
    <path
       id="path1570"
       style="fill:#51a2da;fill-opacity:1;fill-rule:nonzero;stroke:none;stroke-width:0.35278"
       d="m 20.360096,18.232721 c -5.30632,0 -9.60677,4.29897 -9.61023,9.60408 h -0.002 v 7.43914 h 0.002 c 0.002,1.20438 0.9784,2.17929 2.1834,2.17929 h 0.0104 0.002 7.41865 c 5.30692,-0.003 9.60613,-4.30376 9.60613,-9.61024 0,-5.3087 -4.3015,-9.61227 -9.61022,-9.61227 z m 1.94786,3.9551 c 1.61399,0 3.13787,1.2367 3.13787,2.94125 0,0.15809 -6e-4,0.31636 -0.0266,0.49567 -0.0446,0.45351 -0.45815,0.77874 -0.90942,0.71482 -0.45124,-0.0647 -0.75735,-0.49189 -0.67385,-0.94013 0.007,-0.0511 0.0104,-0.13229 0.0104,-0.27036 0,-0.96644 -0.79033,-1.33954 -1.53821,-1.33954 -0.74744,0 -1.42172,0.62851 -1.42352,1.33954 0.0129,0.82249 0,1.63908 0,2.45991 l 1.38665,-0.0103 c 1.08302,-0.0225 1.09515,1.60998 0.0122,1.60171 l -1.39894,0.0103 c -0.005,0.66153 0.006,0.5414 0.002,0.87457 0,0 0.012,0.80806 -0.0123,1.42148 -0.16742,1.80154 -1.70078,3.24231 -3.54341,3.24231 -1.95304,0 -3.5639,-1.59785 -3.5639,-3.5557 0.0586,-2.01411 1.66631,-3.59703 3.68883,-3.57823 l 1.12652,-0.008 v 1.59965 l -1.12652,0.0103 h -0.008 c -1.1116,0.0328 -2.06277,0.78613 -2.08098,1.97652 0,1.08467 0.87656,1.95401 1.96423,1.95401 1.08587,0 1.954,-0.79087 1.954,-1.95195 0.0123,-1.92552 -0.008,-4.05253 -0.002,-6.05248 6e-4,-0.11239 0.007,-0.20172 0.0185,-0.32566 0.18336,-1.48072 1.50786,-2.60944 3.00679,-2.60944 z" />
  </g>
</svg>
