{
  "aarch64": [
    {
      "name": "baseos",
      "baseurl": "http://REPLACE_ME_HERE/rhel-10/nightly/RHEL-10/latest-RHEL-10.0/compose/BaseOS/aarch64/os/",
      "gpgkey": "-----BEGIN PGP PUBLIC KEY BLOCK-----\nVersion: GnuPG v2.0.22 (GNU/Linux)\n\nmQINBErgSTsBEACh2A4b0O9t+vzC9VrVtL1AKvUWi9OPCjkvR7Xd8DtJxeeMZ5eF\n0HtzIG58qDRybwUe89FZprB1ffuUKzdE+HcL3FbNWSSOXVjZIersdXyH3NvnLLLF\n0DNRB2ix3bXG9Rh/RXpFsNxDp2CEMdUvbYCzE79K1EnUTVh1L0Of023FtPSZXX0c\nu7Pb5DI5lX5YeoXO6RoodrIGYJsVBQWnrWw4xNTconUfNPk0EGZtEnzvH2zyPoJh\nXGF+Ncu9XwbalnYde10OCvSWAZ5zTCpoLMTvQjWpbCdWXJzCm6G+/hx9upke546H\n5IjtYm4dTIVTnc3wvDiODgBKRzOl9rEOCIgOuGtDxRxcQkjrC+xvg5Vkqn7vBUyW\n9pHedOU+PoF3DGOM+dqv+eNKBvh9YF9ugFAQBkcG7viZgvGEMGGUpzNgN7XnS1gj\n/DPo9mZESOYnKceve2tIC87p2hqjrxOHuI7fkZYeNIcAoa83rBltFXaBDYhWAKS1\nPcXS1/7JzP0ky7d0L6Xbu/If5kqWQpKwUInXtySRkuraVfuK3Bpa+X1XecWi24JY\nHVtlNX025xx1ewVzGNCTlWn1skQN2OOoQTV4C8/qFpTW6DTWYurd4+fE0OJFJZQF\nbuhfXYwmRlVOgN5i77NTIJZJQfYFj38c/Iv5vZBPokO6mffrOTv3MHWVgQARAQAB\ntDNSZWQgSGF0LCBJbmMuIChyZWxlYXNlIGtleSAyKSA8c2VjdXJpdHlAcmVkaGF0\nLmNvbT6JAjYEEwEIACACGwMGCwkIBwMCBBUCCAMEFgIDAQIeAQIXgAUCSuBJPAAK\nCRAZni+R/UMdUfIkD/9m3HWv07uJG26R3KBexTo2FFu3rmZs+m2nfW8R3dBX+k0o\nAOFpgJCsNgKwU81LOPrkMN19G0+Yn/ZTCDD7cIQ7dhYuDyEX97xh4une/EhnnRuh\nASzR+1xYbj/HcYZIL9kbslgpebMn+AhxbUTQF/mziug3hLidR9Bzvygq0Q09E11c\nOZL4BU6J2HqxL+9m2F+tnLdfhL7MsAq9nbmWAOpkbGefc5SXBSq0sWfwoes3X3yD\nQ8B5Xqr9AxABU7oUB+wRqvY69ZCxi/BhuuJCUxY89ZmwXfkVxeHl1tYfROUwOnJO\nGYSbI/o41KBK4DkIiDcT7QqvqvCyudnxZdBjL2QU6OrIJvWmKs319qSF9m3mXRSt\nZzWtB89Pj5LZ6cdtuHvW9GO4qSoBLmAfB313pGkbgi1DE6tqCLHlA0yQ8zv99OWV\ncMDGmS7tVTZqfX1xQJ0N3bNORQNtikJC3G+zBCJzIeZleeDlMDQcww00yWU1oE7/\nTo2UmykMGc7o9iggFWR2g0PIcKsA/SXdRKWPqCHG2uKHBvdRTQGupdXQ1sbV+AHw\nycyA/9H/mp/NUSNM2cqnBDcZ6GhlHt59zWtEveiuU5fpTbp4GVcFXbW8jStj8j8z\n1HI3cywZO8+YNPzqyx0JWsidXGkfzkPHyS4jTG84lfu2JG8m/nqLnRSeKpl20Q==\n=79bX\n-----END PGP PUBLIC KEY BLOCK-----\n-----BEGIN PGP PUBLIC KEY BLOCK-----\n\nmQINBGIpIp4BEAC/o5e1WzLIsS6/JOQCs4XYATYTcf6B6ALzcP05G0W3uRpUQSrL\nFRKNrU8ZCelm/B+XSh2ljJNeklp2WLxYENDOsftDXGoyLr2hEkI5OyK267IHhFNJ\ng+BN+T5Cjh4ZiiWij6o9F7x2ZpxISE9M4iI80rwSv1KOnGSw5j2zD2EwoMjTVyVE\n/t3s5XJxnDclB7ZqL+cgjv0mWUY/4+b/OoRTkhq7b8QILuZp75Y64pkrndgakm1T\n8mAGXV02mEzpNj9DyAJdUqa11PIhMJMxxHOGHJ8CcHZ2NJL2e7yJf4orTj+cMhP5\nLzJcVlaXnQYu8Zkqa0V6J1Qdj8ZXL72QsmyicRYXAtK9Jm5pvBHuYU2m6Ja7dBEB\nVkhe7lTKhAjkZC5ErPmANNS9kPdtXCOpwN1lOnmD2m04hks3kpH9OTX7RkTFUSws\neARAfRID6RLfi59B9lmAbekecnsMIFMx7qR7ZKyQb3GOuZwNYOaYFevuxusSwCHv\n4FtLDIhk+Fge+EbPdEva+VLJeMOb02gC4V/cX/oFoPkxM1A5LHjkuAM+aFLAiIRd\nNp/tAPWk1k6yc+FqkcDqOttbP4ciiXb9JPtmzTCbJD8lgH0rGp8ufyMXC9x7/dqX\nTjsiGzyvlMnrkKB4GL4DqRFl8LAR02A3846DD8CAcaxoXggL2bJCU2rgUQARAQAB\ntDVSZWQgSGF0LCBJbmMuIChhdXhpbGlhcnkga2V5IDMpIDxzZWN1cml0eUByZWRo\nYXQuY29tPokCUgQTAQgAPBYhBH5GJCWMQGU11W1vE1BU5KRaY0CzBQJiKSKeAhsD\nBQsJCAcCAyICAQYVCgkICwIEFgIDAQIeBwIXgAAKCRBQVOSkWmNAsyBfEACuTN/X\nYR+QyzeRw0pXcTvMqzNE4DKKr97hSQEwZH1/v1PEPs5O3psuVUm2iam7bqYwG+ry\nEskAgMHi8AJmY0lioQD5/LTSLTrM8UyQnU3g17DHau1NHIFTGyaW4a7xviU4C2+k\nc6X0u1CPHI1U4Q8prpNcfLsldaNYlsVZtUtYSHKPAUcswXWliW7QYjZ5tMSbu8jR\nOMOc3mZuf0fcVFNu8+XSpN7qLhRNcPv+FCNmk/wkaQfH4Pv+jVsOgHqkV3aLqJeN\nkNUnpyEKYkNqo7mNfNVWOcl+Z1KKKwSkIi3vg8maC7rODsy6IX+Y96M93sqYDQom\naaWue2gvw6thEoH4SaCrCL78mj2YFpeg1Oew4QwVcBnt68KOPfL9YyoOicNs4Vuu\nfb/vjU2ONPZAeepIKA8QxCETiryCcP43daqThvIgdbUIiWne3gae6eSj0EuUPoYe\nH5g2Lw0qdwbHIOxqp2kvN96Ii7s1DK3VyhMt/GSPCxRnDRJ8oQKJ2W/I1IT5VtiU\nzMjjq5JcYzRPzHDxfVzT9CLeU/0XQ+2OOUAiZKZ0dzSyyVn8xbpviT7iadvjlQX3\nCINaPB+d2Kxa6uFWh+ZYOLLAgZ9B8NKutUHpXN66YSfe79xFBSFWKkJ8cSIMk13/\nIfs7ApKlKCCRDpwoDqx/sjIaj1cpOfLHYjnefg==\n=UZd/\n-----END PGP PUBLIC KEY BLOCK-----"
    },
    {
      "name": "appstream",
      "baseurl": "http://REPLACE_ME_HERE/rhel-10/nightly/RHEL-10/latest-RHEL-10.0/compose/AppStream/aarch64/os/",
      "gpgkey": "-----BEGIN PGP PUBLIC KEY BLOCK-----\nVersion: GnuPG v2.0.22 (GNU/Linux)\n\nmQINBErgSTsBEACh2A4b0O9t+vzC9VrVtL1AKvUWi9OPCjkvR7Xd8DtJxeeMZ5eF\n0HtzIG58qDRybwUe89FZprB1ffuUKzdE+HcL3FbNWSSOXVjZIersdXyH3NvnLLLF\n0DNRB2ix3bXG9Rh/RXpFsNxDp2CEMdUvbYCzE79K1EnUTVh1L0Of023FtPSZXX0c\nu7Pb5DI5lX5YeoXO6RoodrIGYJsVBQWnrWw4xNTconUfNPk0EGZtEnzvH2zyPoJh\nXGF+Ncu9XwbalnYde10OCvSWAZ5zTCpoLMTvQjWpbCdWXJzCm6G+/hx9upke546H\n5IjtYm4dTIVTnc3wvDiODgBKRzOl9rEOCIgOuGtDxRxcQkjrC+xvg5Vkqn7vBUyW\n9pHedOU+PoF3DGOM+dqv+eNKBvh9YF9ugFAQBkcG7viZgvGEMGGUpzNgN7XnS1gj\n/DPo9mZESOYnKceve2tIC87p2hqjrxOHuI7fkZYeNIcAoa83rBltFXaBDYhWAKS1\nPcXS1/7JzP0ky7d0L6Xbu/If5kqWQpKwUInXtySRkuraVfuK3Bpa+X1XecWi24JY\nHVtlNX025xx1ewVzGNCTlWn1skQN2OOoQTV4C8/qFpTW6DTWYurd4+fE0OJFJZQF\nbuhfXYwmRlVOgN5i77NTIJZJQfYFj38c/Iv5vZBPokO6mffrOTv3MHWVgQARAQAB\ntDNSZWQgSGF0LCBJbmMuIChyZWxlYXNlIGtleSAyKSA8c2VjdXJpdHlAcmVkaGF0\nLmNvbT6JAjYEEwEIACACGwMGCwkIBwMCBBUCCAMEFgIDAQIeAQIXgAUCSuBJPAAK\nCRAZni+R/UMdUfIkD/9m3HWv07uJG26R3KBexTo2FFu3rmZs+m2nfW8R3dBX+k0o\nAOFpgJCsNgKwU81LOPrkMN19G0+Yn/ZTCDD7cIQ7dhYuDyEX97xh4une/EhnnRuh\nASzR+1xYbj/HcYZIL9kbslgpebMn+AhxbUTQF/mziug3hLidR9Bzvygq0Q09E11c\nOZL4BU6J2HqxL+9m2F+tnLdfhL7MsAq9nbmWAOpkbGefc5SXBSq0sWfwoes3X3yD\nQ8B5Xqr9AxABU7oUB+wRqvY69ZCxi/BhuuJCUxY89ZmwXfkVxeHl1tYfROUwOnJO\nGYSbI/o41KBK4DkIiDcT7QqvqvCyudnxZdBjL2QU6OrIJvWmKs319qSF9m3mXRSt\nZzWtB89Pj5LZ6cdtuHvW9GO4qSoBLmAfB313pGkbgi1DE6tqCLHlA0yQ8zv99OWV\ncMDGmS7tVTZqfX1xQJ0N3bNORQNtikJC3G+zBCJzIeZleeDlMDQcww00yWU1oE7/\nTo2UmykMGc7o9iggFWR2g0PIcKsA/SXdRKWPqCHG2uKHBvdRTQGupdXQ1sbV+AHw\nycyA/9H/mp/NUSNM2cqnBDcZ6GhlHt59zWtEveiuU5fpTbp4GVcFXbW8jStj8j8z\n1HI3cywZO8+YNPzqyx0JWsidXGkfzkPHyS4jTG84lfu2JG8m/nqLnRSeKpl20Q==\n=79bX\n-----END PGP PUBLIC KEY BLOCK-----\n-----BEGIN PGP PUBLIC KEY BLOCK-----\n\nmQINBGIpIp4BEAC/o5e1WzLIsS6/JOQCs4XYATYTcf6B6ALzcP05G0W3uRpUQSrL\nFRKNrU8ZCelm/B+XSh2ljJNeklp2WLxYENDOsftDXGoyLr2hEkI5OyK267IHhFNJ\ng+BN+T5Cjh4ZiiWij6o9F7x2ZpxISE9M4iI80rwSv1KOnGSw5j2zD2EwoMjTVyVE\n/t3s5XJxnDclB7ZqL+cgjv0mWUY/4+b/OoRTkhq7b8QILuZp75Y64pkrndgakm1T\n8mAGXV02mEzpNj9DyAJdUqa11PIhMJMxxHOGHJ8CcHZ2NJL2e7yJf4orTj+cMhP5\nLzJcVlaXnQYu8Zkqa0V6J1Qdj8ZXL72QsmyicRYXAtK9Jm5pvBHuYU2m6Ja7dBEB\nVkhe7lTKhAjkZC5ErPmANNS9kPdtXCOpwN1lOnmD2m04hks3kpH9OTX7RkTFUSws\neARAfRID6RLfi59B9lmAbekecnsMIFMx7qR7ZKyQb3GOuZwNYOaYFevuxusSwCHv\n4FtLDIhk+Fge+EbPdEva+VLJeMOb02gC4V/cX/oFoPkxM1A5LHjkuAM+aFLAiIRd\nNp/tAPWk1k6yc+FqkcDqOttbP4ciiXb9JPtmzTCbJD8lgH0rGp8ufyMXC9x7/dqX\nTjsiGzyvlMnrkKB4GL4DqRFl8LAR02A3846DD8CAcaxoXggL2bJCU2rgUQARAQAB\ntDVSZWQgSGF0LCBJbmMuIChhdXhpbGlhcnkga2V5IDMpIDxzZWN1cml0eUByZWRo\nYXQuY29tPokCUgQTAQgAPBYhBH5GJCWMQGU11W1vE1BU5KRaY0CzBQJiKSKeAhsD\nBQsJCAcCAyICAQYVCgkICwIEFgIDAQIeBwIXgAAKCRBQVOSkWmNAsyBfEACuTN/X\nYR+QyzeRw0pXcTvMqzNE4DKKr97hSQEwZH1/v1PEPs5O3psuVUm2iam7bqYwG+ry\nEskAgMHi8AJmY0lioQD5/LTSLTrM8UyQnU3g17DHau1NHIFTGyaW4a7xviU4C2+k\nc6X0u1CPHI1U4Q8prpNcfLsldaNYlsVZtUtYSHKPAUcswXWliW7QYjZ5tMSbu8jR\nOMOc3mZuf0fcVFNu8+XSpN7qLhRNcPv+FCNmk/wkaQfH4Pv+jVsOgHqkV3aLqJeN\nkNUnpyEKYkNqo7mNfNVWOcl+Z1KKKwSkIi3vg8maC7rODsy6IX+Y96M93sqYDQom\naaWue2gvw6thEoH4SaCrCL78mj2YFpeg1Oew4QwVcBnt68KOPfL9YyoOicNs4Vuu\nfb/vjU2ONPZAeepIKA8QxCETiryCcP43daqThvIgdbUIiWne3gae6eSj0EuUPoYe\nH5g2Lw0qdwbHIOxqp2kvN96Ii7s1DK3VyhMt/GSPCxRnDRJ8oQKJ2W/I1IT5VtiU\nzMjjq5JcYzRPzHDxfVzT9CLeU/0XQ+2OOUAiZKZ0dzSyyVn8xbpviT7iadvjlQX3\nCINaPB+d2Kxa6uFWh+ZYOLLAgZ9B8NKutUHpXN66YSfe79xFBSFWKkJ8cSIMk13/\nIfs7ApKlKCCRDpwoDqx/sjIaj1cpOfLHYjnefg==\n=UZd/\n-----END PGP PUBLIC KEY BLOCK-----"
    },
    {
      "name": "google-compute-engine",
      "baseurl": "https://packages.cloud.google.com/yum/repos/google-compute-engine-el9-aarch64-stable",
      "check_gpg": false,
      "image_type_tags": [
        "gce"
      ]
    }
  ],
  "x86_64": [
    {
      "name": "baseos",
      "baseurl": "http://REPLACE_ME_HERE/rhel-10/nightly/RHEL-10/latest-RHEL-10.0/compose/BaseOS/x86_64/os/",
      "gpgkey": "-----BEGIN PGP PUBLIC KEY BLOCK-----\nVersion: GnuPG v2.0.22 (GNU/Linux)\n\nmQINBErgSTsBEACh2A4b0O9t+vzC9VrVtL1AKvUWi9OPCjkvR7Xd8DtJxeeMZ5eF\n0HtzIG58qDRybwUe89FZprB1ffuUKzdE+HcL3FbNWSSOXVjZIersdXyH3NvnLLLF\n0DNRB2ix3bXG9Rh/RXpFsNxDp2CEMdUvbYCzE79K1EnUTVh1L0Of023FtPSZXX0c\nu7Pb5DI5lX5YeoXO6RoodrIGYJsVBQWnrWw4xNTconUfNPk0EGZtEnzvH2zyPoJh\nXGF+Ncu9XwbalnYde10OCvSWAZ5zTCpoLMTvQjWpbCdWXJzCm6G+/hx9upke546H\n5IjtYm4dTIVTnc3wvDiODgBKRzOl9rEOCIgOuGtDxRxcQkjrC+xvg5Vkqn7vBUyW\n9pHedOU+PoF3DGOM+dqv+eNKBvh9YF9ugFAQBkcG7viZgvGEMGGUpzNgN7XnS1gj\n/DPo9mZESOYnKceve2tIC87p2hqjrxOHuI7fkZYeNIcAoa83rBltFXaBDYhWAKS1\nPcXS1/7JzP0ky7d0L6Xbu/If5kqWQpKwUInXtySRkuraVfuK3Bpa+X1XecWi24JY\nHVtlNX025xx1ewVzGNCTlWn1skQN2OOoQTV4C8/qFpTW6DTWYurd4+fE0OJFJZQF\nbuhfXYwmRlVOgN5i77NTIJZJQfYFj38c/Iv5vZBPokO6mffrOTv3MHWVgQARAQAB\ntDNSZWQgSGF0LCBJbmMuIChyZWxlYXNlIGtleSAyKSA8c2VjdXJpdHlAcmVkaGF0\nLmNvbT6JAjYEEwEIACACGwMGCwkIBwMCBBUCCAMEFgIDAQIeAQIXgAUCSuBJPAAK\nCRAZni+R/UMdUfIkD/9m3HWv07uJG26R3KBexTo2FFu3rmZs+m2nfW8R3dBX+k0o\nAOFpgJCsNgKwU81LOPrkMN19G0+Yn/ZTCDD7cIQ7dhYuDyEX97xh4une/EhnnRuh\nASzR+1xYbj/HcYZIL9kbslgpebMn+AhxbUTQF/mziug3hLidR9Bzvygq0Q09E11c\nOZL4BU6J2HqxL+9m2F+tnLdfhL7MsAq9nbmWAOpkbGefc5SXBSq0sWfwoes3X3yD\nQ8B5Xqr9AxABU7oUB+wRqvY69ZCxi/BhuuJCUxY89ZmwXfkVxeHl1tYfROUwOnJO\nGYSbI/o41KBK4DkIiDcT7QqvqvCyudnxZdBjL2QU6OrIJvWmKs319qSF9m3mXRSt\nZzWtB89Pj5LZ6cdtuHvW9GO4qSoBLmAfB313pGkbgi1DE6tqCLHlA0yQ8zv99OWV\ncMDGmS7tVTZqfX1xQJ0N3bNORQNtikJC3G+zBCJzIeZleeDlMDQcww00yWU1oE7/\nTo2UmykMGc7o9iggFWR2g0PIcKsA/SXdRKWPqCHG2uKHBvdRTQGupdXQ1sbV+AHw\nycyA/9H/mp/NUSNM2cqnBDcZ6GhlHt59zWtEveiuU5fpTbp4GVcFXbW8jStj8j8z\n1HI3cywZO8+YNPzqyx0JWsidXGkfzkPHyS4jTG84lfu2JG8m/nqLnRSeKpl20Q==\n=79bX\n-----END PGP PUBLIC KEY BLOCK-----\n-----BEGIN PGP PUBLIC KEY BLOCK-----\n\nmQINBGIpIp4BEAC/o5e1WzLIsS6/JOQCs4XYATYTcf6B6ALzcP05G0W3uRpUQSrL\nFRKNrU8ZCelm/B+XSh2ljJNeklp2WLxYENDOsftDXGoyLr2hEkI5OyK267IHhFNJ\ng+BN+T5Cjh4ZiiWij6o9F7x2ZpxISE9M4iI80rwSv1KOnGSw5j2zD2EwoMjTVyVE\n/t3s5XJxnDclB7ZqL+cgjv0mWUY/4+b/OoRTkhq7b8QILuZp75Y64pkrndgakm1T\n8mAGXV02mEzpNj9DyAJdUqa11PIhMJMxxHOGHJ8CcHZ2NJL2e7yJf4orTj+cMhP5\nLzJcVlaXnQYu8Zkqa0V6J1Qdj8ZXL72QsmyicRYXAtK9Jm5pvBHuYU2m6Ja7dBEB\nVkhe7lTKhAjkZC5ErPmANNS9kPdtXCOpwN1lOnmD2m04hks3kpH9OTX7RkTFUSws\neARAfRID6RLfi59B9lmAbekecnsMIFMx7qR7ZKyQb3GOuZwNYOaYFevuxusSwCHv\n4FtLDIhk+Fge+EbPdEva+VLJeMOb02gC4V/cX/oFoPkxM1A5LHjkuAM+aFLAiIRd\nNp/tAPWk1k6yc+FqkcDqOttbP4ciiXb9JPtmzTCbJD8lgH0rGp8ufyMXC9x7/dqX\nTjsiGzyvlMnrkKB4GL4DqRFl8LAR02A3846DD8CAcaxoXggL2bJCU2rgUQARAQAB\ntDVSZWQgSGF0LCBJbmMuIChhdXhpbGlhcnkga2V5IDMpIDxzZWN1cml0eUByZWRo\nYXQuY29tPokCUgQTAQgAPBYhBH5GJCWMQGU11W1vE1BU5KRaY0CzBQJiKSKeAhsD\nBQsJCAcCAyICAQYVCgkICwIEFgIDAQIeBwIXgAAKCRBQVOSkWmNAsyBfEACuTN/X\nYR+QyzeRw0pXcTvMqzNE4DKKr97hSQEwZH1/v1PEPs5O3psuVUm2iam7bqYwG+ry\nEskAgMHi8AJmY0lioQD5/LTSLTrM8UyQnU3g17DHau1NHIFTGyaW4a7xviU4C2+k\nc6X0u1CPHI1U4Q8prpNcfLsldaNYlsVZtUtYSHKPAUcswXWliW7QYjZ5tMSbu8jR\nOMOc3mZuf0fcVFNu8+XSpN7qLhRNcPv+FCNmk/wkaQfH4Pv+jVsOgHqkV3aLqJeN\nkNUnpyEKYkNqo7mNfNVWOcl+Z1KKKwSkIi3vg8maC7rODsy6IX+Y96M93sqYDQom\naaWue2gvw6thEoH4SaCrCL78mj2YFpeg1Oew4QwVcBnt68KOPfL9YyoOicNs4Vuu\nfb/vjU2ONPZAeepIKA8QxCETiryCcP43daqThvIgdbUIiWne3gae6eSj0EuUPoYe\nH5g2Lw0qdwbHIOxqp2kvN96Ii7s1DK3VyhMt/GSPCxRnDRJ8oQKJ2W/I1IT5VtiU\nzMjjq5JcYzRPzHDxfVzT9CLeU/0XQ+2OOUAiZKZ0dzSyyVn8xbpviT7iadvjlQX3\nCINaPB+d2Kxa6uFWh+ZYOLLAgZ9B8NKutUHpXN66YSfe79xFBSFWKkJ8cSIMk13/\nIfs7ApKlKCCRDpwoDqx/sjIaj1cpOfLHYjnefg==\n=UZd/\n-----END PGP PUBLIC KEY BLOCK-----"
    },
    {
      "name": "appstream",
      "baseurl": "http://REPLACE_ME_HERE/rhel-10/nightly/RHEL-10/latest-RHEL-10.0/compose/AppStream/x86_64/os/",
      "gpgkey": "-----BEGIN PGP PUBLIC KEY BLOCK-----\nVersion: GnuPG v2.0.22 (GNU/Linux)\n\nmQINBErgSTsBEACh2A4b0O9t+vzC9VrVtL1AKvUWi9OPCjkvR7Xd8DtJxeeMZ5eF\n0HtzIG58qDRybwUe89FZprB1ffuUKzdE+HcL3FbNWSSOXVjZIersdXyH3NvnLLLF\n0DNRB2ix3bXG9Rh/RXpFsNxDp2CEMdUvbYCzE79K1EnUTVh1L0Of023FtPSZXX0c\nu7Pb5DI5lX5YeoXO6RoodrIGYJsVBQWnrWw4xNTconUfNPk0EGZtEnzvH2zyPoJh\nXGF+Ncu9XwbalnYde10OCvSWAZ5zTCpoLMTvQjWpbCdWXJzCm6G+/hx9upke546H\n5IjtYm4dTIVTnc3wvDiODgBKRzOl9rEOCIgOuGtDxRxcQkjrC+xvg5Vkqn7vBUyW\n9pHedOU+PoF3DGOM+dqv+eNKBvh9YF9ugFAQBkcG7viZgvGEMGGUpzNgN7XnS1gj\n/DPo9mZESOYnKceve2tIC87p2hqjrxOHuI7fkZYeNIcAoa83rBltFXaBDYhWAKS1\nPcXS1/7JzP0ky7d0L6Xbu/If5kqWQpKwUInXtySRkuraVfuK3Bpa+X1XecWi24JY\nHVtlNX025xx1ewVzGNCTlWn1skQN2OOoQTV4C8/qFpTW6DTWYurd4+fE0OJFJZQF\nbuhfXYwmRlVOgN5i77NTIJZJQfYFj38c/Iv5vZBPokO6mffrOTv3MHWVgQARAQAB\ntDNSZWQgSGF0LCBJbmMuIChyZWxlYXNlIGtleSAyKSA8c2VjdXJpdHlAcmVkaGF0\nLmNvbT6JAjYEEwEIACACGwMGCwkIBwMCBBUCCAMEFgIDAQIeAQIXgAUCSuBJPAAK\nCRAZni+R/UMdUfIkD/9m3HWv07uJG26R3KBexTo2FFu3rmZs+m2nfW8R3dBX+k0o\nAOFpgJCsNgKwU81LOPrkMN19G0+Yn/ZTCDD7cIQ7dhYuDyEX97xh4une/EhnnRuh\nASzR+1xYbj/HcYZIL9kbslgpebMn+AhxbUTQF/mziug3hLidR9Bzvygq0Q09E11c\nOZL4BU6J2HqxL+9m2F+tnLdfhL7MsAq9nbmWAOpkbGefc5SXBSq0sWfwoes3X3yD\nQ8B5Xqr9AxABU7oUB+wRqvY69ZCxi/BhuuJCUxY89ZmwXfkVxeHl1tYfROUwOnJO\nGYSbI/o41KBK4DkIiDcT7QqvqvCyudnxZdBjL2QU6OrIJvWmKs319qSF9m3mXRSt\nZzWtB89Pj5LZ6cdtuHvW9GO4qSoBLmAfB313pGkbgi1DE6tqCLHlA0yQ8zv99OWV\ncMDGmS7tVTZqfX1xQJ0N3bNORQNtikJC3G+zBCJzIeZleeDlMDQcww00yWU1oE7/\nTo2UmykMGc7o9iggFWR2g0PIcKsA/SXdRKWPqCHG2uKHBvdRTQGupdXQ1sbV+AHw\nycyA/9H/mp/NUSNM2cqnBDcZ6GhlHt59zWtEveiuU5fpTbp4GVcFXbW8jStj8j8z\n1HI3cywZO8+YNPzqyx0JWsidXGkfzkPHyS4jTG84lfu2JG8m/nqLnRSeKpl20Q==\n=79bX\n-----END PGP PUBLIC KEY BLOCK-----\n-----BEGIN PGP PUBLIC KEY BLOCK-----\n\nmQINBGIpIp4BEAC/o5e1WzLIsS6/JOQCs4XYATYTcf6B6ALzcP05G0W3uRpUQSrL\nFRKNrU8ZCelm/B+XSh2ljJNeklp2WLxYENDOsftDXGoyLr2hEkI5OyK267IHhFNJ\ng+BN+T5Cjh4ZiiWij6o9F7x2ZpxISE9M4iI80rwSv1KOnGSw5j2zD2EwoMjTVyVE\n/t3s5XJxnDclB7ZqL+cgjv0mWUY/4+b/OoRTkhq7b8QILuZp75Y64pkrndgakm1T\n8mAGXV02mEzpNj9DyAJdUqa11PIhMJMxxHOGHJ8CcHZ2NJL2e7yJf4orTj+cMhP5\nLzJcVlaXnQYu8Zkqa0V6J1Qdj8ZXL72QsmyicRYXAtK9Jm5pvBHuYU2m6Ja7dBEB\nVkhe7lTKhAjkZC5ErPmANNS9kPdtXCOpwN1lOnmD2m04hks3kpH9OTX7RkTFUSws\neARAfRID6RLfi59B9lmAbekecnsMIFMx7qR7ZKyQb3GOuZwNYOaYFevuxusSwCHv\n4FtLDIhk+Fge+EbPdEva+VLJeMOb02gC4V/cX/oFoPkxM1A5LHjkuAM+aFLAiIRd\nNp/tAPWk1k6yc+FqkcDqOttbP4ciiXb9JPtmzTCbJD8lgH0rGp8ufyMXC9x7/dqX\nTjsiGzyvlMnrkKB4GL4DqRFl8LAR02A3846DD8CAcaxoXggL2bJCU2rgUQARAQAB\ntDVSZWQgSGF0LCBJbmMuIChhdXhpbGlhcnkga2V5IDMpIDxzZWN1cml0eUByZWRo\nYXQuY29tPokCUgQTAQgAPBYhBH5GJCWMQGU11W1vE1BU5KRaY0CzBQJiKSKeAhsD\nBQsJCAcCAyICAQYVCgkICwIEFgIDAQIeBwIXgAAKCRBQVOSkWmNAsyBfEACuTN/X\nYR+QyzeRw0pXcTvMqzNE4DKKr97hSQEwZH1/v1PEPs5O3psuVUm2iam7bqYwG+ry\nEskAgMHi8AJmY0lioQD5/LTSLTrM8UyQnU3g17DHau1NHIFTGyaW4a7xviU4C2+k\nc6X0u1CPHI1U4Q8prpNcfLsldaNYlsVZtUtYSHKPAUcswXWliW7QYjZ5tMSbu8jR\nOMOc3mZuf0fcVFNu8+XSpN7qLhRNcPv+FCNmk/wkaQfH4Pv+jVsOgHqkV3aLqJeN\nkNUnpyEKYkNqo7mNfNVWOcl+Z1KKKwSkIi3vg8maC7rODsy6IX+Y96M93sqYDQom\naaWue2gvw6thEoH4SaCrCL78mj2YFpeg1Oew4QwVcBnt68KOPfL9YyoOicNs4Vuu\nfb/vjU2ONPZAeepIKA8QxCETiryCcP43daqThvIgdbUIiWne3gae6eSj0EuUPoYe\nH5g2Lw0qdwbHIOxqp2kvN96Ii7s1DK3VyhMt/GSPCxRnDRJ8oQKJ2W/I1IT5VtiU\nzMjjq5JcYzRPzHDxfVzT9CLeU/0XQ+2OOUAiZKZ0dzSyyVn8xbpviT7iadvjlQX3\nCINaPB+d2Kxa6uFWh+ZYOLLAgZ9B8NKutUHpXN66YSfe79xFBSFWKkJ8cSIMk13/\nIfs7ApKlKCCRDpwoDqx/sjIaj1cpOfLHYjnefg==\n=UZd/\n-----END PGP PUBLIC KEY BLOCK-----"
    },
    {
      "name": "google-compute-engine",
      "baseurl": "https://packages.cloud.google.com/yum/repos/google-compute-engine-el9-x86_64-stable",
      "check_gpg": false,
      "image_type_tags": [
        "gce"
      ]
    }
  ]
}
