﻿## Interface: 30300
## Title:|cffffe00a<|r|cffff7d0aDBM|r|cffffe00a>|r |cff69ccf0World Bosses|r
## Title-ruRU:|cffffe00a<|r|cffff7d0aDBM|r|cffffe00a>|r |cff69ccf0Мировые боссы|r
## LoadOnDemand: 1
## RequiredDeps: DBM-Core
## SavedVariablesPerCharacter: DBMWorldBosses_SavedVars, DBMWorldBosses_SavedStats
## X-DBM-Mod: 1
## X-DBM-Mod-Category: WotLK
## X-DBM-Mod-Name: World Bosses
## X-DBM-Mod-Name-ruRU: Мировые боссы
## X-DBM-Mod-Sort: 151
## X-DBM-Mod-LoadZone: Tol'Garod
## X-DBM-Mod-LoadZone-ruRU: Тол'Гарод
localization.ru.lua
Norigorn.lua