<svg width="12" height="12" viewBox="0 0 12 12" fill="none" xmlns="http://www.w3.org/2000/svg">
<g id="fi-rr-align-left">
<path id="Vector" d="M0.5 3H11.5C11.6326 3 11.7598 2.94732 11.8536 2.85355C11.9473 2.75978 12 2.63261 12 2.5C12 2.36739 11.9473 2.24021 11.8536 2.14645C11.7598 2.05268 11.6326 2 11.5 2H0.5C0.367392 2 0.240215 2.05268 0.146447 2.14645C0.0526784 2.24021 0 2.36739 0 2.5C0 2.63261 0.0526784 2.75978 0.146447 2.85355C0.240215 2.94732 0.367392 3 0.5 3Z" fill="#374957"/>
<path id="Vector_2" d="M0.5 5.5H7.5C7.63261 5.5 7.75978 5.44732 7.85355 5.35355C7.94732 5.25978 8 5.13261 8 5C8 4.86739 7.94732 4.74021 7.85355 4.64645C7.75978 4.55268 7.63261 4.5 7.5 4.5H0.5C0.367392 4.5 0.240215 4.55268 0.146447 4.64645C0.0526784 4.74021 0 4.86739 0 5C0 5.13261 0.0526784 5.25978 0.146447 5.35355C0.240215 5.44732 0.367392 5.5 0.5 5.5Z" fill="#374957"/>
<path id="Vector_3" d="M7.5 9.49997H0.5C0.367392 9.49997 0.240215 9.55265 0.146447 9.64642C0.0526784 9.74019 0 9.86736 0 9.99997C0 10.1326 0.0526784 10.2598 0.146447 10.3535C0.240215 10.4473 0.367392 10.5 0.5 10.5H7.5C7.63261 10.5 7.75978 10.4473 7.85355 10.3535C7.94732 10.2598 8 10.1326 8 9.99997C8 9.86736 7.94732 9.74019 7.85355 9.64642C7.75978 9.55265 7.63261 9.49997 7.5 9.49997Z" fill="#374957"/>
<path id="Vector_4" d="M11.5 7.00003H0.5C0.367392 7.00003 0.240215 7.05271 0.146447 7.14648C0.0526784 7.24025 0 7.36742 0 7.50003C0 7.63264 0.0526784 7.75982 0.146447 7.85359C0.240215 7.94736 0.367392 8.00004 0.5 8.00004H11.5C11.6326 8.00004 11.7598 7.94736 11.8536 7.85359C11.9473 7.75982 12 7.63264 12 7.50003C12 7.36742 11.9473 7.24025 11.8536 7.14648C11.7598 7.05271 11.6326 7.00003 11.5 7.00003Z" fill="#374957"/>
</g>
</svg>
