<svg width="16" height="18" viewBox="0 0 16 18" fill="none" xmlns="http://www.w3.org/2000/svg">
<g id="Flag_alt_light">
<g id="Rectangle 1">
<path d="M1 1V11.4286H13.7349C14.2699 11.4286 14.5374 11.4286 14.5999 11.2705C14.6624 11.1123 14.4672 10.9295 14.0767 10.5637L9.47831 6.25621C9.33225 6.11939 9.25922 6.05098 9.25922 5.96429C9.25922 5.87759 9.33225 5.80918 9.47831 5.67236L14.0767 1.36491C14.4672 0.99912 14.6624 0.816226 14.5999 0.658113C14.5374 0.5 14.2699 0.5 13.7349 0.5H1.5C1.2643 0.5 1.14645 0.5 1.07322 0.573223C1 0.646447 1 0.764298 1 1Z" fill="#0BA5EC"/>
<path d="M1 11.4286V1C1 0.764298 1 0.646447 1.07322 0.573223C1.14645 0.5 1.2643 0.5 1.5 0.5H13.7349C14.2699 0.5 14.5374 0.5 14.5999 0.658113C14.6624 0.816226 14.4672 0.99912 14.0767 1.36491L9.47831 5.67236C9.33225 5.80918 9.25922 5.87759 9.25922 5.96429C9.25922 6.05098 9.33225 6.11939 9.47831 6.25621L14.0767 10.5637C14.4672 10.9295 14.6624 11.1123 14.5999 11.2705C14.5374 11.4286 14.2699 11.4286 13.7349 11.4286H1ZM1 11.4286V17.5" stroke="#0BA5EC" stroke-linecap="round"/>
</g>
</g>
</svg>
