<svg width="19" height="18" viewBox="0 0 19 18" fill="none" xmlns="http://www.w3.org/2000/svg">
<g id="Interface / Drag_Vertical">
<g id="Vector">
<path d="M10.9941 13.3913C10.9941 13.7985 11.3242 14.1285 11.7314 14.1285C12.1386 14.1285 12.4686 13.7985 12.4686 13.3913C12.4686 12.9841 12.1386 12.6541 11.7314 12.6541C11.3242 12.6541 10.9941 12.9841 10.9941 13.3913Z" stroke="#ABB2C8" stroke-width="1.47449" stroke-linecap="round" stroke-linejoin="round"/>
<path d="M6.57068 13.3913C6.57068 13.7985 6.90075 14.1285 7.30792 14.1285C7.71509 14.1285 8.04517 13.7985 8.04517 13.3913C8.04517 12.9841 7.71509 12.6541 7.30792 12.6541C6.90075 12.6541 6.57068 12.9841 6.57068 13.3913Z" stroke="#ABB2C8" stroke-width="1.47449" stroke-linecap="round" stroke-linejoin="round"/>
<path d="M10.9941 8.96783C10.9941 9.375 11.3242 9.70508 11.7314 9.70508C12.1386 9.70508 12.4686 9.375 12.4686 8.96783C12.4686 8.56067 12.1386 8.23059 11.7314 8.23059C11.3242 8.23059 10.9941 8.56067 10.9941 8.96783Z" stroke="#ABB2C8" stroke-width="1.47449" stroke-linecap="round" stroke-linejoin="round"/>
<path d="M6.57068 8.96783C6.57068 9.375 6.90075 9.70508 7.30792 9.70508C7.71509 9.70508 8.04517 9.375 8.04517 8.96783C8.04517 8.56067 7.71509 8.23059 7.30792 8.23059C6.90075 8.23059 6.57068 8.56067 6.57068 8.96783Z" stroke="#ABB2C8" stroke-width="1.47449" stroke-linecap="round" stroke-linejoin="round"/>
<path d="M10.9941 4.54437C10.9941 4.95154 11.3242 5.28162 11.7314 5.28162C12.1386 5.28162 12.4686 4.95154 12.4686 4.54437C12.4686 4.1372 12.1386 3.80713 11.7314 3.80713C11.3242 3.80713 10.9941 4.1372 10.9941 4.54437Z" stroke="#ABB2C8" stroke-width="1.47449" stroke-linecap="round" stroke-linejoin="round"/>
<path d="M6.57068 4.54437C6.57068 4.95154 6.90075 5.28162 7.30792 5.28162C7.71509 5.28162 8.04517 4.95154 8.04517 4.54437C8.04517 4.1372 7.71509 3.80713 7.30792 3.80713C6.90075 3.80713 6.57068 4.1372 6.57068 4.54437Z" stroke="#ABB2C8" stroke-width="1.47449" stroke-linecap="round" stroke-linejoin="round"/>
</g>
</g>
</svg>
