<svg width="9" height="7" viewBox="0 0 9 7" fill="none" xmlns="http://www.w3.org/2000/svg">
<path id="Vector 11" d="M4.75663 5.97827L8.47112 1.52089C8.90534 0.999826 8.53481 0.20874 7.85654 0.20874L1.27261 0.20874C0.594338 0.20874 0.223813 0.999825 0.658031 1.52089L4.37252 5.97827C4.47247 6.09821 4.65668 6.09821 4.75663 5.97827Z" fill="#FFA948"/>
</svg>
