<svg width="12" height="12" viewBox="0 0 12 12" fill="none" xmlns="http://www.w3.org/2000/svg">
<g id="fi-rr-time-half-past" clip-path="url(#clip0_121_403)">
<path id="Vector" d="M5.5 6.8615C5.34806 6.77476 5.22177 6.64939 5.13393 6.49809C5.04608 6.34679 4.99981 6.17495 4.99981 6C4.99981 5.82505 5.04608 5.65321 5.13393 5.50191C5.22177 5.35061 5.34806 5.22524 5.5 5.1385V3.5C5.5 3.36739 5.55268 3.24021 5.64645 3.14645C5.74021 3.05268 5.86739 3 6 3C6.13261 3 6.25979 3.05268 6.35355 3.14645C6.44732 3.24021 6.5 3.36739 6.5 3.5V5.1385C6.65194 5.22524 6.77823 5.35061 6.86607 5.50191C6.95392 5.65321 7.00019 5.82505 7.00019 6C7.00019 6.17495 6.95392 6.34679 6.86607 6.49809C6.77823 6.64939 6.65194 6.77476 6.5 6.8615V8C6.5 8.13261 6.44732 8.25979 6.35355 8.35355C6.25979 8.44732 6.13261 8.5 6 8.5C5.86739 8.5 5.74021 8.44732 5.64645 8.35355C5.55268 8.25979 5.5 8.13261 5.5 8V6.8615ZM6 0C5.86739 0 5.74021 0.0526784 5.64645 0.146447C5.55268 0.240215 5.5 0.367392 5.5 0.5C5.5 0.632608 5.55268 0.759785 5.64645 0.853553C5.74021 0.947322 5.86739 1 6 1C7.32608 1 8.59785 1.52678 9.53553 2.46447C10.4732 3.40215 11 4.67392 11 6C11 7.32608 10.4732 8.59785 9.53553 9.53553C8.59785 10.4732 7.32608 11 6 11C5.86739 11 5.74021 11.0527 5.64645 11.1464C5.55268 11.2402 5.5 11.3674 5.5 11.5C5.5 11.6326 5.55268 11.7598 5.64645 11.8536C5.74021 11.9473 5.86739 12 6 12C7.5913 12 9.11742 11.3679 10.2426 10.2426C11.3679 9.11742 12 7.5913 12 6C12 4.4087 11.3679 2.88258 10.2426 1.75736C9.11742 0.632141 7.5913 0 6 0V0ZM0.9135 3.392C0.81461 3.392 0.71794 3.42132 0.635715 3.47627C0.553491 3.53121 0.489404 3.6093 0.45156 3.70066C0.413717 3.79202 0.403815 3.89255 0.423108 3.98955C0.4424 4.08654 0.490021 4.17563 0.559947 4.24555C0.629873 4.31548 0.718965 4.3631 0.815955 4.38239C0.912946 4.40169 1.01348 4.39178 1.10484 4.35394C1.19621 4.3161 1.27429 4.25201 1.32924 4.16979C1.38418 4.08756 1.4135 3.99089 1.4135 3.892C1.4135 3.75939 1.36082 3.63221 1.26705 3.53845C1.17329 3.44468 1.04611 3.392 0.9135 3.392ZM1 6C1 5.90111 0.970676 5.80444 0.915735 5.72221C0.860794 5.63999 0.782705 5.5759 0.691342 5.53806C0.599979 5.50022 0.499446 5.49031 0.402455 5.50961C0.305465 5.5289 0.216373 5.57652 0.146447 5.64645C0.0765206 5.71637 0.0289002 5.80546 0.00960758 5.90245C-0.00968503 5.99945 0.000216641 6.09998 0.0380605 6.19134C0.0759043 6.2827 0.139991 6.36079 0.222215 6.41573C0.30444 6.47068 0.40111 6.5 0.5 6.5C0.632608 6.5 0.759785 6.44732 0.853554 6.35355C0.947322 6.25979 1 6.13261 1 6ZM2.1105 1.6035C2.01161 1.6035 1.91494 1.63282 1.83272 1.68777C1.75049 1.74271 1.6864 1.8208 1.64856 1.91216C1.61072 2.00352 1.60082 2.10405 1.62011 2.20105C1.6394 2.29804 1.68702 2.38713 1.75695 2.45705C1.82687 2.52698 1.91596 2.5746 2.01296 2.59389C2.10995 2.61319 2.21048 2.60328 2.30184 2.56544C2.3932 2.5276 2.47129 2.46351 2.52624 2.38129C2.58118 2.29906 2.6105 2.20239 2.6105 2.1035C2.6105 1.97089 2.55782 1.84371 2.46405 1.74995C2.37029 1.65618 2.24311 1.6035 2.1105 1.6035ZM3.8895 0.4205C3.79061 0.4205 3.69394 0.449825 3.61172 0.504765C3.52949 0.559706 3.4654 0.637795 3.42756 0.729158C3.38972 0.820521 3.37982 0.921055 3.39911 1.01805C3.4184 1.11504 3.46602 1.20413 3.53595 1.27405C3.60587 1.34398 3.69496 1.3916 3.79195 1.41089C3.88895 1.43019 3.98948 1.42028 4.08084 1.38244C4.1722 1.3446 4.25029 1.28051 4.30523 1.19829C4.36018 1.11606 4.3895 1.01939 4.3895 0.9205C4.3895 0.787892 4.33682 0.660715 4.24305 0.566947C4.14929 0.473178 4.02211 0.4205 3.8895 0.4205ZM0.9135 7.608C0.81461 7.608 0.71794 7.63732 0.635715 7.69227C0.553491 7.74721 0.489404 7.8253 0.45156 7.91666C0.413717 8.00802 0.403815 8.10855 0.423108 8.20555C0.4424 8.30254 0.490021 8.39163 0.559947 8.46155C0.629873 8.53148 0.718965 8.5791 0.815955 8.59839C0.912946 8.61769 1.01348 8.60778 1.10484 8.56994C1.19621 8.5321 1.27429 8.46801 1.32924 8.38579C1.38418 8.30356 1.4135 8.20689 1.4135 8.108C1.4135 7.97539 1.36082 7.84821 1.26705 7.75445C1.17329 7.66068 1.04611 7.608 0.9135 7.608ZM2.1105 9.3965C2.01161 9.3965 1.91494 9.42582 1.83272 9.48077C1.75049 9.53571 1.6864 9.6138 1.64856 9.70516C1.61072 9.79652 1.60082 9.89705 1.62011 9.99405C1.6394 10.091 1.68702 10.1801 1.75695 10.2501C1.82687 10.32 1.91596 10.3676 2.01296 10.3869C2.10995 10.4062 2.21048 10.3963 2.30184 10.3584C2.3932 10.3206 2.47129 10.2565 2.52624 10.1743C2.58118 10.0921 2.6105 9.99539 2.6105 9.8965C2.6105 9.76389 2.55782 9.63671 2.46405 9.54295C2.37029 9.44918 2.24311 9.3965 2.1105 9.3965ZM3.8895 10.5795C3.79061 10.5795 3.69394 10.6088 3.61172 10.6638C3.52949 10.7187 3.4654 10.7968 3.42756 10.8882C3.38972 10.9795 3.37982 11.0801 3.39911 11.177C3.4184 11.274 3.46602 11.3631 3.53595 11.4331C3.60587 11.503 3.69496 11.5506 3.79195 11.5699C3.88895 11.5892 3.98948 11.5793 4.08084 11.5414C4.1722 11.5036 4.25029 11.4395 4.30523 11.3573C4.36018 11.2751 4.3895 11.1784 4.3895 11.0795C4.3895 10.9469 4.33682 10.8197 4.24305 10.7259C4.14929 10.6322 4.02211 10.5795 3.8895 10.5795Z" fill="#374957"/>
</g>
<defs>
<clipPath id="clip0_121_403">
<rect width="12" height="12" fill="white"/>
</clipPath>
</defs>
</svg>
