<svg width="20" height="17" viewBox="0 0 20 17" fill="none" xmlns="http://www.w3.org/2000/svg">
<g id="Calendar">
<path id="Rectangle 26" d="M2.07141 6.5C2.07141 4.61438 2.07141 3.67157 2.6572 3.08579C3.24298 2.5 4.18579 2.5 6.07141 2.5H15.0714C16.957 2.5 17.8998 2.5 18.4856 3.08579C19.0714 3.67157 19.0714 4.61438 19.0714 6.5V12.5C19.0714 14.3856 19.0714 15.3284 18.4856 15.9142C17.8998 16.5 16.957 16.5 15.0714 16.5H6.07141C4.18579 16.5 3.24298 16.5 2.6572 15.9142C2.07141 15.3284 2.07141 14.3856 2.07141 12.5V6.5Z" stroke="#666666"/>
<path id="Vector 5" d="M2.07141 7.5L19.0714 7.5" stroke="#666666" stroke-linecap="round"/>
<path id="Vector 6" d="M7.07141 12.5H14.0714" stroke="#666666" stroke-linecap="round"/>
<path id="Line 3" d="M7.07141 0.5L7.07141 4.5" stroke="#666666" stroke-linecap="round"/>
<path id="Line 4" d="M14.0714 0.5L14.0714 4.5" stroke="#666666" stroke-linecap="round"/>
</g>
</svg>
