<svg width="11" height="10" viewBox="0 0 11 10" fill="none" xmlns="http://www.w3.org/2000/svg">
<path id="Vector" d="M9.35 1.57896H5.896L5.72 1.05264C5.6059 0.743816 5.39426 0.476592 5.1144 0.287991C4.83453 0.0993897 4.5003 -0.001251 4.158 1.17387e-05H1.65C1.21239 1.17387e-05 0.792709 0.166364 0.483274 0.462474C0.173839 0.758584 0 1.16019 0 1.57896V8.42105C0 8.83982 0.173839 9.24143 0.483274 9.53754C0.792709 9.83365 1.21239 10 1.65 10H9.35C9.78761 10 10.2073 9.83365 10.5167 9.53754C10.8262 9.24143 11 8.83982 11 8.42105V3.1579C11 2.73914 10.8262 2.33753 10.5167 2.04142C10.2073 1.74531 9.78761 1.57896 9.35 1.57896ZM9.9 8.42105C9.9 8.56064 9.84205 8.69451 9.73891 8.79322C9.63576 8.89192 9.49587 8.94737 9.35 8.94737H1.65C1.50413 8.94737 1.36424 8.89192 1.26109 8.79322C1.15795 8.69451 1.1 8.56064 1.1 8.42105V1.57896C1.1 1.43937 1.15795 1.3055 1.26109 1.2068C1.36424 1.10809 1.50413 1.05264 1.65 1.05264H4.158C4.2733 1.05236 4.38579 1.08676 4.47955 1.15098C4.57331 1.2152 4.6436 1.306 4.6805 1.41054L4.9775 2.27369C5.0144 2.37823 5.08469 2.46903 5.17845 2.53325C5.27221 2.59747 5.3847 2.63187 5.5 2.63159H9.35C9.49587 2.63159 9.63576 2.68704 9.73891 2.78574C9.84205 2.88444 9.9 3.01832 9.9 3.1579V8.42105Z" fill="#0BA5EC"/>
</svg>
