<svg width="14" height="15" viewBox="0 0 14 15" fill="none" xmlns="http://www.w3.org/2000/svg">
<g id="fi-rr-label" clip-path="url(#clip0_2_3063)">
<path id="Vector" d="M11.9333 3.15711L7.28358 0.573524C7.19687 0.525306 7.0993 0.5 7.00008 0.5C6.90087 0.5 6.80329 0.525306 6.71658 0.573524L2.06683 3.15711C1.79407 3.30865 1.56678 3.53037 1.40853 3.7993C1.25027 4.06822 1.16679 4.37457 1.16675 4.68661V11.5834C1.16767 12.3566 1.47526 13.098 2.02204 13.6447C2.56882 14.1915 3.31015 14.4991 4.08341 14.5H9.91675C10.69 14.4991 11.4313 14.1915 11.9781 13.6447C12.5249 13.098 12.8325 12.3566 12.8334 11.5834V4.68661C12.8334 4.37457 12.7499 4.06822 12.5916 3.7993C12.4334 3.53037 12.2061 3.30865 11.9333 3.15711ZM11.6667 11.5834C11.6667 12.0475 11.4824 12.4926 11.1542 12.8208C10.826 13.149 10.3809 13.3334 9.91675 13.3334H4.08341C3.61929 13.3334 3.17417 13.149 2.84598 12.8208C2.51779 12.4926 2.33341 12.0475 2.33341 11.5834V4.68661C2.33316 4.58226 2.36089 4.47975 2.41373 4.38977C2.46657 4.29979 2.54258 4.22563 2.63383 4.17502L7.00008 1.75069L11.3669 4.17502C11.4581 4.22571 11.5339 4.2999 11.5867 4.38988C11.6394 4.47985 11.6671 4.58232 11.6667 4.68661V11.5834Z" fill="#666666"/>
<path id="Vector_2" d="M7 5.4585C7.48325 5.4585 7.875 5.06675 7.875 4.5835C7.875 4.10025 7.48325 3.7085 7 3.7085C6.51675 3.7085 6.125 4.10025 6.125 4.5835C6.125 5.06675 6.51675 5.4585 7 5.4585Z" fill="#666666"/>
</g>
<defs>
<clipPath id="clip0_2_3063">
<rect width="14" height="14" fill="white" transform="translate(0 0.5)"/>
</clipPath>
</defs>
</svg>
