<svg width="20" height="20" viewBox="0 0 20 20" fill="none" xmlns="http://www.w3.org/2000/svg">
<g id="fi-rr-stats" clip-path="url(#clip0_47_39)">
<path id="Vector" d="M18.9011 17.9577H2.65696C2.44155 17.9577 2.23496 17.8722 2.08264 17.7199C1.93032 17.5675 1.84475 17.361 1.84475 17.1455V0.901409C1.84475 0.685999 1.75918 0.479411 1.60686 0.327093C1.45454 0.174774 1.24795 0.0892029 1.03254 0.0892029C0.817133 0.0892029 0.610545 0.174774 0.458227 0.327093C0.305908 0.479411 0.220337 0.685999 0.220337 0.901409L0.220337 17.1455C0.220337 17.7918 0.477051 18.4115 0.934006 18.8685C1.39096 19.3254 2.01072 19.5822 2.65696 19.5822H18.9011C19.1165 19.5822 19.3231 19.4966 19.4754 19.3443C19.6277 19.192 19.7133 18.9854 19.7133 18.77C19.7133 18.5545 19.6277 18.348 19.4754 18.1956C19.3231 18.0433 19.1165 17.9577 18.9011 17.9577Z" fill="#374957"/>
<path id="Vector_2" d="M12.4035 16.3338C12.6189 16.3338 12.8255 16.2483 12.9778 16.096C13.1302 15.9436 13.2157 15.7371 13.2157 15.5216V9.83619C13.2157 9.62078 13.1302 9.4142 12.9778 9.26188C12.8255 9.10956 12.6189 9.02399 12.4035 9.02399C12.1881 9.02399 11.9815 9.10956 11.8292 9.26188C11.6769 9.4142 11.5913 9.62078 11.5913 9.83619V15.5216C11.5913 15.7371 11.6769 15.9436 11.8292 16.096C11.9815 16.2483 12.1881 16.3338 12.4035 16.3338Z" fill="#374957"/>
<path id="Vector_3" d="M5.90583 16.3338C6.12124 16.3338 6.32783 16.2483 6.48015 16.096C6.63247 15.9436 6.71804 15.7371 6.71804 15.5216V9.83619C6.71804 9.62078 6.63247 9.4142 6.48015 9.26188C6.32783 9.10956 6.12124 9.02399 5.90583 9.02399C5.69042 9.02399 5.48384 9.10956 5.33152 9.26188C5.1792 9.4142 5.09363 9.62078 5.09363 9.83619V15.5216C5.09363 15.7371 5.1792 15.9436 5.33152 16.096C5.48384 16.2483 5.69042 16.3338 5.90583 16.3338Z" fill="#374957"/>
<path id="Vector_4" d="M15.6523 16.3333C15.8677 16.3333 16.0743 16.2478 16.2266 16.0954C16.3789 15.9431 16.4645 15.7365 16.4645 15.5211V5.77465C16.4645 5.55924 16.3789 5.35265 16.2266 5.20033C16.0743 5.04801 15.8677 4.96244 15.6523 4.96244C15.4369 4.96244 15.2303 5.04801 15.078 5.20033C14.9257 5.35265 14.8401 5.55924 14.8401 5.77465V15.5211C14.8401 15.7365 14.9257 15.9431 15.078 16.0954C15.2303 16.2478 15.4369 16.3333 15.6523 16.3333Z" fill="#374957"/>
<path id="Vector_5" d="M9.1545 16.3333C9.36991 16.3333 9.5765 16.2478 9.72882 16.0954C9.88114 15.9431 9.96671 15.7365 9.96671 15.5211V5.77465C9.96671 5.55924 9.88114 5.35265 9.72882 5.20033C9.5765 5.04801 9.36991 4.96244 9.1545 4.96244C8.93908 4.96244 8.7325 5.04801 8.58018 5.20033C8.42786 5.35265 8.34229 5.55924 8.34229 5.77465V15.5211C8.34229 15.7365 8.42786 15.9431 8.58018 16.0954C8.7325 16.2478 8.93908 16.3333 9.1545 16.3333Z" fill="#374957"/>
</g>
<defs>
<clipPath id="clip0_47_39">
<rect width="19.493" height="19.493" fill="white" transform="translate(0.220337 0.0892029)"/>
</clipPath>
</defs>
</svg>
