<svg width="20" height="20" viewBox="0 0 20 20" fill="none" xmlns="http://www.w3.org/2000/svg">
<g id="fi-rr-browser" clip-path="url(#clip0_47_11)">
<path id="Vector" d="M15.6523 1.0658H4.28137C3.20471 1.06709 2.17252 1.49536 1.41121 2.25667C0.649898 3.01798 0.221627 4.05017 0.220337 5.12683L0.220337 14.8733C0.221627 15.95 0.649898 16.9822 1.41121 17.7435C2.17252 18.5048 3.20471 18.9331 4.28137 18.9343H15.6523C16.7289 18.9331 17.7611 18.5048 18.5224 17.7435C19.2837 16.9822 19.712 15.95 19.7133 14.8733V5.12683C19.712 4.05017 19.2837 3.01798 18.5224 2.25667C17.7611 1.49536 16.7289 1.06709 15.6523 1.0658ZM4.28137 2.69021H15.6523C16.2985 2.69021 16.9183 2.94692 17.3752 3.40388C17.8322 3.86083 18.0889 4.4806 18.0889 5.12683V5.93903H1.84475V5.12683C1.84475 4.4806 2.10146 3.86083 2.55842 3.40388C3.01537 2.94692 3.63514 2.69021 4.28137 2.69021ZM15.6523 17.3099H4.28137C3.63514 17.3099 3.01537 17.0532 2.55842 16.5963C2.10146 16.1393 1.84475 15.5195 1.84475 14.8733V7.56345H18.0889V14.8733C18.0889 15.5195 17.8322 16.1393 17.3752 16.5963C16.9183 17.0532 16.2985 17.3099 15.6523 17.3099ZM15.6523 10.8123C15.6523 11.0277 15.5667 11.2343 15.4144 11.3866C15.2621 11.5389 15.0555 11.6245 14.8401 11.6245H5.09358C4.87817 11.6245 4.67158 11.5389 4.51926 11.3866C4.36694 11.2343 4.28137 11.0277 4.28137 10.8123C4.28137 10.5969 4.36694 10.3903 4.51926 10.238C4.67158 10.0856 4.87817 10.0001 5.09358 10.0001H14.8401C15.0555 10.0001 15.2621 10.0856 15.4144 10.238C15.5667 10.3903 15.6523 10.5969 15.6523 10.8123ZM12.4034 14.0611C12.4034 14.2765 12.3179 14.4831 12.1655 14.6354C12.0132 14.7877 11.8066 14.8733 11.5912 14.8733H5.09358C4.87817 14.8733 4.67158 14.7877 4.51926 14.6354C4.36694 14.4831 4.28137 14.2765 4.28137 14.0611C4.28137 13.8457 4.36694 13.6391 4.51926 13.4868C4.67158 13.3345 4.87817 13.2489 5.09358 13.2489H11.5912C11.8066 13.2489 12.0132 13.3345 12.1655 13.4868C12.3179 13.6391 12.4034 13.8457 12.4034 14.0611ZM2.65696 4.31462C2.65696 4.15398 2.70459 3.99695 2.79384 3.86338C2.88308 3.72982 3.00993 3.62571 3.15835 3.56424C3.30676 3.50277 3.47006 3.48668 3.62762 3.51802C3.78517 3.54936 3.92989 3.62672 4.04348 3.74031C4.15707 3.85389 4.23442 3.99862 4.26576 4.15617C4.2971 4.31372 4.28102 4.47703 4.21954 4.62544C4.15807 4.77385 4.05397 4.9007 3.9204 4.98995C3.78683 5.07919 3.6298 5.12683 3.46916 5.12683C3.25375 5.12683 3.04716 5.04126 2.89485 4.88894C2.74253 4.73662 2.65696 4.53003 2.65696 4.31462ZM5.09358 4.31462C5.09358 4.15398 5.14121 3.99695 5.23046 3.86338C5.3197 3.72982 5.44655 3.62571 5.59496 3.56424C5.74338 3.50277 5.90668 3.48668 6.06424 3.51802C6.22179 3.54936 6.36651 3.62672 6.4801 3.74031C6.59369 3.85389 6.67104 3.99862 6.70238 4.15617C6.73372 4.31372 6.71764 4.47703 6.65616 4.62544C6.59469 4.77385 6.49059 4.9007 6.35702 4.98995C6.22345 5.07919 6.06642 5.12683 5.90578 5.12683C5.69037 5.12683 5.48378 5.04126 5.33147 4.88894C5.17915 4.73662 5.09358 4.53003 5.09358 4.31462ZM7.5302 4.31462C7.5302 4.15398 7.57783 3.99695 7.66708 3.86338C7.75632 3.72982 7.88317 3.62571 8.03158 3.56424C8.18 3.50277 8.3433 3.48668 8.50086 3.51802C8.65841 3.54936 8.80313 3.62672 8.91672 3.74031C9.03031 3.85389 9.10766 3.99862 9.139 4.15617C9.17034 4.31372 9.15426 4.47703 9.09278 4.62544C9.03131 4.77385 8.92721 4.9007 8.79364 4.98995C8.66007 5.07919 8.50304 5.12683 8.3424 5.12683C8.12699 5.12683 7.9204 5.04126 7.76809 4.88894C7.61577 4.73662 7.5302 4.53003 7.5302 4.31462Z" fill="#986AAA"/>
</g>
<defs>
<clipPath id="clip0_47_11">
<rect width="19.493" height="19.493" fill="white" transform="translate(0.220337 0.253525)"/>
</clipPath>
</defs>
</svg>
