{
  "kind": "collectionType",
  "collectionName": "new_requests",
  "info": {
    "singularName": "new-request",
    "pluralName": "new-requests",
    "displayName": "New Request"
  },
  "options": {
    "draftAndPublish": true
  },
  "pluginOptions": {},
  "attributes": {}
}
