{
  "id": "italian-modules-language-pack",
  "title": "Italian Modules Language Pack",
  "description": "One translation module to rule them all!\nThe aim of this module is to include all existing Italian translations of Foundry modules in a single module.\nThis allows for simplified, unified, orderly and quick management in response to frequent updates or creation of new modules.",
  "version": "0.12",
  "compatibility": {
    "minimum": 10,
    "verified": "10.291"
  },

  "authors": [{
    "name": "Simone",
    "email": "simone.ricciardi@gmail.com",
    "discord": "Simone [UTC +1]#6710"
  }],

  "esmodules": [],
  "scripts": [
    "./main.js"
  ],
  "styles": [],
  "packs": [],

  "languages": [{
  	"lang": "it",
    "name": "Italian",
    "path": "./lang/about-time_it.json",
    "module": "about-time"
  }, {
  	"lang": "it",
    "name": "Italian",
    "path": "./lang/fxmaster_it.json",
    "module": "fxmaster"
  }, {
    "lang": "it",
    "name": "Italian",
    "path": "./lang/token-action-hud_it.json",
    "module": "token-action-hud"
  }, {
    "lang": "it",
    "name": "Italian",
    "path": "./lang/token-magic-fx_it.json",
    "module": "tokenmagic"
  }, {
    "lang": "it",
    "name": "Italian",
    "path": "./lang/curvy-walls_it.json",
    "module": "df-curvy-walls"
  }, {
    "lang": "it",
    "name": "Italian",
    "path": "./lang/monk-tokenbar_it.json",
    "module": "monks-tokenbar"
  }, {
    "lang": "it",
    "name": "Italian",
    "path": "./lang/simple-calendar_it.json",
    "module": "foundryvtt-simple-calendar"
  }, {
    "lang": "it",
    "name": "Italian",
    "path": "./lang/tidy-sheet_it.json",
    "module": "tidy5e-sheet"
  }, {
    "lang": "it",
    "name": "Italian",
    "path": "./lang/drag-ruler_it.json",
    "module": "drag-ruler"
  }, {
    "lang": "it",
    "name": "Italian",
    "path": "./lang/active-tile-triggers_it.json",
    "module": "monks-active-tiles"
  }, {
    "lang": "it",
    "name": "Italian",
    "path": "./lang/hero-creation-tool_it.json",
    "module": "hero-creation-tool"
  }, {
    "lang": "it",
    "name": "Italian",
    "path": "./lang/enhanced-combat-hud_it.json",
    "module": "enhancedcombathud"
  }, {
    "lang": "it",
    "name": "Italian",
    "path": "./lang/dynamic-active-effect_it.json",
    "module": "dae"
  }, {
    "lang": "it",
    "name": "Italian",
    "path": "./lang/midi-qol_it.json",
    "module": "midi-qol"
  }, {
    "lang": "it",
    "name": "Italian",
    "path": "./lang/quick-encounters_it.json",
    "module": "quick-encounters"
  }, {
    "lang": "it",
    "name": "Italian",
    "path": "./lang/arms-reach_it.json",
    "module": "foundryvtt-arms-reach"
  }, {
    "lang": "it",
    "name": "Italian",
    "path": "./lang/levels_it.json",
    "module": "levels"
  }, {
    "lang": "it",
    "name": "Italian",
    "path": "./lang/splatter_it.json",
    "module": "splatter"
  }, {
    "lang": "it",
    "name": "Italian",
    "path": "./lang/better-roofs_it.json",
    "module": "betterroofs"
  }, {
    "lang": "it",
    "name": "Italian",
    "path": "./lang/wall-height_it.json",
    "module": "wall-height"
  }, {
    "lang": "it",
    "name": "Italian",
    "path": "./lang/weather-blocker_it.json",
    "module": "weatherblock"
  }, {
    "lang": "it",
    "name": "Italian",
    "path": "./lang/weather-control_it.json",
    "module": "weather-control"
  }, {
    "lang": "it",
    "name": "Italian",
    "path": "./lang/automated_animations_it.json",
    "module": "autoanimations"
  }, {
    "lang": "it",
    "name": "Italian",
    "path": "./lang/tidy-settings_it.json",
    "module": "tidy-ui_game-settings"
  }, {
    "lang": "it",
    "name": "Italian",
    "path": "./lang/monks-enhanced-journal_it.json",
    "module": "monks-enhanced-journal"
  }, {
    "lang": "it",
    "name": "Italian",
    "path": "./lang/about-face_it.json",
    "module": "about-face"
  }, {
    "lang": "it",
    "name": "Italian",
    "path": "./lang/df-architect_it.json",
    "module": "df-architect"
  }, {
    "lang": "it",
    "name": "Italian",
    "path": "./lang/dice-tray_it.json",
    "module": "dice-calculator"
  }, {
    "lang": "it",
    "name": "Italian",
    "path": "./lang/item-piles_it.json",
    "module": "item-piles"
  }, {
    "lang": "it",
    "name": "Italian",
    "path": "./lang/lootsheet_it.json",
    "module": "lootsheetnpc5e"
  }, {
    "lang": "it",
    "name": "Italian",
    "path": "./lang/smalltime_it.json",
    "module": "smalltime"
  }, {
    "lang": "it",
    "name": "Italian",
    "path": "./lang/torch_it.json",
    "module": "torch"
  }, {
    "lang": "it",
    "name": "Italian",
    "path": "./lang/lock-view_it.json",
    "module": "LockView"
  }, {
    "lang": "it",
    "name": "Italian",
    "path": "./lang/rest-recovery_it.json",
    "module": "rest-recovery"
  }, {
    "lang": "it",
    "name": "Italian",
    "path": "./lang/betterrolls5e_it.json",
    "module": "betterrolls5e"
  }, {
    "lang": "it",
    "name": "Italian",
    "path": "./lang/combat-utility-belt_it.json",
    "module": "combat-utility-belt"
  }, {
    "lang": "it",
    "name": "Italian",
    "path": "./lang/multilevel-tokens_it.json",
    "module": "multilevel-tokens"
  }, {
    "lang": "it",
    "name": "Italian",
    "path": "./lang/rest-recovery_it.json",
    "module": "rest-recovery"
  }],

  "url": "https://gitlab.com/riccisi/italian-modules-language-pack",
  "manifest": "https://gitlab.com/riccisi/italian-modules-language-pack/raw/master/module/module.json",
  "download": "https://gitlab.com/riccisi/italian-modules-language-pack/-/jobs/artifacts/0.12/raw/italian-modules-language-pack.zip?job=build"
}
