{
    "project_name": "",
    "__project_name_pascal_case": "{{ cookiecutter.project_name[:1]|upper + cookiecutter.project_name[1:] if not '-' in cookiecutter.project_name and not '_' in cookiecutter.project_name and not ' ' in cookiecutter.project_name else cookiecutter.project_name|replace('-', ' ')|replace('_', ' ')|title|replace(' ', '') }}",
    "group_name": "",
    "class_name": "{{cookiecutter.__project_name_pascal_case}}",
    "package": "{{cookiecutter.group_name}}.apps.{{cookiecutter.__project_name_pascal_case|lower}}",
    "package_dir": "{{cookiecutter.package|replace('.', '/')}}",
    "_copy_without_render": [
        "*.jar",
        "gradlew",
        "gradlew.bat"
    ]
}
