{
  "tenor": {
    "urlSearch": "https://g.tenor.com/v1/search"
  },
  "youtube": {
    "urlVideo": "https://www.youtube.com/watch?v=:videoId",
    "urlApiSearch": "https://www.googleapis.com/youtube/v3/search"
  }
}
