{
   "type": "mysql",
   "host": "localhost",
   "port": 3306,
   "username": "root",
   "password": "root",
   "database": "prueba-arquitectura",
   "synchronize": true,
   "logging": false,
   "entities": [
      "src/models/**/*.ts"
   ],
   "migrations": [
      "src/models/**/*.ts"
   ]
}
