Stepper.c:5:5:Stepper	24	static
Stepper.c:35:6:step	24	static
Stepper.c:86:6:stepMotor	16	static
Stepper.c:116:5:decodePin	32	static
Stepper.c:162:6:setCoilPin	16	static
Stepper.c:187:6:inicializarLimitSwitch	8	static
Stepper.c:193:6:EINT1_IRQHandler	4	static
