%YAML 1.1
%TAG !u! tag:unity3d.com,2011:
--- !u!1045 &1
EditorBuildSettings:
  m_ObjectHideFlags: 0
  serializedVersion: 2
  m_Scenes:
  - enabled: 1
    path: Assets/Scene/Intro.unity
    guid: 1d04086f3e857c84a85879fae966cc3e
  - enabled: 1
    path: Assets/Scene/MainMenu.unity
    guid: 23c332ca9d5654049a8a23a44f48459d
  - enabled: 1
    path: Assets/Scene/Game.unity
    guid: bd0d338c0aaacb24b9b0a64a3d6b9893
  - enabled: 1
    path: Assets/Scene/Level2.unity
    guid: 87c5898f67b670e41b6f1aedcedb905b
  - enabled: 1
    path: Assets/Scene/Level3.unity
    guid: d730c3348bdf97a4da05124551c17741
  - enabled: 1
    path: Assets/Scene/Level4.unity
    guid: 40eb22bdf90b38846968c4ff7e19b02d
  m_configObjects: {}
