%YAML 1.1
%TAG !u! tag:unity3d.com,2011:
--- !u!319 &31900000
AvatarMask:
  m_ObjectHideFlags: 0
  m_CorrespondingSourceObject: {fileID: 0}
  m_PrefabInstance: {fileID: 0}
  m_PrefabAsset: {fileID: 0}
  m_Name: Tronco2
  m_Mask: 00000000010000000100000000000000000000000100000001000000010000000100000000000000000000000100000001000000
  m_Elements:
  - m_Path: 
    m_Weight: 1
  - m_Path: Ch06
    m_Weight: 1
  - m_Path: mixamorig9:Hips
    m_Weight: 0
  - m_Path: mixamorig9:Hips/mixamorig9:LeftUpLeg
    m_Weight: 0
  - m_Path: mixamorig9:Hips/mixamorig9:LeftUpLeg/mixamorig9:LeftLeg
    m_Weight: 0
  - m_Path: mixamorig9:Hips/mixamorig9:LeftUpLeg/mixamorig9:LeftLeg/mixamorig9:LeftFoot
    m_Weight: 0
  - m_Path: mixamorig9:Hips/mixamorig9:LeftUpLeg/mixamorig9:LeftLeg/mixamorig9:LeftFoot/mixamorig9:LeftToeBase
    m_Weight: 0
  - m_Path: mixamorig9:Hips/mixamorig9:LeftUpLeg/mixamorig9:LeftLeg/mixamorig9:LeftFoot/mixamorig9:LeftToeBase/mixamorig9:LeftToe_End
    m_Weight: 0
  - m_Path: mixamorig9:Hips/mixamorig9:RightUpLeg
    m_Weight: 0
  - m_Path: mixamorig9:Hips/mixamorig9:RightUpLeg/mixamorig9:RightLeg
    m_Weight: 0
  - m_Path: mixamorig9:Hips/mixamorig9:RightUpLeg/mixamorig9:RightLeg/mixamorig9:RightFoot
    m_Weight: 0
  - m_Path: mixamorig9:Hips/mixamorig9:RightUpLeg/mixamorig9:RightLeg/mixamorig9:RightFoot/mixamorig9:RightToeBase
    m_Weight: 0
  - m_Path: mixamorig9:Hips/mixamorig9:RightUpLeg/mixamorig9:RightLeg/mixamorig9:RightFoot/mixamorig9:RightToeBase/mixamorig9:RightToe_End
    m_Weight: 0
  - m_Path: mixamorig9:Hips/mixamorig9:Spine
    m_Weight: 0
  - m_Path: mixamorig9:Hips/mixamorig9:Spine/mixamorig9:Spine1
    m_Weight: 1
  - m_Path: mixamorig9:Hips/mixamorig9:Spine/mixamorig9:Spine1/mixamorig9:Spine2
    m_Weight: 1
  - m_Path: mixamorig9:Hips/mixamorig9:Spine/mixamorig9:Spine1/mixamorig9:Spine2/mixamorig9:LeftShoulder
    m_Weight: 1
  - m_Path: mixamorig9:Hips/mixamorig9:Spine/mixamorig9:Spine1/mixamorig9:Spine2/mixamorig9:LeftShoulder/mixamorig9:LeftArm
    m_Weight: 1
  - m_Path: mixamorig9:Hips/mixamorig9:Spine/mixamorig9:Spine1/mixamorig9:Spine2/mixamorig9:LeftShoulder/mixamorig9:LeftArm/mixamorig9:LeftForeArm
    m_Weight: 1
  - m_Path: mixamorig9:Hips/mixamorig9:Spine/mixamorig9:Spine1/mixamorig9:Spine2/mixamorig9:LeftShoulder/mixamorig9:LeftArm/mixamorig9:LeftForeArm/mixamorig9:LeftHand
    m_Weight: 1
  - m_Path: mixamorig9:Hips/mixamorig9:Spine/mixamorig9:Spine1/mixamorig9:Spine2/mixamorig9:LeftShoulder/mixamorig9:LeftArm/mixamorig9:LeftForeArm/mixamorig9:LeftHand/mixamorig9:LeftHandIndex1
    m_Weight: 1
  - m_Path: mixamorig9:Hips/mixamorig9:Spine/mixamorig9:Spine1/mixamorig9:Spine2/mixamorig9:LeftShoulder/mixamorig9:LeftArm/mixamorig9:LeftForeArm/mixamorig9:LeftHand/mixamorig9:LeftHandIndex1/mixamorig9:LeftHandIndex2
    m_Weight: 1
  - m_Path: mixamorig9:Hips/mixamorig9:Spine/mixamorig9:Spine1/mixamorig9:Spine2/mixamorig9:LeftShoulder/mixamorig9:LeftArm/mixamorig9:LeftForeArm/mixamorig9:LeftHand/mixamorig9:LeftHandIndex1/mixamorig9:LeftHandIndex2/mixamorig9:LeftHandIndex3
    m_Weight: 1
  - m_Path: mixamorig9:Hips/mixamorig9:Spine/mixamorig9:Spine1/mixamorig9:Spine2/mixamorig9:LeftShoulder/mixamorig9:LeftArm/mixamorig9:LeftForeArm/mixamorig9:LeftHand/mixamorig9:LeftHandIndex1/mixamorig9:LeftHandIndex2/mixamorig9:LeftHandIndex3/mixamorig9:LeftHandIndex4
    m_Weight: 1
  - m_Path: mixamorig9:Hips/mixamorig9:Spine/mixamorig9:Spine1/mixamorig9:Spine2/mixamorig9:LeftShoulder/mixamorig9:LeftArm/mixamorig9:LeftForeArm/mixamorig9:LeftHand/mixamorig9:LeftHandMiddle1
    m_Weight: 1
  - m_Path: mixamorig9:Hips/mixamorig9:Spine/mixamorig9:Spine1/mixamorig9:Spine2/mixamorig9:LeftShoulder/mixamorig9:LeftArm/mixamorig9:LeftForeArm/mixamorig9:LeftHand/mixamorig9:LeftHandMiddle1/mixamorig9:LeftHandMiddle2
    m_Weight: 1
  - m_Path: mixamorig9:Hips/mixamorig9:Spine/mixamorig9:Spine1/mixamorig9:Spine2/mixamorig9:LeftShoulder/mixamorig9:LeftArm/mixamorig9:LeftForeArm/mixamorig9:LeftHand/mixamorig9:LeftHandMiddle1/mixamorig9:LeftHandMiddle2/mixamorig9:LeftHandMiddle3
    m_Weight: 1
  - m_Path: mixamorig9:Hips/mixamorig9:Spine/mixamorig9:Spine1/mixamorig9:Spine2/mixamorig9:LeftShoulder/mixamorig9:LeftArm/mixamorig9:LeftForeArm/mixamorig9:LeftHand/mixamorig9:LeftHandMiddle1/mixamorig9:LeftHandMiddle2/mixamorig9:LeftHandMiddle3/mixamorig9:LeftHandMiddle4
    m_Weight: 1
  - m_Path: mixamorig9:Hips/mixamorig9:Spine/mixamorig9:Spine1/mixamorig9:Spine2/mixamorig9:LeftShoulder/mixamorig9:LeftArm/mixamorig9:LeftForeArm/mixamorig9:LeftHand/mixamorig9:LeftHandPinky1
    m_Weight: 1
  - m_Path: mixamorig9:Hips/mixamorig9:Spine/mixamorig9:Spine1/mixamorig9:Spine2/mixamorig9:LeftShoulder/mixamorig9:LeftArm/mixamorig9:LeftForeArm/mixamorig9:LeftHand/mixamorig9:LeftHandPinky1/mixamorig9:LeftHandPinky2
    m_Weight: 1
  - m_Path: mixamorig9:Hips/mixamorig9:Spine/mixamorig9:Spine1/mixamorig9:Spine2/mixamorig9:LeftShoulder/mixamorig9:LeftArm/mixamorig9:LeftForeArm/mixamorig9:LeftHand/mixamorig9:LeftHandPinky1/mixamorig9:LeftHandPinky2/mixamorig9:LeftHandPinky3
    m_Weight: 1
  - m_Path: mixamorig9:Hips/mixamorig9:Spine/mixamorig9:Spine1/mixamorig9:Spine2/mixamorig9:LeftShoulder/mixamorig9:LeftArm/mixamorig9:LeftForeArm/mixamorig9:LeftHand/mixamorig9:LeftHandPinky1/mixamorig9:LeftHandPinky2/mixamorig9:LeftHandPinky3/mixamorig9:LeftHandPinky4
    m_Weight: 1
  - m_Path: mixamorig9:Hips/mixamorig9:Spine/mixamorig9:Spine1/mixamorig9:Spine2/mixamorig9:LeftShoulder/mixamorig9:LeftArm/mixamorig9:LeftForeArm/mixamorig9:LeftHand/mixamorig9:LeftHandRing1
    m_Weight: 1
  - m_Path: mixamorig9:Hips/mixamorig9:Spine/mixamorig9:Spine1/mixamorig9:Spine2/mixamorig9:LeftShoulder/mixamorig9:LeftArm/mixamorig9:LeftForeArm/mixamorig9:LeftHand/mixamorig9:LeftHandRing1/mixamorig9:LeftHandRing2
    m_Weight: 1
  - m_Path: mixamorig9:Hips/mixamorig9:Spine/mixamorig9:Spine1/mixamorig9:Spine2/mixamorig9:LeftShoulder/mixamorig9:LeftArm/mixamorig9:LeftForeArm/mixamorig9:LeftHand/mixamorig9:LeftHandRing1/mixamorig9:LeftHandRing2/mixamorig9:LeftHandRing3
    m_Weight: 1
  - m_Path: mixamorig9:Hips/mixamorig9:Spine/mixamorig9:Spine1/mixamorig9:Spine2/mixamorig9:LeftShoulder/mixamorig9:LeftArm/mixamorig9:LeftForeArm/mixamorig9:LeftHand/mixamorig9:LeftHandRing1/mixamorig9:LeftHandRing2/mixamorig9:LeftHandRing3/mixamorig9:LeftHandRing4
    m_Weight: 1
  - m_Path: mixamorig9:Hips/mixamorig9:Spine/mixamorig9:Spine1/mixamorig9:Spine2/mixamorig9:LeftShoulder/mixamorig9:LeftArm/mixamorig9:LeftForeArm/mixamorig9:LeftHand/mixamorig9:LeftHandThumb1
    m_Weight: 1
  - m_Path: mixamorig9:Hips/mixamorig9:Spine/mixamorig9:Spine1/mixamorig9:Spine2/mixamorig9:LeftShoulder/mixamorig9:LeftArm/mixamorig9:LeftForeArm/mixamorig9:LeftHand/mixamorig9:LeftHandThumb1/mixamorig9:LeftHandThumb2
    m_Weight: 1
  - m_Path: mixamorig9:Hips/mixamorig9:Spine/mixamorig9:Spine1/mixamorig9:Spine2/mixamorig9:LeftShoulder/mixamorig9:LeftArm/mixamorig9:LeftForeArm/mixamorig9:LeftHand/mixamorig9:LeftHandThumb1/mixamorig9:LeftHandThumb2/mixamorig9:LeftHandThumb3
    m_Weight: 1
  - m_Path: mixamorig9:Hips/mixamorig9:Spine/mixamorig9:Spine1/mixamorig9:Spine2/mixamorig9:LeftShoulder/mixamorig9:LeftArm/mixamorig9:LeftForeArm/mixamorig9:LeftHand/mixamorig9:LeftHandThumb1/mixamorig9:LeftHandThumb2/mixamorig9:LeftHandThumb3/mixamorig9:LeftHandThumb4
    m_Weight: 1
  - m_Path: mixamorig9:Hips/mixamorig9:Spine/mixamorig9:Spine1/mixamorig9:Spine2/mixamorig9:Neck
    m_Weight: 1
  - m_Path: mixamorig9:Hips/mixamorig9:Spine/mixamorig9:Spine1/mixamorig9:Spine2/mixamorig9:Neck/mixamorig9:Head
    m_Weight: 1
  - m_Path: mixamorig9:Hips/mixamorig9:Spine/mixamorig9:Spine1/mixamorig9:Spine2/mixamorig9:Neck/mixamorig9:Head/mixamorig9:HeadTop_End
    m_Weight: 1
  - m_Path: mixamorig9:Hips/mixamorig9:Spine/mixamorig9:Spine1/mixamorig9:Spine2/mixamorig9:RightShoulder
    m_Weight: 1
  - m_Path: mixamorig9:Hips/mixamorig9:Spine/mixamorig9:Spine1/mixamorig9:Spine2/mixamorig9:RightShoulder/mixamorig9:RightArm
    m_Weight: 1
  - m_Path: mixamorig9:Hips/mixamorig9:Spine/mixamorig9:Spine1/mixamorig9:Spine2/mixamorig9:RightShoulder/mixamorig9:RightArm/mixamorig9:RightForeArm
    m_Weight: 1
  - m_Path: mixamorig9:Hips/mixamorig9:Spine/mixamorig9:Spine1/mixamorig9:Spine2/mixamorig9:RightShoulder/mixamorig9:RightArm/mixamorig9:RightForeArm/mixamorig9:RightHand
    m_Weight: 1
  - m_Path: mixamorig9:Hips/mixamorig9:Spine/mixamorig9:Spine1/mixamorig9:Spine2/mixamorig9:RightShoulder/mixamorig9:RightArm/mixamorig9:RightForeArm/mixamorig9:RightHand/mixamorig9:RightHandIndex1
    m_Weight: 1
  - m_Path: mixamorig9:Hips/mixamorig9:Spine/mixamorig9:Spine1/mixamorig9:Spine2/mixamorig9:RightShoulder/mixamorig9:RightArm/mixamorig9:RightForeArm/mixamorig9:RightHand/mixamorig9:RightHandIndex1/mixamorig9:RightHandIndex2
    m_Weight: 1
  - m_Path: mixamorig9:Hips/mixamorig9:Spine/mixamorig9:Spine1/mixamorig9:Spine2/mixamorig9:RightShoulder/mixamorig9:RightArm/mixamorig9:RightForeArm/mixamorig9:RightHand/mixamorig9:RightHandIndex1/mixamorig9:RightHandIndex2/mixamorig9:RightHandIndex3
    m_Weight: 1
  - m_Path: mixamorig9:Hips/mixamorig9:Spine/mixamorig9:Spine1/mixamorig9:Spine2/mixamorig9:RightShoulder/mixamorig9:RightArm/mixamorig9:RightForeArm/mixamorig9:RightHand/mixamorig9:RightHandIndex1/mixamorig9:RightHandIndex2/mixamorig9:RightHandIndex3/mixamorig9:RightHandIndex4
    m_Weight: 1
  - m_Path: mixamorig9:Hips/mixamorig9:Spine/mixamorig9:Spine1/mixamorig9:Spine2/mixamorig9:RightShoulder/mixamorig9:RightArm/mixamorig9:RightForeArm/mixamorig9:RightHand/mixamorig9:RightHandMiddle1
    m_Weight: 1
  - m_Path: mixamorig9:Hips/mixamorig9:Spine/mixamorig9:Spine1/mixamorig9:Spine2/mixamorig9:RightShoulder/mixamorig9:RightArm/mixamorig9:RightForeArm/mixamorig9:RightHand/mixamorig9:RightHandMiddle1/mixamorig9:RightHandMiddle2
    m_Weight: 1
  - m_Path: mixamorig9:Hips/mixamorig9:Spine/mixamorig9:Spine1/mixamorig9:Spine2/mixamorig9:RightShoulder/mixamorig9:RightArm/mixamorig9:RightForeArm/mixamorig9:RightHand/mixamorig9:RightHandMiddle1/mixamorig9:RightHandMiddle2/mixamorig9:RightHandMiddle3
    m_Weight: 1
  - m_Path: mixamorig9:Hips/mixamorig9:Spine/mixamorig9:Spine1/mixamorig9:Spine2/mixamorig9:RightShoulder/mixamorig9:RightArm/mixamorig9:RightForeArm/mixamorig9:RightHand/mixamorig9:RightHandMiddle1/mixamorig9:RightHandMiddle2/mixamorig9:RightHandMiddle3/mixamorig9:RightHandMiddle4
    m_Weight: 1
  - m_Path: mixamorig9:Hips/mixamorig9:Spine/mixamorig9:Spine1/mixamorig9:Spine2/mixamorig9:RightShoulder/mixamorig9:RightArm/mixamorig9:RightForeArm/mixamorig9:RightHand/mixamorig9:RightHandPinky1
    m_Weight: 1
  - m_Path: mixamorig9:Hips/mixamorig9:Spine/mixamorig9:Spine1/mixamorig9:Spine2/mixamorig9:RightShoulder/mixamorig9:RightArm/mixamorig9:RightForeArm/mixamorig9:RightHand/mixamorig9:RightHandPinky1/mixamorig9:RightHandPinky2
    m_Weight: 1
  - m_Path: mixamorig9:Hips/mixamorig9:Spine/mixamorig9:Spine1/mixamorig9:Spine2/mixamorig9:RightShoulder/mixamorig9:RightArm/mixamorig9:RightForeArm/mixamorig9:RightHand/mixamorig9:RightHandPinky1/mixamorig9:RightHandPinky2/mixamorig9:RightHandPinky3
    m_Weight: 1
  - m_Path: mixamorig9:Hips/mixamorig9:Spine/mixamorig9:Spine1/mixamorig9:Spine2/mixamorig9:RightShoulder/mixamorig9:RightArm/mixamorig9:RightForeArm/mixamorig9:RightHand/mixamorig9:RightHandPinky1/mixamorig9:RightHandPinky2/mixamorig9:RightHandPinky3/mixamorig9:RightHandPinky4
    m_Weight: 1
  - m_Path: mixamorig9:Hips/mixamorig9:Spine/mixamorig9:Spine1/mixamorig9:Spine2/mixamorig9:RightShoulder/mixamorig9:RightArm/mixamorig9:RightForeArm/mixamorig9:RightHand/mixamorig9:RightHandRing1
    m_Weight: 1
  - m_Path: mixamorig9:Hips/mixamorig9:Spine/mixamorig9:Spine1/mixamorig9:Spine2/mixamorig9:RightShoulder/mixamorig9:RightArm/mixamorig9:RightForeArm/mixamorig9:RightHand/mixamorig9:RightHandRing1/mixamorig9:RightHandRing2
    m_Weight: 1
  - m_Path: mixamorig9:Hips/mixamorig9:Spine/mixamorig9:Spine1/mixamorig9:Spine2/mixamorig9:RightShoulder/mixamorig9:RightArm/mixamorig9:RightForeArm/mixamorig9:RightHand/mixamorig9:RightHandRing1/mixamorig9:RightHandRing2/mixamorig9:RightHandRing3
    m_Weight: 1
  - m_Path: mixamorig9:Hips/mixamorig9:Spine/mixamorig9:Spine1/mixamorig9:Spine2/mixamorig9:RightShoulder/mixamorig9:RightArm/mixamorig9:RightForeArm/mixamorig9:RightHand/mixamorig9:RightHandRing1/mixamorig9:RightHandRing2/mixamorig9:RightHandRing3/mixamorig9:RightHandRing4
    m_Weight: 1
  - m_Path: mixamorig9:Hips/mixamorig9:Spine/mixamorig9:Spine1/mixamorig9:Spine2/mixamorig9:RightShoulder/mixamorig9:RightArm/mixamorig9:RightForeArm/mixamorig9:RightHand/mixamorig9:RightHandThumb1
    m_Weight: 1
  - m_Path: mixamorig9:Hips/mixamorig9:Spine/mixamorig9:Spine1/mixamorig9:Spine2/mixamorig9:RightShoulder/mixamorig9:RightArm/mixamorig9:RightForeArm/mixamorig9:RightHand/mixamorig9:RightHandThumb1/mixamorig9:RightHandThumb2
    m_Weight: 1
  - m_Path: mixamorig9:Hips/mixamorig9:Spine/mixamorig9:Spine1/mixamorig9:Spine2/mixamorig9:RightShoulder/mixamorig9:RightArm/mixamorig9:RightForeArm/mixamorig9:RightHand/mixamorig9:RightHandThumb1/mixamorig9:RightHandThumb2/mixamorig9:RightHandThumb3
    m_Weight: 1
  - m_Path: mixamorig9:Hips/mixamorig9:Spine/mixamorig9:Spine1/mixamorig9:Spine2/mixamorig9:RightShoulder/mixamorig9:RightArm/mixamorig9:RightForeArm/mixamorig9:RightHand/mixamorig9:RightHandThumb1/mixamorig9:RightHandThumb2/mixamorig9:RightHandThumb3/mixamorig9:RightHandThumb4
    m_Weight: 1
