<svg width="21" height="17" viewBox="0 0 21 17" fill="none" xmlns="http://www.w3.org/2000/svg">
<path d="M9.90756 10.2C9.16387 10.2 8.53172 9.9375 8.01114 9.4125C7.49055 8.8875 7.23025 8.25 7.23025 7.5C7.23025 6.75 7.49055 6.1125 8.01114 5.5875C8.53172 5.0625 9.16387 4.8 9.90756 4.8C10.6513 4.8 11.2834 5.0625 11.804 5.5875C12.3246 6.1125 12.5849 6.75 12.5849 7.5C12.5849 8.25 12.3246 8.8875 11.804 9.4125C11.2834 9.9375 10.6513 10.2 9.90756 10.2ZM9.90756 15C7.49468 15 5.29664 14.3208 3.31345 12.9625C1.33025 11.6042 -0.107563 9.78333 -1 7.5C-0.107563 5.21667 1.33025 3.39583 3.31345 2.0375C5.29664 0.679167 7.49468 0 9.90756 0C12.2378 0 14.3656 0.633333 16.291 1.9C18.2163 3.16667 19.6583 4.86667 20.6168 7H18.3609C17.5015 5.45 16.3199 4.22917 14.816 3.3375C13.312 2.44583 11.6759 2 9.90756 2C8.04006 2 6.32542 2.49583 4.76366 3.4875C3.20189 4.47917 2.00784 5.81667 1.18151 7.5C2.00784 9.18333 3.20189 10.5208 4.76366 11.5125C6.32542 12.5042 8.04006 13 9.90756 13C10.2381 13 10.5686 12.9833 10.8992 12.95C11.2297 12.9167 11.5602 12.8667 11.8908 12.8V14.825C11.5602 14.875 11.2297 14.9167 10.8992 14.95C10.5686 14.9833 10.2381 15 9.90756 15ZM9.90756 12C10.2711 12 10.6223 11.9583 10.9611 11.875C11.2999 11.7917 11.6181 11.675 11.9155 11.525C11.9982 10.6917 12.2585 9.94167 12.6964 9.275C13.1344 8.60833 13.6922 8.075 14.3697 7.675V7.5C14.3697 6.25 13.9359 5.1875 13.0683 4.3125C12.2006 3.4375 11.1471 3 9.90756 3C8.66807 3 7.6145 3.4375 6.74685 4.3125C5.8792 5.1875 5.44538 6.25 5.44538 7.5C5.44538 8.75 5.8792 9.8125 6.74685 10.6875C7.6145 11.5625 8.66807 12 9.90756 12ZM14.8655 17C14.5846 17 14.3491 16.9042 14.159 16.7125C13.969 16.5208 13.874 16.2833 13.874 16V13C13.874 12.7167 13.969 12.4792 14.159 12.2875C14.3491 12.0958 14.5846 12 14.8655 12V11C14.8655 10.45 15.0597 9.97917 15.4481 9.5875C15.8365 9.19583 16.3034 9 16.8487 9C17.3941 9 17.861 9.19583 18.2494 9.5875C18.6377 9.97917 18.8319 10.45 18.8319 11V12C19.1129 12 19.3484 12.0958 19.5384 12.2875C19.7285 12.4792 19.8235 12.7167 19.8235 13V16C19.8235 16.2833 19.7285 16.5208 19.5384 16.7125C19.3484 16.9042 19.1129 17 18.8319 17H14.8655ZM15.8571 12H17.8403V11C17.8403 10.7167 17.7453 10.4792 17.5553 10.2875C17.3652 10.0958 17.1297 10 16.8487 10C16.5678 10 16.3323 10.0958 16.1422 10.2875C15.9522 10.4792 15.8571 10.7167 15.8571 11V12Z" fill="#CDC5C5"/>
</svg>
