<svg width="24" height="24" viewBox="0 0 24 24" fill="none" xmlns="http://www.w3.org/2000/svg">
<g id="move_item">
<mask id="mask0_2189_137" style="mask-type:alpha" maskUnits="userSpaceOnUse" x="0" y="0" width="24" height="24">
<rect id="Bounding box" x="24" y="24" width="24" height="24" rx="12" transform="rotate(-180 24 24)" fill="#D9D9D9"/>
</mask>
<g mask="url(#mask0_2189_137)">
<path id="move_item_2" d="M4.95173 10.8465C4.54496 11.2537 4.83339 11.9495 5.40898 11.9495L14.9989 11.9495C15.5518 11.9495 16 12.3977 16 12.9506C16 13.5035 15.5518 13.9518 14.9989 13.9518L5.40898 13.9518C4.83339 13.9518 4.54496 14.6475 4.95173 15.0548C5.20065 15.304 5.20418 15.7066 4.95967 15.9601L4.71308 16.2158C4.32143 16.6219 3.67277 16.6276 3.27406 16.2284L1.98017 14.9331C0.886185 13.8378 0.886185 12.0634 1.98017 10.9682L3.27406 9.67282C3.67277 9.27365 4.32143 9.27934 4.71308 9.68544L4.95967 9.94113C5.20418 10.1947 5.20065 10.5973 4.95173 10.8465ZM8 15.9541C8.55229 15.9541 9 16.4018 9 16.9541V17.9564C9 19.0622 9.89646 19.9586 11.0023 19.9586H14C16.7614 19.9586 19 17.7201 19 14.9586V10.9426C19 8.18119 16.7614 5.94261 14 5.94261H11.0023C9.89646 5.94261 9 6.83907 9 7.9449V8.94719C9 9.49948 8.55229 9.94719 8 9.94719C7.44771 9.94719 7 9.49948 7 8.94719V5.94261C7 5.39198 7.19583 4.92061 7.5875 4.52849C7.97917 4.13638 8.45 3.94032 9 3.94032H19C19.55 3.94032 20.0208 4.13638 20.4125 4.52849C20.8042 4.92061 21 5.39198 21 5.94261L21 19.9586C21 20.5093 20.8042 20.9806 20.4125 21.3728C20.0208 21.7649 19.55 21.9609 19 21.9609H9C8.45 21.9609 7.97917 21.7649 7.5875 21.3728C7.19583 20.9806 7 20.5093 7 19.9586V16.9541C7 16.4018 7.44771 15.9541 8 15.9541Z" fill="white"/>
</g>
</g>
</svg>
