<svg width="20" height="19" viewBox="0 0 20 19" fill="none" xmlns="http://www.w3.org/2000/svg">
<path d="M3.95173 7.84661C3.54496 8.25385 3.83339 8.9496 4.40898 8.9496L13.9989 8.9496C14.5518 8.9496 15 9.39783 15 9.95075C15 10.5037 14.5518 10.9519 13.9989 10.9519L4.40898 10.9519C3.83339 10.9519 3.54496 11.6477 3.95173 12.0549C4.20065 12.3041 4.20418 12.7067 3.95967 12.9602L3.71308 13.2159C3.32143 13.622 2.67277 13.6277 2.27406 13.2286L0.980167 11.9332C-0.113815 10.8379 -0.113815 9.06355 0.980167 7.96831L2.27406 6.67294C2.67277 6.27377 3.32143 6.27946 3.71308 6.68556L3.95967 6.94125C4.20418 7.19478 4.20065 7.59741 3.95173 7.84661ZM7 12.9542C7.55229 12.9542 8 13.4019 8 13.9542V14.9565C8 16.0623 8.89646 16.9588 10.0023 16.9588H13C15.7614 16.9588 18 14.7202 18 11.9588V7.94274C18 5.18131 15.7614 2.94273 13 2.94273H10.0023C8.89646 2.94273 8 3.83919 8 4.94502V5.94731C8 6.4996 7.55229 6.94731 7 6.94731C6.44771 6.94731 6 6.4996 6 5.94731V2.94273C6 2.3921 6.19583 1.92073 6.5875 1.52861C6.97917 1.1365 7.45 0.940441 8 0.940441H18C18.55 0.940441 19.0208 1.1365 19.4125 1.52861C19.8042 1.92073 20 2.3921 20 2.94273L20 16.9588C20 17.5094 19.8042 17.9808 19.4125 18.3729C19.0208 18.765 18.55 18.9611 18 18.9611H8C7.45 18.9611 6.97917 18.765 6.5875 18.3729C6.19583 17.9808 6 17.5094 6 16.9588V13.9542C6 13.4019 6.44771 12.9542 7 12.9542Z" fill="white"/>
</svg>
