[
  {
    "id": 1,
    "firstName": "Emran",
    "LastName": "Khan",
    "address": "Sector 18, Uttara, Dhaka",
    "dob": "1997-12-30", 
    "salary": 50000,
    "position": "Developer",
    "joiningAge": 3
  },
  {
    "id": 2,
    "firstName": "Shamim",
    "LastName": "Hossain",
    "address": "Kakrail, Motijil, Dhaka",
    "dob": "1989-06-24", 
    "salary": 150000,
    "position": "Sr. Developer",
    "joiningAge": 4
  },
  {
    "id": 3,
    "firstName": "Ahsan",
    "LastName": "Ullah",
    "address": "Kakrail, Motijil, Dhaka",
    "dob": "1990-06-12", 
    "salary": 120000,
    "position": "Sr. Developer",
    "joiningAge": 4
  },
  {
    "id": 4,
    "firstName": "Shibli",
    "LastName": "Sharkar",
    "address": "Badda, Motijil, Dhaka",
    "dob": "1992-08-13", 
    "salary": 100000,
    "position": "QA",
    "joiningAge": 1
  },
  {
    "id": 5,
    "firstName": "Sajol",
    "LastName": "Sharkar",
    "address": "Mohakhali, Motijil, Dhaka",
    "dob": "1993-08-03", 
    "salary": 34000,
    "position": "Jr. Developer",
    "joiningAge": 1
  },
  {
    "id": 6,
    "firstName": "Rakib",
    "LastName": "Hasan",
    "address": "Demra, Demra, Dhaka",
    "dob": "1992-08-03", 
    "salary": 110000,
    "position": "Developer",
    "joiningAge": 2
  },
  {
    "id": 7,
    "firstName": "Rocky",
    "LastName": "Hasan",
    "address": "Uttara sector 10, Uttara, Dhaka",
    "dob": "1996-08-03", 
    "salary": 55000,
    "position": "Developer",
    "joiningAge": 2
  },
  {
    "id": 8,
    "firstName": "Fateha",
    "LastName": "Israt",
    "address": "Gazipur, Dhaka, Dhaka",
    "dob": "1996-02-03", 
    "salary": 80000,
    "position": "Developer",
    "joiningAge": 3
  },
  {
    "id": 9,
    "firstName": "Imran",
    "LastName": "Hasan",
    "address": "Savar, Dhaka, Dhaka",
    "dob": "1990-02-24", 
    "salary": 80000,
    "position": "Developer",
    "joiningAge": 1
  },
  {
    "id": 10,
    "firstName": "Zawad",
    "LastName": "Hossain",
    "address": "Mohammadpur, Dhaka, Dhaka",
    "dob": "1996-02-24", 
    "salary": 70000,
    "position": "Developer",
    "joiningAge": 2
  },
  {
    "id": 11,
    "firstName": "Sohan",
    "LastName": "Hossain",
    "address": "Dhanmondi, Dhaka, Dhaka",
    "dob": "1995-02-24", 
    "salary": 100000,
    "position": "Developer",
    "joiningAge": 3
  },
  {
    "id": 12,
    "firstName": "Akash",
    "LastName": "QA",
    "address": "Puran dhaka, Dhaka, Dhaka",
    "dob": "1995-02-24", 
    "salary": 80000,
    "position": "QA",
    "joiningAge": 1
  },
  {
    "id": 13,
    "firstName": "Anupam",
    "LastName": "Ray",
    "address": "Puran dhaka, Dhaka, Dhaka",
    "dob": "1990-02-24", 
    "salary": 150000,
    "position": "Developer",
    "joiningAge": 4
  },
  {
    "id": 14,
    "firstName": "Sabbir",
    "LastName": "Hossain",
    "address": "Puran dhaka, Dhaka, Dhaka",
    "dob": "1991-02-24", 
    "salary": 180000,
    "position": "Developer",
    "joiningAge": 4
  },
  {
    "id": 15,
    "firstName": "Sumon",
    "LastName": "Vai",
    "address": "Puran dhaka, Dhaka, Dhaka",
    "dob": "1993-04-24", 
    "salary": 100000,
    "position": "Developer",
    "joiningAge": 1
  },
  {
    "id": 16,
    "firstName": "Sankor",
    "LastName": "Daa",
    "address": "Puran dhaka, Dhaka, Dhaka",
    "dob": "1980-04-24", 
    "salary": 20000,
    "position": "Clener",
    "joiningAge": 4
  }
]