{
  "info" : {
    "version" : 1,
    "author" : "xcode"
  },
  "colors" : [
    {
      "idiom" : "universal",
      "color" : {
        "color-space" : "srgb",
        "components" : {
          "red" : "0.341",
          "alpha" : "0.500",
          "blue" : "0.341",
          "green" : "0.341"
        }
      }
    },
    {
      "idiom" : "universal",
      "appearances" : [
        {
          "appearance" : "luminosity",
          "value" : "dark"
        }
      ],
      "color" : {
        "color-space" : "srgb",
        "components" : {
          "red" : "0xFF",
          "alpha" : "0.800",
          "blue" : "0x00",
          "green" : "0xA5"
        }
      }
    }
  ]
}