{
  "fallback": "en",
  "langs": {
    "en": {
      "demand.private_created": " The channel \"%[channel_name]\" has been created for you. You have been moved there.",
      "demand.private_created.pw": "The channel \"%[channel_name]\" has been created for you. You have been moved there and the password is: %[channel_password]",
      "demand.private_moved_to": "You have been moved to your private channel.",
      "demand.not_allowed": "You are not allowed to demand channels for the set: %[set_name]!"
    },
    "de": {
      "demand.private_created": "Der Channel \"%[channel_name]\" wurde für dich erstellt und du wurdest dorthin verschoben.",
      "demand.private_created.pw": "Der Channel \"%[channel_name]\" wurde für dich erstellt und du wurdest dorthin verschoben. Das Passwort lautet: %[channel_password]",
      "demand.private_moved_to": "Du wurdest in deinen privaten Channel verschoben.",
      "demand.not_allowed": "Du darfst keine privaten channel für das Set \"%[set_name]\" anfordern!"
    }
  }
}