{
  "channels": {

    "1": {
      "groups": [],
      "priority": 3
    },

    "2": {
      "groups": [1, 2, 3],
      "priority": 1
    }

  },

  "channel_blacklist": [1,2],
  "channel_whitelist": [],

  "idle_times": {
    "default": 300,
    "1": -1,
    "30": 30
  },

  "output_muted_divisor": 2,
  "both_muted_divisor": 10,
  "idle_warn_time": 120
}