%YAML 1.1
%TAG !u! tag:unity3d.com,2011:
--- !u!114 &11400000
MonoBehaviour:
  m_ObjectHideFlags: 0
  m_CorrespondingSourceObject: {fileID: 0}
  m_PrefabInstance: {fileID: 0}
  m_PrefabAsset: {fileID: 0}
  m_GameObject: {fileID: 0}
  m_Enabled: 1
  m_EditorHideFlags: 0
  m_Script: {fileID: 11500000, guid: 25fd4846d968cad428ea27b8d262d557, type: 3}
  m_Name: GameConfigAsset
  m_EditorClassIdentifier: 
  _scoreDatas:
  - id: {fileID: 11400000, guid: 0ae8fa6f6de8904468c69b8c874aebb6, type: 2}
    score: 10
  - id: {fileID: 11400000, guid: 32935c90289165a4b99b66ebd279ff5b, type: 2}
    score: 10
  - id: {fileID: 11400000, guid: 08fa375c4091da741ab5b159e3328e8d, type: 2}
    score: 10
  - id: {fileID: 11400000, guid: e8d48cd36e6851a40b6541f2095816ad, type: 2}
    score: 15
  - id: {fileID: 11400000, guid: 80d5b772b8122b34fa9afefedc61e025, type: 2}
    score: 20
  - id: {fileID: 11400000, guid: c1b47e726133d1b4c95ab0086df568d4, type: 2}
    score: 20
  _avatarMaxHealth: 100
  _avatarRespawnTime: 2
  _avatarInvulnerabilityTime: 3
  _startLives: 3
  _mockLoadingTimes: 0
