%YAML 1.1
%TAG !u! tag:unity3d.com,2011:
--- !u!114 &11400000
MonoBehaviour:
  m_ObjectHideFlags: 0
  m_CorrespondingSourceObject: {fileID: 0}
  m_PrefabInstance: {fileID: 0}
  m_PrefabAsset: {fileID: 0}
  m_GameObject: {fileID: 0}
  m_Enabled: 1
  m_EditorHideFlags: 0
  m_Script: {fileID: 11500000, guid: 07de192263e694e44b6b2539d26574da, type: 3}
  m_Name: TimeAttack Level Asset
  m_EditorClassIdentifier: 
  _gameMode: 1
  _cameraFillColor: {r: 0, g: 0.16862746, b: 0.19215687, a: 1}
  _backgroundPrefab:
    m_AssetGUID: 29f2fc558158e20468c8f11cb52a90e1
    m_SubObjectName: 
  _levelDatas:
  - type: 0
    enabled: 1
    timeBefore: 4
    waveCount: 5
    enemyId: {fileID: 11400000, guid: 0ae8fa6f6de8904468c69b8c874aebb6, type: 2}
    spawnOffset: {x: -18, y: 0}
    betweenTime: 0.4
    text: 
  - type: 0
    enabled: 1
    timeBefore: 4
    waveCount: 5
    enemyId: {fileID: 11400000, guid: 32935c90289165a4b99b66ebd279ff5b, type: 2}
    spawnOffset: {x: 18, y: 0}
    betweenTime: 0.4
    text: 
  - type: 0
    enabled: 1
    timeBefore: 4
    waveCount: 5
    enemyId: {fileID: 11400000, guid: 08fa375c4091da741ab5b159e3328e8d, type: 2}
    spawnOffset: {x: 5, y: 0}
    betweenTime: 0.75
    text: 
  - type: 0
    enabled: 1
    timeBefore: 4
    waveCount: 5
    enemyId: {fileID: 11400000, guid: 08fa375c4091da741ab5b159e3328e8d, type: 2}
    spawnOffset: {x: -5, y: 0}
    betweenTime: 0.75
    text: 
  - type: 0
    enabled: 1
    timeBefore: 4
    waveCount: 3
    enemyId: {fileID: 11400000, guid: e8d48cd36e6851a40b6541f2095816ad, type: 2}
    spawnOffset: {x: -5, y: 0}
    betweenTime: 0.75
    text: 
  - type: 0
    enabled: 1
    timeBefore: 4
    waveCount: 5
    enemyId: {fileID: 11400000, guid: c1b47e726133d1b4c95ab0086df568d4, type: 2}
    spawnOffset: {x: 5, y: 0}
    betweenTime: 0.75
    text: 
  _time: 60
