{
    "name": "PlayerInputActions",
    "maps": [
        {
            "name": "Gameplay",
            "id": "4cf27428-78ab-484e-af8c-62f67e93b559",
            "actions": [
                {
                    "name": "Horizontal",
                    "type": "Value",
                    "id": "83c39a3d-4edb-4ef9-bc66-10ef5a96f6d7",
                    "expectedControlType": "Axis",
                    "processors": "",
                    "interactions": "",
                    "initialStateCheck": true
                },
                {
                    "name": "Vertical",
                    "type": "Value",
                    "id": "fa8e07a4-bbdb-46af-9ef0-85b818f8cd1f",
                    "expectedControlType": "Axis",
                    "processors": "",
                    "interactions": "",
                    "initialStateCheck": true
                },
                {
                    "name": "Fire",
                    "type": "Button",
                    "id": "c4bf7677-ae14-4a22-a692-67337ec635a9",
                    "expectedControlType": "Button",
                    "processors": "",
                    "interactions": "",
                    "initialStateCheck": false
                },
                {
                    "name": "Pause",
                    "type": "Button",
                    "id": "c87ce7d7-3bd2-4a84-a596-075b0a766af2",
                    "expectedControlType": "Button",
                    "processors": "",
                    "interactions": "",
                    "initialStateCheck": false
                }
            ],
            "bindings": [
                {
                    "name": "1D Axis",
                    "id": "196920bf-9c9a-42b1-99b9-a86103b90e49",
                    "path": "1DAxis",
                    "interactions": "",
                    "processors": "",
                    "groups": "",
                    "action": "Horizontal",
                    "isComposite": true,
                    "isPartOfComposite": false
                },
                {
                    "name": "negative",
                    "id": "b359de5f-ad9f-4bc8-a4b1-684ae9c2be31",
                    "path": "<Keyboard>/a",
                    "interactions": "",
                    "processors": "",
                    "groups": "",
                    "action": "Horizontal",
                    "isComposite": false,
                    "isPartOfComposite": true
                },
                {
                    "name": "positive",
                    "id": "61a4eea2-765e-4974-bf50-9c7f0ca8725c",
                    "path": "<Keyboard>/d",
                    "interactions": "",
                    "processors": "",
                    "groups": "",
                    "action": "Horizontal",
                    "isComposite": false,
                    "isPartOfComposite": true
                },
                {
                    "name": "1D Axis",
                    "id": "3c4977ad-97ea-4d9b-a504-9920477ab8b7",
                    "path": "1DAxis",
                    "interactions": "",
                    "processors": "",
                    "groups": "Common",
                    "action": "Vertical",
                    "isComposite": true,
                    "isPartOfComposite": false
                },
                {
                    "name": "negative",
                    "id": "e211a7e0-7d5a-497b-8525-8b33c6384c32",
                    "path": "<Keyboard>/s",
                    "interactions": "",
                    "processors": "",
                    "groups": "",
                    "action": "Vertical",
                    "isComposite": false,
                    "isPartOfComposite": true
                },
                {
                    "name": "positive",
                    "id": "a161ebc4-6d8f-4034-b6bb-3bfc746ba322",
                    "path": "<Keyboard>/w",
                    "interactions": "",
                    "processors": "",
                    "groups": "",
                    "action": "Vertical",
                    "isComposite": false,
                    "isPartOfComposite": true
                },
                {
                    "name": "",
                    "id": "8d628178-6191-4e5c-a032-4a7a383ad32e",
                    "path": "<Keyboard>/space",
                    "interactions": "",
                    "processors": "",
                    "groups": "",
                    "action": "Fire",
                    "isComposite": false,
                    "isPartOfComposite": false
                },
                {
                    "name": "",
                    "id": "a0bb033b-bc91-43ba-bc80-74ccdf302799",
                    "path": "<Keyboard>/escape",
                    "interactions": "",
                    "processors": "",
                    "groups": "",
                    "action": "Pause",
                    "isComposite": false,
                    "isPartOfComposite": false
                }
            ]
        }
    ],
    "controlSchemes": [
        {
            "name": "Common",
            "bindingGroup": "Common",
            "devices": [
                {
                    "devicePath": "<Keyboard>",
                    "isOptional": false,
                    "isOR": false
                },
                {
                    "devicePath": "<Gamepad>",
                    "isOptional": true,
                    "isOR": false
                },
                {
                    "devicePath": "<Joystick>",
                    "isOptional": true,
                    "isOR": false
                },
                {
                    "devicePath": "<AndroidJoystick>",
                    "isOptional": true,
                    "isOR": false
                },
                {
                    "devicePath": "<AndroidGamepad>",
                    "isOptional": true,
                    "isOR": false
                }
            ]
        }
    ]
}