{
    "name": "com.fdt.pools",
    "references": [
        "GUID:14fd48a6296214d6395ca1e0a0594c07"
    ],
    "includePlatforms": [],
    "excludePlatforms": [],
    "allowUnsafeCode": false,
    "overrideReferences": false,
    "precompiledReferences": [],
    "autoReferenced": true,
    "defineConstraints": [],
    "versionDefines": [],
    "noEngineReferences": false
}