{
    "name": "com.fdt.pools.loadedaddressables",
    "references": [
        "com.fdt.pools",
        "Unity.Addressables",
        "Unity.ResourceManager"
    ],
    "includePlatforms": [],
    "excludePlatforms": [],
    "allowUnsafeCode": false,
    "overrideReferences": false,
    "precompiledReferences": [],
    "autoReferenced": true,
    "defineConstraints": [],
    "versionDefines": [],
    "noEngineReferences": false
}