%YAML 1.1
%TAG !u! tag:unity3d.com,2011:
--- !u!114 &11400000
MonoBehaviour:
  m_ObjectHideFlags: 0
  m_CorrespondingSourceObject: {fileID: 0}
  m_PrefabInstance: {fileID: 0}
  m_PrefabAsset: {fileID: 0}
  m_GameObject: {fileID: 0}
  m_Enabled: 1
  m_EditorHideFlags: 0
  m_Script: {fileID: 11500000, guid: a3d59324d76541745b649a8501f47d15, type: 3}
  m_Name: AvatarWeapon0
  m_EditorClassIdentifier: 
  _weaponDatas:
  - bulletDatas:
    - bullet: {fileID: 11400000, guid: bd018ea7e7694aa4ab3019e9ef7cf8dd, type: 2}
      setMovement: 1
      angle: 0
      offset: {x: -0.6, y: 1.5}
    - bullet: {fileID: 11400000, guid: bd018ea7e7694aa4ab3019e9ef7cf8dd, type: 2}
      setMovement: 1
      angle: 0
      offset: {x: 0.6, y: 1.5}
    cooldown: 0.25
