%YAML 1.1
%TAG !u! tag:unity3d.com,2011:
--- !u!1045 &1
EditorBuildSettings:
  m_ObjectHideFlags: 0
  serializedVersion: 2
  m_Scenes:
  - enabled: 1
    path: Assets/Game/Runtime/Data/Scenes/Entrypoint.unity
    guid: 4735cdd133083c443b001acb8d40c767
  - enabled: 1
    path: Assets/Game/Runtime/Data/Scenes/TitleScene.unity
    guid: 8eafe804b6a31e04688473edf2f89e66
  - enabled: 1
    path: Assets/Game/Runtime/Data/Scenes/GameplayScene.unity
    guid: 2cda990e2423bbf4892e6590ba056729
  - enabled: 1
    path: Assets/Game/Runtime/Data/Scenes/LoadingScene.unity
    guid: 4ea70b9216951c84ab754411a1a00e91
  m_configObjects:
    com.unity.addressableassets: {fileID: 11400000, guid: e006c37653df55440bd5c497c4f76e0b,
      type: 2}
