%YAML 1.1
%TAG !u! tag:unity3d.com,2011:
--- !u!114 &11400000
MonoBehaviour:
  m_ObjectHideFlags: 0
  m_CorrespondingSourceObject: {fileID: 0}
  m_PrefabInstance: {fileID: 0}
  m_PrefabAsset: {fileID: 0}
  m_GameObject: {fileID: 0}
  m_Enabled: 1
  m_EditorHideFlags: 0
  m_Script: {fileID: 11500000, guid: d9ee32e6f0cf1244ba09cf095be19cbe, type: 3}
  m_Name: LeoFSMAsset
  m_EditorClassIdentifier: 
  _health: 100
  _fsm:
    States:
    - _stateID: Idle
      _animation:
        id: 0
      _canFlip: 1
      _runSpeed: 0
      _stateType:
        id: 1
      _startActions: []
      _updateActions: []
      _endActions: []
      _stateConditions:
      - id: 2
      - id: 3
      - id: 4
      - id: 5
      - id: 6
      - id: 7
    - _stateID: Walk
      _animation:
        id: 8
      _canFlip: 1
      _runSpeed: 3
      _stateType:
        id: 9
      _startActions: []
      _updateActions: []
      _endActions: []
      _stateConditions:
      - id: 10
      - id: 11
      - id: 12
      - id: 13
      - id: 14
      - id: 15
    - _stateID: Jump
      _animation:
        id: 16
      _canFlip: 1
      _runSpeed: 3
      _stateType:
        id: 17
      _startActions:
      - id: 18
      _updateActions: []
      _endActions: []
      _stateConditions:
      - id: 19
      - id: 20
      - id: 21
      - id: 22
    - _stateID: Fall
      _animation:
        id: 23
      _canFlip: 1
      _runSpeed: 3
      _stateType:
        id: 24
      _startActions: []
      _updateActions: []
      _endActions: []
      _stateConditions:
      - id: 25
      - id: 26
    - _stateID: FallFromLedge
      _animation:
        id: 27
      _canFlip: 0
      _runSpeed: 2
      _stateType:
        id: 28
      _startActions: []
      _updateActions: []
      _endActions: []
      _stateConditions:
      - id: 29
      - id: 30
      - id: 31
    - _stateID: AirAttack1
      _animation:
        id: 32
      _canFlip: 0
      _runSpeed: 3
      _stateType:
        id: 33
      _startActions: []
      _updateActions:
      - id: 34
      - id: 35
      _endActions: []
      _stateConditions:
      - id: 36
    - _stateID: Attack1
      _animation:
        id: 37
      _canFlip: 0
      _runSpeed: 0
      _stateType:
        id: 38
      _startActions: []
      _updateActions:
      - id: 39
      _endActions: []
      _stateConditions:
      - id: 40
    - _stateID: Attack3
      _animation:
        id: 41
      _canFlip: 0
      _runSpeed: 0
      _stateType:
        id: 42
      _startActions:
      - id: 43
      _updateActions:
      - id: 44
      _endActions: []
      _stateConditions:
      - id: 45
    - _stateID: GetHit
      _animation:
        id: 46
      _canFlip: 0
      _runSpeed: 1
      _stateType:
        id: 47
      _startActions: []
      _updateActions: []
      _endActions: []
      _stateConditions:
      - id: 48
    - _stateID: Grabbed
      _animation:
        id: 49
      _canFlip: 0
      _runSpeed: 1
      _stateType:
        id: 50
      _startActions: []
      _updateActions: []
      _endActions: []
      _stateConditions:
      - id: 51
    currentState: Idle
  references:
    version: 1
    00000000:
      type: {class: SingleStateAnimation, ns: com.FDT.BeatEmUp.FSM, asm: Assembly-CSharp}
      data:
        _animationState: Idle
    00000001:
      type: {class: CommonMovementState, ns: com.FDT.BeatEmUp.FSM, asm: Assembly-CSharp}
      data:
        _gravityMultiplier: 1
        _canInputMove: 1
        _clearReceivedAttack: 0
    00000002:
      type: {class: OrMultiCondition, ns: com.FDT.BeatEmUp.FSM, asm: Assembly-CSharp}
      data:
        _targetState: Walk
        _actions: []
        _conditions:
        - id: 52
        - id: 53
    00000003:
      type: {class: SingleCondition, ns: com.FDT.BeatEmUp.FSM, asm: Assembly-CSharp}
      data:
        _targetState: Jump
        _actions: []
        _condition:
          id: 54
    00000004:
      type: {class: SingleCondition, ns: com.FDT.BeatEmUp.FSM, asm: Assembly-CSharp}
      data:
        _targetState: Attack1
        _actions: []
        _condition:
          id: 55
    00000005:
      type: {class: SingleCondition, ns: com.FDT.BeatEmUp.FSM, asm: Assembly-CSharp}
      data:
        _targetState: Attack3
        _actions: []
        _condition:
          id: 56
    00000006:
      type: {class: SingleCondition, ns: com.FDT.BeatEmUp.FSM, asm: Assembly-CSharp}
      data:
        _targetState: FallFromLedge
        _actions: []
        _condition:
          id: 57
    00000007:
      type: {class: SingleCondition, ns: com.FDT.BeatEmUp.FSM, asm: Assembly-CSharp}
      data:
        _targetState: GetHit
        _actions: []
        _condition:
          id: 58
    00000008:
      type: {class: SingleStateAnimation, ns: com.FDT.BeatEmUp.FSM, asm: Assembly-CSharp}
      data:
        _animationState: Walk
    00000009:
      type: {class: CommonMovementState, ns: com.FDT.BeatEmUp.FSM, asm: Assembly-CSharp}
      data:
        _gravityMultiplier: 1
        _canInputMove: 1
        _clearReceivedAttack: 0
    0000000A:
      type: {class: AndMultiCondition, ns: com.FDT.BeatEmUp.FSM, asm: Assembly-CSharp}
      data:
        _targetState: Idle
        _actions: []
        _conditions:
        - id: 59
        - id: 60
    0000000B:
      type: {class: SingleCondition, ns: com.FDT.BeatEmUp.FSM, asm: Assembly-CSharp}
      data:
        _targetState: Jump
        _actions: []
        _condition:
          id: 61
    0000000C:
      type: {class: SingleCondition, ns: com.FDT.BeatEmUp.FSM, asm: Assembly-CSharp}
      data:
        _targetState: Attack1
        _actions: []
        _condition:
          id: 62
    0000000D:
      type: {class: SingleCondition, ns: com.FDT.BeatEmUp.FSM, asm: Assembly-CSharp}
      data:
        _targetState: Attack3
        _actions: []
        _condition:
          id: 63
    0000000E:
      type: {class: SingleCondition, ns: com.FDT.BeatEmUp.FSM, asm: Assembly-CSharp}
      data:
        _targetState: FallFromLedge
        _actions: []
        _condition:
          id: 64
    0000000F:
      type: {class: SingleCondition, ns: com.FDT.BeatEmUp.FSM, asm: Assembly-CSharp}
      data:
        _targetState: GetHit
        _actions: []
        _condition:
          id: 65
    00000010:
      type: {class: SingleStateAnimation, ns: com.FDT.BeatEmUp.FSM, asm: Assembly-CSharp}
      data:
        _animationState: Jump
    00000011:
      type: {class: CommonMovementState, ns: com.FDT.BeatEmUp.FSM, asm: Assembly-CSharp}
      data:
        _gravityMultiplier: 3
        _canInputMove: 1
        _clearReceivedAttack: 0
    00000012:
      type: {class: ApplyForceStateAction, ns: com.FDT.BeatEmUp.FSM, asm: Assembly-CSharp}
      data:
        _force: {x: 0, y: 15, z: 0}
    00000013:
      type: {class: AndMultiCondition, ns: com.FDT.BeatEmUp.FSM, asm: Assembly-CSharp}
      data:
        _targetState: Attack3
        _actions: []
        _conditions:
        - id: 66
        - id: 67
    00000014:
      type: {class: AndMultiCondition, ns: com.FDT.BeatEmUp.FSM, asm: Assembly-CSharp}
      data:
        _targetState: Fall
        _actions: []
        _conditions:
        - id: 68
        - id: 69
    00000015:
      type: {class: SingleCondition, ns: com.FDT.BeatEmUp.FSM, asm: Assembly-CSharp}
      data:
        _targetState: AirAttack1
        _actions: []
        _condition:
          id: 70
    00000016:
      type: {class: SingleCondition, ns: com.FDT.BeatEmUp.FSM, asm: Assembly-CSharp}
      data:
        _targetState: Attack3
        _actions: []
        _condition:
          id: 71
    00000017:
      type: {class: SingleStateAnimation, ns: com.FDT.BeatEmUp.FSM, asm: Assembly-CSharp}
      data:
        _animationState: Fall
    00000018:
      type: {class: CommonMovementState, ns: com.FDT.BeatEmUp.FSM, asm: Assembly-CSharp}
      data:
        _gravityMultiplier: 3
        _canInputMove: 1
        _clearReceivedAttack: 0
    00000019:
      type: {class: SingleCondition, ns: com.FDT.BeatEmUp.FSM, asm: Assembly-CSharp}
      data:
        _targetState: Idle
        _actions: []
        _condition:
          id: 72
    0000001A:
      type: {class: SingleCondition, ns: com.FDT.BeatEmUp.FSM, asm: Assembly-CSharp}
      data:
        _targetState: AirAttack1
        _actions: []
        _condition:
          id: 73
    0000001B:
      type: {class: SingleStateAnimation, ns: com.FDT.BeatEmUp.FSM, asm: Assembly-CSharp}
      data:
        _animationState: FallFromLedge
    0000001C:
      type: {class: CommonMovementState, ns: com.FDT.BeatEmUp.FSM, asm: Assembly-CSharp}
      data:
        _gravityMultiplier: 3
        _canInputMove: 1
        _clearReceivedAttack: 0
    0000001D:
      type: {class: SingleCondition, ns: com.FDT.BeatEmUp.FSM, asm: Assembly-CSharp}
      data:
        _targetState: Idle
        _actions: []
        _condition:
          id: 74
    0000001E:
      type: {class: SingleCondition, ns: com.FDT.BeatEmUp.FSM, asm: Assembly-CSharp}
      data:
        _targetState: AirAttack1
        _actions: []
        _condition:
          id: 75
    0000001F:
      type: {class: SingleCondition, ns: com.FDT.BeatEmUp.FSM, asm: Assembly-CSharp}
      data:
        _targetState: Attack3
        _actions: []
        _condition:
          id: 76
    00000020:
      type: {class: SingleStateAnimation, ns: com.FDT.BeatEmUp.FSM, asm: Assembly-CSharp}
      data:
        _animationState: AirAttack1
    00000021:
      type: {class: CommonMovementState, ns: com.FDT.BeatEmUp.FSM, asm: Assembly-CSharp}
      data:
        _gravityMultiplier: 0
        _canInputMove: 0
        _clearReceivedAttack: 0
    00000022:
      type: {class: ApplyForceStateAction, ns: com.FDT.BeatEmUp.FSM, asm: Assembly-CSharp}
      data:
        _force: {x: 20, y: -20, z: 0}
    00000023:
      type: {class: HitboxCheckStateAction, ns: com.FDT.BeatEmUp.FSM, asm: Assembly-CSharp}
      data:
        _customPainStateForReceiver: 
        _attackDamage: 2
    00000024:
      type: {class: SingleCondition, ns: com.FDT.BeatEmUp.FSM, asm: Assembly-CSharp}
      data:
        _targetState: Idle
        _actions: []
        _condition:
          id: 77
    00000025:
      type: {class: RandomStateAnimation, ns: com.FDT.BeatEmUp.FSM, asm: Assembly-CSharp}
      data:
        _animationState:
        - Attack1
        - Attack2
    00000026:
      type: {class: RootMotionMovementState, ns: com.FDT.BeatEmUp.FSM, asm: Assembly-CSharp}
    00000027:
      type: {class: HitboxCheckStateAction, ns: com.FDT.BeatEmUp.FSM, asm: Assembly-CSharp}
      data:
        _customPainStateForReceiver: 
        _attackDamage: 2
    00000028:
      type: {class: SingleCondition, ns: com.FDT.BeatEmUp.FSM, asm: Assembly-CSharp}
      data:
        _targetState: Idle
        _actions: []
        _condition:
          id: 78
    00000029:
      type: {class: SingleStateAnimation, ns: com.FDT.BeatEmUp.FSM, asm: Assembly-CSharp}
      data:
        _animationState: Attack3
    0000002A:
      type: {class: CommonMovementState, ns: com.FDT.BeatEmUp.FSM, asm: Assembly-CSharp}
      data:
        _gravityMultiplier: 3
        _canInputMove: 0
        _clearReceivedAttack: 0
    0000002B:
      type: {class: ApplyForceStateAction, ns: com.FDT.BeatEmUp.FSM, asm: Assembly-CSharp}
      data:
        _force: {x: 0, y: 8, z: 0}
    0000002C:
      type: {class: HitboxCheckStateAction, ns: com.FDT.BeatEmUp.FSM, asm: Assembly-CSharp}
      data:
        _customPainStateForReceiver: 
        _attackDamage: 3
    0000002D:
      type: {class: AndMultiCondition, ns: com.FDT.BeatEmUp.FSM, asm: Assembly-CSharp}
      data:
        _targetState: Idle
        _actions: []
        _conditions:
        - id: 79
        - id: 80
    0000002E:
      type: {class: SingleStateAnimation, ns: com.FDT.BeatEmUp.FSM, asm: Assembly-CSharp}
      data:
        _animationState: GetHit
    0000002F:
      type: {class: CommonMovementState, ns: com.FDT.BeatEmUp.FSM, asm: Assembly-CSharp}
      data:
        _gravityMultiplier: 3
        _canInputMove: 0
        _clearReceivedAttack: 1
    00000030:
      type: {class: AndMultiCondition, ns: com.FDT.BeatEmUp.FSM, asm: Assembly-CSharp}
      data:
        _targetState: Idle
        _actions: []
        _conditions:
        - id: 81
        - id: 82
    00000031:
      type: {class: SingleStateAnimation, ns: com.FDT.BeatEmUp.FSM, asm: Assembly-CSharp}
      data:
        _animationState: Grabbed
    00000032:
      type: {class: CommonMovementState, ns: com.FDT.BeatEmUp.FSM, asm: Assembly-CSharp}
      data:
        _gravityMultiplier: 0
        _canInputMove: 0
        _clearReceivedAttack: 0
    00000033:
      type: {class: AdvanceMultiCondition, ns: com.FDT.BeatEmUp.FSM, asm: Assembly-CSharp}
      data:
        _conditionType: 0
        _conditions:
        - id: 83
        _actions:
        - id: 84
    00000034:
      type: {class: ConditionMoveHorizontal, ns: com.FDT.BeatEmUp.FSM, asm: Assembly-CSharp}
      data:
        _isMoving: 1
    00000035:
      type: {class: ConditionMoveVertical, ns: com.FDT.BeatEmUp.FSM, asm: Assembly-CSharp}
      data:
        _isMoving: 1
    00000036:
      type: {class: ConditionInputJump, ns: com.FDT.BeatEmUp.FSM, asm: Assembly-CSharp}
    00000037:
      type: {class: InputAttack1Condition, ns: com.FDT.BeatEmUp.FSM, asm: Assembly-CSharp}
    00000038:
      type: {class: InputAttack2Condition, ns: com.FDT.BeatEmUp.FSM, asm: Assembly-CSharp}
    00000039:
      type: {class: ConditionOnAir, ns: com.FDT.BeatEmUp.FSM, asm: Assembly-CSharp}
    0000003A:
      type: {class: GetHitCondition, ns: com.FDT.BeatEmUp.FSM, asm: Assembly-CSharp}
    0000003B:
      type: {class: ConditionMoveHorizontal, ns: com.FDT.BeatEmUp.FSM, asm: Assembly-CSharp}
      data:
        _isMoving: 0
    0000003C:
      type: {class: ConditionMoveVertical, ns: com.FDT.BeatEmUp.FSM, asm: Assembly-CSharp}
      data:
        _isMoving: 0
    0000003D:
      type: {class: ConditionInputJump, ns: com.FDT.BeatEmUp.FSM, asm: Assembly-CSharp}
    0000003E:
      type: {class: InputAttack1Condition, ns: com.FDT.BeatEmUp.FSM, asm: Assembly-CSharp}
    0000003F:
      type: {class: InputAttack2Condition, ns: com.FDT.BeatEmUp.FSM, asm: Assembly-CSharp}
    00000040:
      type: {class: ConditionOnAir, ns: com.FDT.BeatEmUp.FSM, asm: Assembly-CSharp}
    00000041:
      type: {class: GetHitCondition, ns: com.FDT.BeatEmUp.FSM, asm: Assembly-CSharp}
    00000042:
      type: {class: ConditionTimeLess, ns: com.FDT.BeatEmUp.FSM, asm: Assembly-CSharp}
      data:
        _minStateTime: 0.1
    00000043:
      type: {class: InputAttack1Condition, ns: com.FDT.BeatEmUp.FSM, asm: Assembly-CSharp}
    00000044:
      type: {class: ConditionTimed, ns: com.FDT.BeatEmUp.FSM, asm: Assembly-CSharp}
      data:
        _minStateTime: 0.2
    00000045:
      type: {class: GoingDown, ns: com.FDT.BeatEmUp.FSM, asm: Assembly-CSharp}
      data:
        _minVelocity: 0.1
    00000046:
      type: {class: InputAttack1Condition, ns: com.FDT.BeatEmUp.FSM, asm: Assembly-CSharp}
    00000047:
      type: {class: InputAttack2Condition, ns: com.FDT.BeatEmUp.FSM, asm: Assembly-CSharp}
    00000048:
      type: {class: Grounded, ns: com.FDT.BeatEmUp.FSM, asm: Assembly-CSharp}
    00000049:
      type: {class: InputAttack1Condition, ns: com.FDT.BeatEmUp.FSM, asm: Assembly-CSharp}
    0000004A:
      type: {class: Grounded, ns: com.FDT.BeatEmUp.FSM, asm: Assembly-CSharp}
    0000004B:
      type: {class: InputAttack1Condition, ns: com.FDT.BeatEmUp.FSM, asm: Assembly-CSharp}
    0000004C:
      type: {class: InputAttack2Condition, ns: com.FDT.BeatEmUp.FSM, asm: Assembly-CSharp}
    0000004D:
      type: {class: Grounded, ns: com.FDT.BeatEmUp.FSM, asm: Assembly-CSharp}
    0000004E:
      type: {class: ConditionTimed, ns: com.FDT.BeatEmUp.FSM, asm: Assembly-CSharp}
      data:
        _minStateTime: 0.35
    0000004F:
      type: {class: ConditionTimed, ns: com.FDT.BeatEmUp.FSM, asm: Assembly-CSharp}
      data:
        _minStateTime: 0.5
    00000050:
      type: {class: Grounded, ns: com.FDT.BeatEmUp.FSM, asm: Assembly-CSharp}
    00000051:
      type: {class: ConditionTimed, ns: com.FDT.BeatEmUp.FSM, asm: Assembly-CSharp}
      data:
        _minStateTime: 0.4
    00000052:
      type: {class: Grounded, ns: com.FDT.BeatEmUp.FSM, asm: Assembly-CSharp}
    00000053:
      type: {class: ConditionInputJump, ns: com.FDT.BeatEmUp.FSM, asm: Assembly-CSharp}
    00000054:
      type: {class: SetGrabberStateAction, ns: com.FDT.BeatEmUp.FSM, asm: Assembly-CSharp}
      data:
        _grabberObjectsState: Idle
