{
  "errors": {
    "400": {
      "hits": 343,
      "paths": {
        "": 214
      }
    },
    "404": {
      "hits": 403,
      "paths": {}
    }
  },
  "firstProcessedDate": "2022-01-25T06:25:18+00:00",
  "hits": 3199,
  "hitsPerCountry": {
    "-": 354,
    "DE": 112,
    "GB": 294,
    "JP": 168,
    "NL": 244,
    "US": 1562
  },
  "lastProcessedDate": "2022-01-30T23:58:46+00:00",
  "paths": {
    "/": {
      "hits": 654
    },
    "/android-free/repository/": {
      "hits": 1456,
      "hitsPerCountry": {
        "GB": 270,
        "JP": 163,
        "NL": 225,
        "US": 555
      }
    },
    "/robots.txt": {
      "hits": 121
    }
  },
  "queries": {},
  "weekStartDate": "2022-01-24T00:00:00+00:00"
}