{
  "errors": {
    "404": {
      "hits": 1269,
      "paths": {}
    }
  },
  "firstProcessedDate": "2021-03-01T00:01:04+00:00",
  "hits": 3037,
  "hitsPerCountry": {
    "-": 164,
    "GB": 212,
    "JP": 109,
    "NL": 137,
    "US": 1914
  },
  "lastProcessedDate": "2021-03-05T06:24:52+00:00",
  "paths": {
    "/": {
      "hits": 202
    },
    "/android-free/repository/": {
      "hits": 1236,
      "hitsPerCountry": {
        "GB": 194,
        "JP": 106,
        "NL": 131,
        "US": 559
      }
    }
  },
  "queries": {},
  "weekStartDate": "2021-03-01T00:00:00+00:00"
}