{
  "errors": {
    "404": {
      "hits": 740,
      "paths": {}
    },
    "499": {
      "hits": 355,
      "paths": {}
    }
  },
  "firstProcessedDate": "2024-05-28T00:00:11+00:00",
  "hits": 69149,
  "lastProcessedDate": "2024-06-02T23:59:41+00:00",
  "paths": {
    "/": {
      "hits": 20643
    },
    "/assets/apple-touch-icon_ypJwtCrcixeH_qV6LdcMYk1anFIR9o-_ufR__1wNdJY=.png": {
      "hits": 243
    },
    "/assets/favicon-16x16_7yyppfDSTAVyGb3ycHY84PYjHUwP96NKICAibLRpnXw=.png": {
      "hits": 147
    },
    "/assets/fdroid-logo-text_S0MUfk_FsnAYL7n2MQye-34IoSNm6QM6xYjDnMqkufo=.svg": {
      "hits": 424
    },
    "/assets/ic_search_black_24px.svg": {
      "hits": 283
    },
    "/assets/liberapay_donate_button_GHdOOfmFJNeSXjfjnA-98XtIuEfvE6cNJjHgHOhjdv0=.svg": {
      "hits": 272
    },
    "/assets/lory.min_OaktEa_IE1cqFYLsDaFgRzumQ-2V78rnwaWt6g4I2gE=.js": {
      "hits": 114
    },
    "/assets/mastodon_-c62Zo613I00cO-RavNTybrSJhBC3vZToN5u4zSoMdM=.svg": {
      "hits": 231
    },
    "/assets/opencollective_button_iIGF0Hixdj0EaYR3Sd7FRigTVcl7QPGu6kaoBmXHjZI=.png": {
      "hits": 292
    },
    "/assets/package_VaovpUKD2zvazIPjOxsnE2QDGaK4nhQF6oFrjx2ZvO8=.js": {
      "hits": 109
    },
    "/assets/phone-frame_CugdRqiuBcm9I48ZeNjWjha41afLF4ISL2R9QoRbCzo=.png": {
      "hits": 107
    },
    "/assets/roboto_ln5c7Pv79kCZw8EjInNILddDbwVxQmaVPE0sjunCivU=.ttf": {
      "hits": 296
    },
    "/assets/sidebar-lang_j4kvB8VghKUiWGs4HpqMvN0Ucx0tTmJ_lRfuoUmiaqc=.js": {
      "hits": 214
    },
    "/assets/site_J9OLInBmO2hLlutzRFC4mdstNJjL44B6NzBbT0ecmA0=.webmanifest": {
      "hits": 118
    },
    "/css/main.css": {
      "hits": 340
    },
    "/fdroid/archive/entry.jar": {
      "hits": 295
    },
    "/fdroid/archive/entry.json": {
      "hits": 278
    },
    "/fdroid/archive/index-v1.jar": {
      "hits": 282
    },
    "/fdroid/archive/index-v2.json": {
      "hits": 280
    },
    "/fdroid/repo/entry.jar": {
      "hits": 2086
    },
    "/fdroid/repo/entry.json": {
      "hits": 282
    },
    "/fdroid/repo/index-v1.jar": {
      "hits": 292
    },
    "/fdroid/repo/index-v2.json": {
      "hits": 284
    },
    "/feed.xml": {
      "hits": 201
    },
    "/repo/com.gero.newpass/en-US/icon_gA9NmYhcqVrLq7L30ZG1Oauax08zAmmdgNzS6gVSL9U=.png": {
      "hits": 141
    },
    "/repo/dev.labplus.app/en-US/icon_BHIj7ZOcX80coFN0rLzKMGvOEoIs5AHsoFuQj11As_k=.png": {
      "hits": 123
    },
    "/repo/luci.sixsixsix.powerampache2.fdroid/en-US/icon_LyhQQNN8gulrHecrz07VJSTCWUtPR_J-tAeVGkVP9f0=.png": {
      "hits": 128
    },
    "/repo/org.mian.gitnex/en-US/icon_EFgjn4gHRyqqXYqpnqHKUCSQXnd_FYoonxHcgHAZ5MM=.png": {
      "hits": 143
    },
    "/repo/org.woheller69.omweather/en-US/icon_E3rAVMKaoXV3S6EdjZbr8Ah3yVuGV4teI7GOx4SRxl4=.png": {
      "hits": 139
    },
    "/repo/xyz.apiote.bimba.czwek/en-GB/icon_FDJ5OEjVG8QC2w1VqOh8oryRHRpqC3B4Ddmk3n-elGM=.png": {
      "hits": 202
    },
    "/search/": {
      "hits": 143
    },
    "/search/static/fdroid_website_search.css": {
      "hits": 106
    }
  },
  "queries": {
    "": {
      "hits": 399
    }
  },
  "weekStartDate": "2024-05-27T00:00:00+00:00"
}