{
  "errors": {
    "404": {
      "hits": 3121,
      "paths": {}
    },
    "499": {
      "hits": 386,
      "paths": {}
    }
  },
  "firstProcessedDate": "2024-06-18T00:00:18+00:00",
  "hits": 82288,
  "lastProcessedDate": "2024-06-23T23:59:59+00:00",
  "paths": {
    "/": {
      "hits": 22022
    },
    "/assets/apple-touch-icon_ypJwtCrcixeH_qV6LdcMYk1anFIR9o-_ufR__1wNdJY=.png": {
      "hits": 183
    },
    "/assets/favicon-16x16_7yyppfDSTAVyGb3ycHY84PYjHUwP96NKICAibLRpnXw=.png": {
      "hits": 101
    },
    "/assets/fdroid-logo-text_S0MUfk_FsnAYL7n2MQye-34IoSNm6QM6xYjDnMqkufo=.svg": {
      "hits": 318
    },
    "/assets/ic_search_black_24px.svg": {
      "hits": 267
    },
    "/assets/liberapay_donate_button_GHdOOfmFJNeSXjfjnA-98XtIuEfvE6cNJjHgHOhjdv0=.svg": {
      "hits": 200
    },
    "/assets/lory.min_OaktEa_IE1cqFYLsDaFgRzumQ-2V78rnwaWt6g4I2gE=.js": {
      "hits": 164
    },
    "/assets/mastodon_-c62Zo613I00cO-RavNTybrSJhBC3vZToN5u4zSoMdM=.svg": {
      "hits": 169
    },
    "/assets/opencollective_button_iIGF0Hixdj0EaYR3Sd7FRigTVcl7QPGu6kaoBmXHjZI=.png": {
      "hits": 244
    },
    "/assets/package_VaovpUKD2zvazIPjOxsnE2QDGaK4nhQF6oFrjx2ZvO8=.js": {
      "hits": 162
    },
    "/assets/roboto_ln5c7Pv79kCZw8EjInNILddDbwVxQmaVPE0sjunCivU=.ttf": {
      "hits": 345
    },
    "/assets/sidebar-lang_j4kvB8VghKUiWGs4HpqMvN0Ucx0tTmJ_lRfuoUmiaqc=.js": {
      "hits": 325
    },
    "/css/main.css": {
      "hits": 417
    },
    "/en/about/": {
      "hits": 118
    },
    "/fdroid/archive/entry.jar": {
      "hits": 307
    },
    "/fdroid/archive/entry.json": {
      "hits": 283
    },
    "/fdroid/archive/index-v1.jar": {
      "hits": 297
    },
    "/fdroid/archive/index-v2.json": {
      "hits": 286
    },
    "/fdroid/repo/entry.jar": {
      "hits": 2086
    },
    "/fdroid/repo/entry.json": {
      "hits": 283
    },
    "/fdroid/repo/index-v1.jar": {
      "hits": 297
    },
    "/fdroid/repo/index-v2.json": {
      "hits": 297
    },
    "/feed.xml": {
      "hits": 211
    },
    "/repo/com.example.notificationalerter/en-US/icon_Oltgjy9BWau-vDbMXRuL2Ueh8dAu_QF42cEmrznr-do=.jpg": {
      "hits": 129
    },
    "/repo/com.keshav.capturesposed/en-US/icon_W6M--rmiIW-m3bNPTNGDM2WiFlOGfyN_RpTrVn9Y5Ak=.png": {
      "hits": 140
    },
    "/repo/lying.fengfeng.foodrecords/en-US/icon_RJGg36wokusre3RGMlbGC6kB-0kcTtsZTTK0OiO8gAk=.png": {
      "hits": 120
    },
    "/repo/spam.blocker/en-US/icon_NvpPfzS3J8Gx5PNIZUjNWQwk8ECPl6nVjaQ_6-8FsxY=.png": {
      "hits": 116
    },
    "/search/": {
      "hits": 140
    }
  },
  "queries": {
    "": {
      "hits": 876
    }
  },
  "weekStartDate": "2024-06-17T00:00:00+00:00"
}