{
  "errors": {
    "404": {
      "hits": 1129,
      "paths": {}
    }
  },
  "firstProcessedDate": "2024-03-05T00:00:14+00:00",
  "hits": 100204,
  "hitsPerLanguage": {
    "?": 99814,
    "en": 263
  },
  "lastProcessedDate": "2024-03-10T23:59:59+00:00",
  "paths": {
    "/": {
      "hits": 16648
    },
    "/F-Droid.apk": {
      "hits": 266
    },
    "/assets/NonFreeNet_1_HpZ8RLihjue1811xbR2d2CgjRJ4by7NHTk3Y-_7aQ=.svg": {
      "hits": 120
    },
    "/assets/apple-touch-icon_ypJwtCrcixeH_qV6LdcMYk1anFIR9o-_ufR__1wNdJY=.png": {
      "hits": 704
    },
    "/assets/bitcoin_u5ZHZdqBG9Z1IRMuwLjo739g-ULyCRR8aKF01ViGn9w=.png": {
      "hits": 181
    },
    "/assets/donate_JH0mCNwawhPK42f7esD5bhYNybwPzSBMKoUvyTlH-Gw=.js": {
      "hits": 183
    },
    "/assets/download-fdroid-qr_GxE-SXA6lmH3iEpOmU-lh1S4bQZis4xoQ2M_LzTWQF8=.png": {
      "hits": 228
    },
    "/assets/favicon-16x16_7yyppfDSTAVyGb3ycHY84PYjHUwP96NKICAibLRpnXw=.png": {
      "hits": 304
    },
    "/assets/fdroid-logo-text_S0MUfk_FsnAYL7n2MQye-34IoSNm6QM6xYjDnMqkufo=.svg": {
      "hits": 805
    },
    "/assets/fdroid-screenshot-en.png": {
      "hits": 159
    },
    "/assets/ic_repo_app_default.png": {
      "hits": 100
    },
    "/assets/ic_repo_app_default_KNN008Z2K7VNPZOFLMTry3JkfFYPxVGDopS1iwWe5wo=.png": {
      "hits": 144
    },
    "/assets/ic_search_black_24px.svg": {
      "hits": 778
    },
    "/assets/liberapay_donate_button_GHdOOfmFJNeSXjfjnA-98XtIuEfvE6cNJjHgHOhjdv0=.svg": {
      "hits": 486
    },
    "/assets/lory.min_OaktEa_IE1cqFYLsDaFgRzumQ-2V78rnwaWt6g4I2gE=.js": {
      "hits": 407
    },
    "/assets/mastodon_-c62Zo613I00cO-RavNTybrSJhBC3vZToN5u4zSoMdM=.svg": {
      "hits": 366
    },
    "/assets/opencollective_button_iIGF0Hixdj0EaYR3Sd7FRigTVcl7QPGu6kaoBmXHjZI=.png": {
      "hits": 457
    },
    "/assets/package_VaovpUKD2zvazIPjOxsnE2QDGaK4nhQF6oFrjx2ZvO8=.js": {
      "hits": 402
    },
    "/assets/phone-frame_CugdRqiuBcm9I48ZeNjWjha41afLF4ISL2R9QoRbCzo=.png": {
      "hits": 231
    },
    "/assets/roboto_ln5c7Pv79kCZw8EjInNILddDbwVxQmaVPE0sjunCivU=.ttf": {
      "hits": 814
    },
    "/assets/sidebar-lang_j4kvB8VghKUiWGs4HpqMvN0Ucx0tTmJ_lRfuoUmiaqc=.js": {
      "hits": 696
    },
    "/assets/site_J9OLInBmO2hLlutzRFC4mdstNJjL44B6NzBbT0ecmA0=.webmanifest": {
      "hits": 244
    },
    "/css/main.css": {
      "hits": 894
    },
    "/en/about/": {
      "hits": 193
    },
    "/en/docs/Build_Metadata_Reference/": {
      "hits": 144
    },
    "/en/packages/ch.protonvpn.android/": {
      "hits": 129
    },
    "/fdroid/archive/entry.jar": {
      "hits": 287
    },
    "/fdroid/archive/entry.json": {
      "hits": 269
    },
    "/fdroid/archive/index-v1.jar": {
      "hits": 279
    },
    "/fdroid/archive/index-v2.json": {
      "hits": 272
    },
    "/fdroid/repo/entry.jar": {
      "hits": 337
    },
    "/fdroid/repo/entry.json": {
      "hits": 270
    },
    "/fdroid/repo/index-v1.jar": {
      "hits": 293
    },
    "/fdroid/repo/index-v2.json": {
      "hits": 279
    },
    "/feed.xml": {
      "hits": 380
    },
    "/repo/audio.omgsoundboard/en-US/icon_6Sc7CVnjSM7bAkAZE7jOZDVMKDYuTwNJoXQyzPB5_2o=.png": {
      "hits": 164
    },
    "/repo/com.money.manager.ex/en-US/icon_QF7g1MCI0Iy_QKoJixzLN4SZwg9t9JNDOwdpwoa5DUE=.png": {
      "hits": 294
    },
    "/repo/icons-640/ru.henridellal.dialer.18.png": {
      "hits": 288
    },
    "/repo/net.leodesouza.blitz/en-US/icon_x1C9Wl-9KIq6JRHtpdBBrH3uMSu1MlSO8FUxpPT8MK4=.png": {
      "hits": 430
    },
    "/repo/org.fossify.messages/en-US/icon_ITOiksSmkUfPw2V32yR_choHftbgUEYU3zjyfcHx6hM=.png": {
      "hits": 254
    },
    "/repo/org.fossify.voicerecorder/en-US/icon_KYvcDjpflfCG2E4kPN6ipz-Q9rSdLJfGiU2mJ3MuNlo=.png": {
      "hits": 409
    },
    "/repo/org.jellyfin.androidtv/en-US/icon_nIUetUADzJqT35XXM1z2i8lzShny2qeYdF64uaYad5c=.png": {
      "hits": 255
    },
    "/repo/org.oxycblt.auxio/en-US/icon_jdRok4xNvWOD-mGXxk051-Y1DqArTANlpnrn5cmCk9k=.png": {
      "hits": 329
    },
    "/repo/org.pixeldroid.app/en-US/icon_0fVnr5IwyZsIR2qOnAM_0mrPAtWa5UgOPlHlOA0locw=.png": {
      "hits": 489
    },
    "/repo/org.privacymatters.safespace/en-US/icon_PE26zYSBlKPklqpmkuQdvBI0veNcd7WxFYKOP3b3Os8=.png": {
      "hits": 217
    },
    "/repo/pl.suve.colorful.android/en-US/icon_dZLZlMjMfdZXU9hZ8VX8x70BNa-WwjUIwC1rKWh3jQc=.png": {
      "hits": 418
    },
    "/repo/player.phonograph.plus/en-US/icon_ncl9cm4Mr4U0edpzvu_8H--zCPmHTHhroPKmj3ABwA4=.png": {
      "hits": 127
    },
    "/repo/software.mdev.bookstracker/en-US/icon_Dcan1mwK_h5oLOey3VD6W39KRruYK838rKYVV_RvE_Y=.png": {
      "hits": 131
    },
    "/repo/ua.com.radiokot.lnaddr2invoice/en-US/icon_E8f0ItDFeKIKF5NdNl9VCqEzaonb8g2REw7i9G8sAD4=.png": {
      "hits": 132
    },
    "/repo/ua.com.radiokot.photoprism/en-US/icon_W_5TnleHSiMH-MyytjFp3GcUAbzrps9k-6bgbWwryW8=.png": {
      "hits": 140
    },
    "/search/": {
      "hits": 383
    },
    "/search/static/favicon.png": {
      "hits": 165
    },
    "/search/static/fdroid-logo-text.svg": {
      "hits": 256
    },
    "/search/static/fdroid_website_search.css": {
      "hits": 253
    },
    "/search/static/roboto.ttf": {
      "hits": 102
    },
    "/search/static/search.svg": {
      "hits": 245
    }
  },
  "queries": {
    "": {
      "hits": 478
    }
  },
  "weekStartDate": "2024-03-04T00:00:00+00:00"
}