{
  "errors": {
    "404": {
      "hits": 1084,
      "paths": {}
    },
    "499": {
      "hits": 362,
      "paths": {}
    }
  },
  "firstProcessedDate": "2024-04-09T00:00:23+00:00",
  "hits": 90315,
  "hitsPerLanguage": {
    "?": 90172,
    "en": 113
  },
  "lastProcessedDate": "2024-04-14T23:59:58+00:00",
  "paths": {
    "/": {
      "hits": 24063
    },
    "/assets/apple-touch-icon_ypJwtCrcixeH_qV6LdcMYk1anFIR9o-_ufR__1wNdJY=.png": {
      "hits": 244
    },
    "/assets/download-fdroid-qr_GxE-SXA6lmH3iEpOmU-lh1S4bQZis4xoQ2M_LzTWQF8=.png": {
      "hits": 112
    },
    "/assets/favicon-16x16_7yyppfDSTAVyGb3ycHY84PYjHUwP96NKICAibLRpnXw=.png": {
      "hits": 132
    },
    "/assets/fdroid-logo-text_S0MUfk_FsnAYL7n2MQye-34IoSNm6QM6xYjDnMqkufo=.svg": {
      "hits": 383
    },
    "/assets/fdroid-screenshot-en.png": {
      "hits": 107
    },
    "/assets/ic_search_black_24px.svg": {
      "hits": 333
    },
    "/assets/liberapay_donate_button_GHdOOfmFJNeSXjfjnA-98XtIuEfvE6cNJjHgHOhjdv0=.svg": {
      "hits": 228
    },
    "/assets/lory.min_OaktEa_IE1cqFYLsDaFgRzumQ-2V78rnwaWt6g4I2gE=.js": {
      "hits": 143
    },
    "/assets/mastodon_-c62Zo613I00cO-RavNTybrSJhBC3vZToN5u4zSoMdM=.svg": {
      "hits": 166
    },
    "/assets/opencollective_button_iIGF0Hixdj0EaYR3Sd7FRigTVcl7QPGu6kaoBmXHjZI=.png": {
      "hits": 239
    },
    "/assets/package_VaovpUKD2zvazIPjOxsnE2QDGaK4nhQF6oFrjx2ZvO8=.js": {
      "hits": 144
    },
    "/assets/phone-frame_CugdRqiuBcm9I48ZeNjWjha41afLF4ISL2R9QoRbCzo=.png": {
      "hits": 114
    },
    "/assets/roboto_ln5c7Pv79kCZw8EjInNILddDbwVxQmaVPE0sjunCivU=.ttf": {
      "hits": 382
    },
    "/assets/sidebar-lang_j4kvB8VghKUiWGs4HpqMvN0Ucx0tTmJ_lRfuoUmiaqc=.js": {
      "hits": 266
    },
    "/assets/site_J9OLInBmO2hLlutzRFC4mdstNJjL44B6NzBbT0ecmA0=.webmanifest": {
      "hits": 215
    },
    "/css/main.css": {
      "hits": 465
    },
    "/en/packages/com.jithware.brethap/": {
      "hits": 185
    },
    "/en/packages/org.quentin_bettoum.librememorygame/": {
      "hits": 125
    },
    "/fdroid/archive/entry.jar": {
      "hits": 302
    },
    "/fdroid/archive/entry.json": {
      "hits": 276
    },
    "/fdroid/archive/index-v1.jar": {
      "hits": 281
    },
    "/fdroid/archive/index-v2.json": {
      "hits": 279
    },
    "/fdroid/repo/entry.jar": {
      "hits": 2006
    },
    "/fdroid/repo/entry.json": {
      "hits": 276
    },
    "/fdroid/repo/index-v1.jar": {
      "hits": 389
    },
    "/fdroid/repo/index-v2.json": {
      "hits": 288
    },
    "/feed.xml": {
      "hits": 265
    },
    "/repo/se.lublin.mumla/en-US/icon_TxKqlJbEjKCNiQjiDMsn8eCAHhULl3PFRA66uJ1DgnA=.png": {
      "hits": 122
    },
    "/search/": {
      "hits": 148
    },
    "/search/static/fdroid-logo-text.svg": {
      "hits": 102
    },
    "/search/static/fdroid_website_search.css": {
      "hits": 122
    },
    "/search/static/search.svg": {
      "hits": 115
    }
  },
  "queries": {
    "": {
      "hits": 653
    }
  },
  "weekStartDate": "2024-04-08T00:00:00+00:00"
}