{
  "errors": {},
  "firstProcessedDate": "2020-12-21T06:25:20+00:00",
  "hits": 5000,
  "hitsPerCountry": {
    "-": 101,
    "CA": 152,
    "DE": 228,
    "IN": 194,
    "RU": 201,
    "US": 3156
  },
  "hitsPerLanguage": {
    "?": 1606,
    "en": 3184
  },
  "lastProcessedDate": "2020-12-21T08:00:29+00:00",
  "paths": {
    "/": {
      "hits": 3455
    },
    "/static/favicon.png": {
      "hits": 258
    },
    "/static/fdroid-logo-text.svg": {
      "hits": 348
    },
    "/static/fdroid_website_search.css": {
      "hits": 346
    },
    "/static/roboto.ttf": {
      "hits": 148
    },
    "/static/search.svg": {
      "hits": 333
    }
  },
  "queries": {},
  "weekStartDate": "2020-12-21T00:00:00+00:00"
}