{
        "km": {"value": 1000, "type": "lenght", "name": "Kilometers"},
        "hm": {"value": 100, "type": "lenght", "name": "Hectometer"},
        "dam": {"value": 10, "type": "lenght", "name": "Decameters"},
        "m": {"value": 1.0, "type": "lenght", "name": "Meters"},
        "dm": {"value": 0.1, "type": "lenght", "name": "Decimeters"},
        "cm": {"value": 0.01, "type": "lenght", "name": "Centimeter"},
        "mm": {"value": 0.001, "type": "lenght", "name": "Millimeter"},
        "kl": {"value": 1000, "type": "volume", "name": "Kiloliters"},
        "hl": {"value": 100, "type": "volume", "name": "Hectoliter"},
        "dal": {"value": 10, "type": "volume", "name": "Decaliters"},
        "l": {"value": 1.0, "type": "volume", "name": "Liters"},
        "dl": {"value": 0.1, "type": "volume", "name": "Deciliters"},
        "cl": {"value": 0.01, "type": "volume", "name": "Centiliter"},
        "ml": {"value": 0.001, "type": "volume", "name": "Milliliter"},
        "tons": {"value": 1000, "type": "mass", "name": "Tons"},
        "hkg": {"value": 100, "type": "mass", "name": "###"},
        "dakg": {"value": 10, "type": "mass", "name": "###"},
        "kg": {"value": 1.0, "type": "mass", "name": "Kilos"},
        "hg": {"value": 0.1, "type": "mass", "name": "Hectokilos"},
        "dag": {"value": 0.01, "type": "mass", "name": "Decakilos"},
        "g": {"value": 0.001, "type": "mass", "name": "Grams"},
        "dg": {"value": 0.0001, "type": "mass", "name": "Decigrams"},
        "cg": {"value": 0.00001, "type": "mass", "name": "Centigrams"},
        "mg": {"value": 0.000001, "type": "mass", "name": "Milligrams"},
        "F": {"value": 0.000001, "type": "temperature", "name": "Fahrenheit"},
        "C": {"value": 0.000001, "type": "temperature", "name": "Celsius"},
        "K": {"value": 0.000001, "type": "temperature", "name": "Kelvin"}

}