{
	"info": {
		"_postman_id": "b37ab04e-cd57-4507-8d8d-fe6db4c1588b",
		"name": "Tests",
		"schema": "https://schema.getpostman.com/json/collection/v2.1.0/collection.json"
	},
	"item": [
		{
			"name": "Login",
			"request": {
				"method": "POST",
				"header": [
					{
						"key": "",
						"value": "",
						"type": "text",
						"disabled": true
					},
					{
						"key": "Content-Type",
						"name": "Content-Type",
						"value": "application/x-www-form-urlencoded",
						"type": "text"
					}
				],
				"body": {
					"mode": "urlencoded",
					"urlencoded": [
						{
							"key": "email",
							"value": "drogba3809766@gmail.com",
							"type": "text"
						},
						{
							"key": "password",
							"value": "Desoutside1",
							"type": "text"
						},
						{
							"key": "token",
							"value": "test",
							"type": "text"
						}
					]
				},
				"url": {
					"raw": "localhost:8070/auth/login",
					"host": [
						"localhost"
					],
					"port": "8070",
					"path": [
						"auth",
						"login"
					]
				}
			},
			"response": [
				{
					"name": "Login",
					"originalRequest": {
						"method": "POST",
						"header": [
							{
								"key": "",
								"value": "",
								"type": "text",
								"disabled": true
							},
							{
								"key": "Content-Type",
								"name": "Content-Type",
								"value": "application/x-www-form-urlencoded",
								"type": "text"
							}
						],
						"body": {
							"mode": "urlencoded",
							"urlencoded": [
								{
									"key": "email",
									"value": "'test'",
									"type": "text"
								},
								{
									"key": "password",
									"value": "'test'",
									"type": "text"
								},
								{
									"key": "token",
									"value": "'test'",
									"type": "text"
								}
							]
						},
						"url": {
							"raw": "localhost:8070/auth/login",
							"host": [
								"localhost"
							],
							"port": "8070",
							"path": [
								"auth",
								"login"
							]
						}
					},
					"status": "OK",
					"code": 200,
					"_postman_previewlanguage": "json",
					"header": [
						{
							"key": "X-Powered-By",
							"value": "Express"
						},
						{
							"key": "Set-Cookie",
							"value": "token=eyJhbGciOiJIUzI1NiIsInR5cCI6IkpXVCJ9.eyJpYXQiOjE1Nzk5ODc4NzMsImV4cCI6MTU3OTk5MTQ3M30.gwEwBcphuAJeC0DHdHF6b2vnGXPfGxt5o1sTiUBKB_U; Max-Age=3; Path=/; Expires=Sat, 25 Jan 2020 21:31:16 GMT; HttpOnly"
						},
						{
							"key": "Content-Type",
							"value": "application/json; charset=utf-8"
						},
						{
							"key": "Content-Length",
							"value": "2"
						},
						{
							"key": "ETag",
							"value": "W/\"2-vyGp6PvFo4RvsFtPoIWeCReyIC8\""
						},
						{
							"key": "Date",
							"value": "Sat, 25 Jan 2020 21:31:13 GMT"
						},
						{
							"key": "Connection",
							"value": "keep-alive"
						}
					],
					"cookie": [],
					"body": "{}"
				}
			]
		},
		{
			"name": "Register",
			"request": {
				"method": "POST",
				"header": [
					{
						"key": "Content-Type",
						"name": "Content-Type",
						"value": "application/x-www-form-urlencoded",
						"type": "text"
					}
				],
				"body": {
					"mode": "urlencoded",
					"urlencoded": [
						{
							"key": "email",
							"value": "drogba3809766@gmail.com",
							"type": "text"
						},
						{
							"key": "password",
							"value": "Desoutside1",
							"type": "text"
						},
						{
							"key": "firstName",
							"value": "Andrei",
							"type": "text"
						},
						{
							"key": "lastName",
							"value": "Anelkin",
							"type": "text"
						}
					]
				},
				"url": {
					"raw": "localhost:8070/auth/register",
					"host": [
						"localhost"
					],
					"port": "8070",
					"path": [
						"auth",
						"register"
					],
					"query": [
						{
							"key": "",
							"value": "",
							"disabled": true
						}
					]
				}
			},
			"response": []
		},
		{
			"name": "createProcess",
			"request": {
				"method": "POST",
				"header": [
					{
						"key": "Content-Type",
						"name": "Content-Type",
						"value": "application/x-www-form-urlencoded",
						"type": "text"
					}
				],
				"body": {
					"mode": "urlencoded",
					"urlencoded": [
						{
							"key": "title",
							"value": "test",
							"type": "text"
						},
						{
							"key": "assignUser",
							"value": "5e2ccc09a812519432a96dc8",
							"type": "text"
						},
						{
							"key": "ownerUser",
							"value": "5e2ccc09a812519432a96dc8",
							"type": "text"
						},
						{
							"key": "description",
							"value": "test descr",
							"type": "text"
						}
					]
				},
				"url": {
					"raw": "localhost:8070/requests/createRequest",
					"host": [
						"localhost"
					],
					"port": "8070",
					"path": [
						"requests",
						"createRequest"
					]
				}
			},
			"response": []
		}
	],
	"protocolProfileBehavior": {}
}