importer autoplusbd.sql dans votre sgbd "c'est une base de test"
//accounts
Compte admin : 
username : admin
password : S{48wvbp
--------------------
Compte Particulier : 
username : masterx
password : 12345678
--------------------
Compte Pro: 
username : masterx
password : 12345678
