<svg width="24" height="24" viewBox="0 0 24 24" fill="none"
  xmlns="http://www.w3.org/2000/svg">
  <path d="M12 24C18.6274 24 24 18.6274 24 12C24 5.37258 18.6274 0 12 0C5.37258 0 0 5.37258 0 12C0 18.6274 5.37258 24 12 24Z" fill="white"/>
  <path d="M16.92 5.08548L2.7471 10.3803C1.77986 10.7567 1.78545 11.2794 2.56964 11.5125L6.2084 12.6122L14.6274 7.46609C15.0255 7.23144 15.3892 7.35767 15.0903 7.61478L8.26919 13.5787L8.01818 17.2131C8.38589 17.2131 8.54817 17.0497 8.75441 16.8569L10.5218 15.1919L14.1982 17.8226C14.876 18.1843 15.3628 17.9984 15.5315 17.2147L17.9448 6.19602C18.1918 5.23649 17.5667 4.80203 16.92 5.08548Z" fill="#0C2722"/>
</svg>
