[
  {
    "account": {
      "name": "preseed",
      "address": "0x859Cf27D2d3eCFd17Bd53dB05Da3CdDBe9204277",
      "privateKey": "ec74f8df60122a4546df17736acd49df9728631006a164b10fdde72308e36ea9"
    },
    "pool": {
      "total": "325,000.00",
      "type": "preSeed"
    }
  },
  {
    "account": {
      "name": "seed",
      "address": "0x7F354CeF07267d53aCE00682ddC1D4Dfb06F98Ad",
      "privateKey": "a820216a5617c55dc2fe6fdb72a4b1ee9ed7f91b97f122688a8413af0e9787d1"
    },
    "pool": {
      "total": "4,000,000.00",
      "type": "seed"
    }
  },
  {
    "account": {
      "name": "Marketing and Listing",
      "address": "0xd51c8fccbd3cdc5484baaac3b7ceaf8b2b364a24",
      "privateKey": "222fbdfe29b0765c061cebf5e6d9508f0d08c46eef497fe85338e5111a5816e1"
    },
    "pool": {
      "total": "48,000,000.00",
      "type": "marketing"
    }
  },
  {
    "account": {
      "name": "Strategic sale - Long Vesting",
      "address": "0xEb0C6134495385Ca618aB2e881c4A4c327A2C6FE",
      "privateKey": "941e7953ea000da1f09ddfee77fed1e6de59a5b99474f52d82884dac1c736b18"
    },
    "pool": {
      "total": "25,993,500.00",
      "type": "longvesting"
    }
  },
  {
    "account": {
      "name": "Strategic sale - Short Vesting",
      "address": "0x7a900Bbd86c7aAb90F3C89DcebE07Cd28cc86838",
      "privateKey": "16ce695e4d58dc7f40123f8dad1e04bd4ebf880ca8802eb8d28adf26801b9022"
    },
    "pool": {
      "total": "12,799,500.00",
      "type": "shortvesting"
    }
  },
  {
    "account": {
      "name": "Protocol Development",
      "address": "0x4a5F795eD0905019c947C8BcC3d026498DE0B849",
      "privateKey": "c5fe62eb12bdd5b460b07fddf41605d4859c93c00c7662b4eea3875a54ecc74a"
    },
    "pool": {
      "total": "40,000,000.00",
      "type": "development"
    }
  },
  {
    "account": {
      "name": "Community Incentives",
      "address": "0x95CB237CEbcDeEfF8862727c874B2B4d7225bE2A",
      "privateKey": "1adc5af04800451da5e8561051a98fb1c4c5d4af5311348ac4ba92351d3fa65b"
    },
    "pool": {
      "total": "20,000,000.00",
      "type": "community"
    }
  },
  {
    "account": {
      "name": "Company Reserve",
      "address": "0x1072488d5E11DCBC15f376b9d7D8f5c1B1110450",
      "privateKey": "0ebb75e1930a4aa63aa74f15ab93b61ce3e0dc6d522315078f6d0914a09b1d51"
    },
    "pool": {
      "total": "34,605,042.00",
      "type": "companyreserve"
    }
  },
  {
    "account": {
      "name": "Team & Advisors",
      "address": "0x75B7AA6E0165977E7C41ead70d2919481bAABe36",
      "privateKey": "81cd05e60825a9fbe76aa6d70745445e0c0ac7ecce7fc402eb9eb8bb897a747f"
    },
    "pool": {
      "total": "24,999,500.00",
      "type": "teamandadvisors"
    }
  }
]
