module bitbucket.org/chromawallet/go-relay

go 1.20

require (
	github.com/ethereum/go-ethereum v1.13.0
	github.com/stretchr/testify v1.8.4
	go.uber.org/zap v1.25.0
)

require (
	github.com/bits-and-blooms/bitset v1.5.0 // indirect
	github.com/btcsuite/btcd/btcec/v2 v2.2.0 // indirect
	github.com/consensys/bavard v0.1.13 // indirect
	github.com/consensys/gnark-crypto v0.10.0 // indirect
	github.com/crate-crypto/go-kzg-4844 v0.3.0 // indirect
	github.com/davecgh/go-spew v1.1.1 // indirect
	github.com/decred/dcrd/dcrec/secp256k1/v4 v4.0.1 // indirect
	github.com/ethereum/c-kzg-4844 v0.3.1 // indirect
	github.com/go-stack/stack v1.8.1 // indirect
	github.com/holiman/uint256 v1.2.3 // indirect
	github.com/mmcloughlin/addchain v0.4.0 // indirect
	github.com/pmezard/go-difflib v1.0.0 // indirect
	github.com/supranational/blst v0.3.11 // indirect
	go.uber.org/multierr v1.10.0 // indirect
	golang.org/x/crypto v0.12.0 // indirect
	golang.org/x/sync v0.3.0 // indirect
	golang.org/x/sys v0.11.0 // indirect
	gopkg.in/yaml.v3 v3.0.1 // indirect
	rsc.io/tmplfunc v0.0.3 // indirect
)
