{
    "env": {
      "environment": "staging",
      "dcir_url": "https://dcir-staging.teamapt.com/login",
      "dcir_homepage_url": "https://dcir-staging.teamapt.com/back-office/dashboard",
      "dcir_username": "ugochukwu.ebirika@teamapt.com",
      "dcir_password": "password",
      "auth_page_url": "https://cosmos.development.teamapt.com/oauth2",
      "qmetry_base_url": "https://qtmcloud.qmetry.com/rest/api/latest",
      "apiKey": "abd94823ec81d18b177df1d89deda6e0e809b0dec73cf5c5954f76288234aa0e9b251c33a5c016ca34123b4d9faa1cf09f508a4113ae3af2a68ff4755aa2c466e5bd09bd847649073bf47f805d94383a",
      "recipientAlertMail": "kevinmullerhi@gmail.com",
      "userAlertMail":"kelvin.muli@moniepoint.com",
      "userAlertPassword": "ulgorsxnkkvseafx",
      "databaseConfigs": {
        "database1": {
          "host": "host1",
          "user": "user1",
          "password": "password1",
          "database": "database1",
          "port": 3306
        },
        "database2": {
          "host": "host2",
          "user": "user2",
          "password": "password2",
          "database": "database2",
          "port": 3306
        }
      }
    }
}