{
	"id": "c5985464-4739-4fca-a886-af1b70cb7101",
	"name": "Direct Debit",
	"values": [
		{
			"key": "sessionKey",
			"value": "",
			"type": "any",
			"enabled": true
		},
		{
			"key": "frontToken",
			"value": "",
			"type": "default",
			"enabled": true
		},
		{
			"key": "clientID",
			"value": "",
			"type": "any",
			"enabled": true
		},
		{
			"key": "clientSecret",
			"value": "",
			"type": "any",
			"enabled": true
		},
		{
			"key": "coreToken",
			"value": "",
			"type": "any",
			"enabled": true
		},
		{
			"key": "backToken",
			"value": "",
			"type": "any",
			"enabled": true
		},
		{
			"key": "aptPayREF",
			"value": "",
			"type": "any",
			"enabled": true
		},
		{
			"key": "paymentFacilitatorId",
			"value": "",
			"type": "any",
			"enabled": true
		},
		{
			"key": "myclientID",
			"value": "",
			"type": "any",
			"enabled": true
		},
		{
			"key": "myclientSecret",
			"value": "",
			"type": "any",
			"enabled": true
		},
		{
			"key": "Myref",
			"value": "",
			"type": "any",
			"enabled": true
		},
		{
			"key": "Myref_2",
			"value": "",
			"type": "any",
			"enabled": true
		},
		{
			"key": "sessionKEYnew",
			"value": "a963a82b8f1a462abf5094eb1982059c",
			"enabled": true
		},
		{
			"key": "testclientID",
			"value": "",
			"type": "any",
			"enabled": true
		},
		{
			"key": "testclientSecret",
			"value": "",
			"type": "any",
			"enabled": true
		},
		{
			"key": "mandateRef",
			"value": "",
			"type": "any",
			"enabled": true
		},
		{
			"key": "ValidAcctNumber",
			"value": "",
			"type": "any",
			"enabled": true
		},
		{
			"key": "mandateToken",
			"value": "",
			"type": "any",
			"enabled": true
		},
		{
			"key": "acctNumber",
			"value": "",
			"type": "any",
			"enabled": true
		},
		{
			"key": "merchantReference",
			"value": "",
			"type": "any",
			"enabled": true
		},
		{
			"key": "transactionToken",
			"value": "",
			"type": "any",
			"enabled": true
		},
		{
			"key": "dd_core_url",
			"value": "https://direct-debit-core.development.teamapt.com:443/api/v1",
			"enabled": true
		},
		{
			"key": "baseURL",
			"value": "https://direct-debit-backoffice.development.teamapt.com/api/v1",
			"enabled": true
		},
		{
			"key": "backoffice_username",
			"value": "",
			"type": "any",
			"enabled": true
		},
		{
			"key": "backoffice_password",
			"value": "",
			"type": "any",
			"enabled": true
		},
		{
			"key": "user",
			"value": "",
			"type": "any",
			"enabled": true
		},
		{
			"key": "amountPerDebit",
			"value": "",
			"type": "any",
			"enabled": true
		},
		{
			"key": "totalAmount",
			"value": "",
			"type": "any",
			"enabled": true
		},
		{
			"key": "totalCount",
			"value": "",
			"type": "any",
			"enabled": true
		},
		{
			"key": "OTP",
			"value": "",
			"type": "any",
			"enabled": true
		},
		{
			"key": "token",
			"value": "",
			"type": "any",
			"enabled": true
		},
		{
			"key": "bulkSettlementKey",
			"value": "",
			"type": "any",
			"enabled": true
		},
		{
			"key": "debitReference",
			"value": "",
			"type": "any",
			"enabled": true
		},
		{
			"key": "paymentFacilitatortransactionReference",
			"value": "",
			"type": "any",
			"enabled": true
		},
		{
			"key": "transactionReference",
			"value": "",
			"type": "any",
			"enabled": true
		},
		{
			"key": "mandateReference1",
			"value": "",
			"type": "any",
			"enabled": true
		},
		{
			"key": "mandateReference2",
			"value": "",
			"type": "any",
			"enabled": true
		},
		{
			"key": "paymentFac",
			"value": "",
			"type": "any",
			"enabled": true
		},
		{
			"key": "monitor",
			"value": "",
			"type": "any",
			"enabled": true
		},
		{
			"key": "maxAmountPerTransaction",
			"value": "",
			"type": "any",
			"enabled": true
		},
		{
			"key": "backDispute_token",
			"value": "",
			"type": "any",
			"enabled": true
		},
		{
			"key": "PF_initiator_token",
			"value": "",
			"type": "any",
			"enabled": true
		},
		{
			"key": "PF_resolver_token",
			"value": "",
			"type": "any",
			"enabled": true
		},
		{
			"key": "charge_type_code",
			"value": "",
			"type": "any",
			"enabled": true
		},
		{
			"key": "chageTypeName",
			"value": "",
			"type": "any",
			"enabled": true
		},
		{
			"key": "access_token",
			"value": "",
			"type": "any",
			"enabled": true
		},
		{
			"key": "accessToken",
			"value": "",
			"type": "any",
			"enabled": true
		},
		{
			"key": "workflowRef",
			"value": "",
			"type": "any",
			"enabled": true
		},
		{
			"key": "reference",
			"value": "",
			"type": "any",
			"enabled": true
		},
		{
			"key": "code",
			"value": "",
			"type": "any",
			"enabled": true
		},
		{
			"key": "nthCode",
			"value": "",
			"type": "any",
			"enabled": true
		},
		{
			"key": "mcc",
			"value": "",
			"type": "any",
			"enabled": true
		},
		{
			"key": "name",
			"value": "",
			"type": "any",
			"enabled": true
		},
		{
			"key": "mycode",
			"value": "",
			"type": "any",
			"enabled": true
		},
		{
			"key": "updatedMerchantCategoryCode",
			"value": "",
			"type": "any",
			"enabled": true
		},
		{
			"key": "updatedMerchantCategoryName",
			"value": "",
			"type": "any",
			"enabled": true
		},
		{
			"key": "email",
			"value": "",
			"type": "any",
			"enabled": true
		},
		{
			"key": "fname",
			"value": "",
			"type": "any",
			"enabled": true
		},
		{
			"key": "lname",
			"value": "",
			"type": "any",
			"enabled": true
		},
		{
			"key": "devURL",
			"value": "https://direct-debit-backoffice.development.teamapt.com/api/v1",
			"type": "default",
			"enabled": true
		},
		{
			"key": "widgetURL",
			"value": "https://direct-debit-widget.development.teamapt.com/api/v1",
			"enabled": true
		},
		{
			"key": "mobileURL",
			"value": "https://direct-debit-mobile-verification.development.teamapt.com:443/api/v1",
			"enabled": true
		}
	],
	"_postman_variable_scope": "environment",
	"_postman_exported_at": "2024-03-11T07:09:10.933Z",
	"_postman_exported_using": "Postman/10.17.7"
}