FK;KD_JENIS_TRANSAKSI;FG_PENGGANTI;NOMOR_FAKTUR;MASA_PAJAK;TAHUN_PAJAK;TANGGAL_FAKTUR;NPWP;NAMA;ALAMAT_LENGKAP;JUMLAH_DPP;JUMLAH_PPN;JUMLAH_PPNBM;ID_KETERANGAN_TAMBAHAN;FP_UANG_MUKA;UANG_MUKA_DPP;UANG_MUKA_PPN;UANG_MUKA_PPNBM;REFERENSI
LT;NPWP;NAMA;JALAN;BLOK;NOMOR;RT;RW;KECAMATAN;KELURAHAN;KABUPATEN;PROPINSI;KODE_POS;NOMOR_TELEPON
OF;KODE_OBJEK;NAMA;HARGA_SATUAN;JUMLAH_BARANG;HARGA_TOTAL;DISKON;DPP;PPN;TARIF_PPNBM;PPNBM
FK;01;0;0031972505848;6;2019;10/06/2019;674087382114000;"IDA FENNY ELYSA";"JL. DEBLOD SUNDORO NO. 41 LK. II";4512000;451200;0;0;0;0;0;0;52542
LT;674087382114000;"IDA FENNY ELYSA";-;-;-;0;0;-;-;-;-;-;-
OF;PP0405;"Magozai 750 ml (Beli 4 Gratis 2 Magozai 750 ml)";620400;8;4963200;0;4512000;451200;0;0
FK;01;0;0031972505865;6;2019;11/06/2019;061106084008000;"Mira Rebeka Sani";"Jl. Kesenian Blok O 1/12 Rt.016 Rw.009 Duren Sawit Jakarta Timur";2256000;225600;0;0;0;0;0;0;52558
LT;061106084008000;"Mira Rebeka Sani";-;-;-;0;0;-;-;-;-;-;-
OF;PP0405;"Magozai 750 ml (Beli 4 Gratis 2 Magozai 750 ml)";620400;4;2481600;0;2256000;225600;0;0
FK;01;0;0031972505866;6;2019;11/06/2019;061106084008000;"Mira Rebeka Sani";"Jl. Kesenian Blok O 1/12 Rt.016 Rw.009 Duren Sawit Jakarta Timur";2256000;225600;0;0;0;0;0;0;52559
LT;061106084008000;"Mira Rebeka Sani";-;-;-;0;0;-;-;-;-;-;-
OF;PP0405;"Magozai 750 ml (Beli 4 Gratis 2 Magozai 750 ml)";620400;4;2481600;0;2256000;225600;0;0
FK;01;0;0031972505867;6;2019;11/06/2019;061106084008000;"Mira Rebeka Sani";"Jl. Kesenian Blok O 1/12 Rt.016 Rw.009 Duren Sawit Jakarta Timur";2256000;225600;0;0;0;0;0;0;52560
LT;061106084008000;"Mira Rebeka Sani";-;-;-;0;0;-;-;-;-;-;-
OF;PP0405;"Magozai 750 ml (Beli 4 Gratis 2 Magozai 750 ml)";620400;4;2481600;0;2256000;225600;0;0
FK;01;0;0031972505868;6;2019;11/06/2019;061106084008000;"Mira Rebeka Sani";"Jl. Kesenian Blok O 1/12 Rt.016 Rw.009 Duren Sawit Jakarta Timur";2256000;225600;0;0;0;0;0;0;52561
LT;061106084008000;"Mira Rebeka Sani";-;-;-;0;0;-;-;-;-;-;-
OF;PP0405;"Magozai 750 ml (Beli 4 Gratis 2 Magozai 750 ml)";620400;4;2481600;0;2256000;225600;0;0
FK;01;0;0031972505869;6;2019;11/06/2019;061106084008000;"Mira Rebeka Sani";"Jl. Kesenian Blok O 1/12 Rt.016 Rw.009 Duren Sawit Jakarta Timur";4512000;451200;0;0;0;0;0;0;52562
LT;061106084008000;"Mira Rebeka Sani";-;-;-;0;0;-;-;-;-;-;-
OF;PP0405;"Magozai 750 ml (Beli 4 Gratis 2 Magozai 750 ml)";620400;8;4963200;0;4512000;451200;0;0
FK;01;0;0031972505870;6;2019;11/06/2019;061106084008000;"Mira Rebeka Sani";"Jl. Kesenian Blok O 1/12 Rt.016 Rw.009 Duren Sawit Jakarta Timur";2256000;225600;0;0;0;0;0;0;52563
LT;061106084008000;"Mira Rebeka Sani";-;-;-;0;0;-;-;-;-;-;-
OF;PP0405;"Magozai 750 ml (Beli 4 Gratis 2 Magozai 750 ml)";620400;4;2481600;0;2256000;225600;0;0
FK;01;0;0031972505871;6;2019;11/06/2019;061106084008000;"Mira Rebeka Sani";"Jl. Kesenian Blok O 1/12 Rt.016 Rw.009 Duren Sawit Jakarta Timur";2256000;225600;0;0;0;0;0;0;52564
LT;061106084008000;"Mira Rebeka Sani";-;-;-;0;0;-;-;-;-;-;-
OF;PP0405;"Magozai 750 ml (Beli 4 Gratis 2 Magozai 750 ml)";620400;4;2481600;0;2256000;225600;0;0
FK;01;0;0031972505872;6;2019;11/06/2019;061106084008000;"Mira Rebeka Sani";"Jl. Kesenian Blok O 1/12 Rt.016 Rw.009 Duren Sawit Jakarta Timur";1546437;154643;0;0;0;0;0;0;52565
LT;061106084008000;"Mira Rebeka Sani";-;-;-;0;0;-;-;-;-;-;-
OF;PP0492;"TOP UP Imuno Force 29,5rb";29500;20;590000;0;536364;53636;0;0
OF;PP0464;"Legalon (Beli 3 Gratis 1 Astagen)";370360;3;1111080;0;1010073;101007;0;0
FK;01;0;0031972505875;6;2019;11/06/2019;594682387037000;"Zainal Arifin.";"Jl. Thalib II No.5 Krukut - Tamansari Jakarta Barat";2256000;225600;0;0;0;0;0;0;52568
LT;594682387037000;"Zainal Arifin.";-;-;-;0;0;-;-;-;-;-;-
OF;PP0405;"Magozai 750 ml (Beli 4 Gratis 2 Magozai 750 ml)";620400;4;2481600;0;2256000;225600;0;0
FK;01;0;0031972505887;6;2019;11/06/2019;082738550831000;"Harun D. Tumbuan";"Komplek RSD Madani No.19 Kota Palu Sualwesi Tengah";2256000;225600;0;0;0;0;0;0;52580
LT;082738550831000;"Harun D. Tumbuan";-;-;-;0;0;-;-;-;-;-;-
OF;PP0405;"Magozai 750 ml (Beli 4 Gratis 2 Magozai 750 ml)";620400;4;2481600;0;2256000;225600;0;0
FK;01;0;0031972505889;6;2019;11/06/2019;061106084008000;"Mira Rebeka Sani";"Jl. Kesenian Blok O 1/12 Rt.016 Rw.009 Duren Sawit Jakarta Timur";11861091;1186109;0;0;0;0;0;0;52582
LT;061106084008000;"Mira Rebeka Sani";-;-;-;0;0;-;-;-;-;-;-
OF;PP0405;"Magozai 750 ml (Beli 4 Gratis 2 Magozai 750 ml)";620400;16;9926400;0;9024000;902400;0;0
OF;NT0032;Gravica;271660;10;2716600;0;2469636;246964;0;0
OF;PP0458;"Uticare (Beli 2  Gratis 1)";202100;2;404200;0;367455;36745;0;0
FK;01;0;0031972505890;6;2019;11/06/2019;061106084008000;"Mira Rebeka Sani";"Jl. Kesenian Blok O 1/12 Rt.016 Rw.009 Duren Sawit Jakarta Timur";540073;54007;0;0;0;0;0;0;52583
LT;061106084008000;"Mira Rebeka Sani";-;-;-;0;0;-;-;-;-;-;-
OF;PP0411;"Legres Beli 4 gratis 2";148520;4;594080;0;540073;54007;0;0
FK;01;0;0031972505900;6;2019;11/06/2019;061106084008000;"Mira Rebeka Sani";"Jl. Kesenian Blok O 1/12 Rt.016 Rw.009 Duren Sawit Jakarta Timur";2256000;225600;0;0;0;0;0;0;52592
LT;061106084008000;"Mira Rebeka Sani";-;-;-;0;0;-;-;-;-;-;-
OF;PP0405;"Magozai 750 ml (Beli 4 Gratis 2 Magozai 750 ml)";620400;4;2481600;0;2256000;225600;0;0
FK;01;0;0031972505903;6;2019;11/06/2019;061106084008000;"Mira Rebeka Sani";"Jl. Kesenian Blok O 1/12 Rt.016 Rw.009 Duren Sawit Jakarta Timur";4512000;451200;0;0;0;0;0;0;52595
LT;061106084008000;"Mira Rebeka Sani";-;-;-;0;0;-;-;-;-;-;-
OF;PP0405;"Magozai 750 ml (Beli 4 Gratis 2 Magozai 750 ml)";620400;8;4963200;0;4512000;451200;0;0
FK;01;0;0031972505925;6;2019;11/06/2019;061106084008000;"Mira Rebeka Sani";"Jl. Kesenian Blok O 1/12 Rt.016 Rw.009 Duren Sawit Jakarta Timur";999818;99982;0;0;0;0;0;0;52617
LT;061106084008000;"Mira Rebeka Sani";-;-;-;0;0;-;-;-;-;-;-
OF;PP0470;"Magozai Fruity(Buy3 Free 1 Mgz Fruit & 1 Strkidz)";366600;3;1099800;0;999818;99982;0;0
FK;01;0;0031972505986;6;2019;11/06/2019;674087382114000;"IDA FENNY ELYSA";"JL. DEBLOD SUNDORO NO. 41 LK. II";4512000;451200;0;0;0;0;0;0;52687
LT;674087382114000;"IDA FENNY ELYSA";-;-;-;0;0;-;-;-;-;-;-
OF;PP0405;"Magozai 750 ml (Beli 4 Gratis 2 Magozai 750 ml)";620400;8;4963200;0;4512000;451200;0;0
FK;01;0;0031972505990;6;2019;11/06/2019;061106084008000;"Mira Rebeka Sani";"Jl. Kesenian Blok O 1/12 Rt.016 Rw.009 Duren Sawit Jakarta Timur";29328000;2932800;0;0;0;0;0;0;52691
LT;061106084008000;"Mira Rebeka Sani";-;-;-;0;0;-;-;-;-;-;-
OF;PP0405;"Magozai 750 ml (Beli 4 Gratis 2 Magozai 750 ml)";620400;52;32260800;0;29328000;2932800;0;0
FK;01;0;0031972506589;6;2019;11/06/2019;061106084008000;"Mira Rebeka Sani";"Jl. Kesenian Blok O 1/12 Rt.016 Rw.009 Duren Sawit Jakarta Timur";705000;70500;0;0;0;0;0;0;52566
LT;061106084008000;"Mira Rebeka Sani";-;-;-;0;0;-;-;-;-;-;-
OF;PP0442;"Biorate (Beli 3 Gratis 1 Bee Propolis 90)";258500;3;775500;0;705000;70500;0;0
FK;01;0;0031972506007;6;2019;12/06/2019;594682387037000;"Zainal Arifin.";"Jl. Thalib II No.5 Krukut - Tamansari Jakarta Barat";222727;22273;0;0;0;0;0;0;52714
LT;594682387037000;"Zainal Arifin.";-;-;-;0;0;-;-;-;-;-;-
OF;PP0439;"TOP UP Blender Sharp 49rb";49000;5;245000;0;222727;22273;0;0
FK;01;0;0031972506026;6;2019;13/06/2019;082738550831000;"Harun D. Tumbuan";"Komplek RSD Madani No.19 Kota Palu Sualwesi Tengah";904545;90454;0;0;0;0;0;0;52731
LT;082738550831000;"Harun D. Tumbuan";-;-;-;0;0;-;-;-;-;-;-
OF;SK0084;"Starter Kit Juni 2019 Kolesterol 199rb";199000;5;995000;0;904545;90454;0;0
FK;01;0;0031972506054;6;2019;15/06/2019;061106084008000;"Mira Rebeka Sani";"Jl. Kesenian Blok O 1/12 Rt.016 Rw.009 Duren Sawit Jakarta Timur";3060982;306098;0;0;0;0;0;0;52754
LT;061106084008000;"Mira Rebeka Sani";-;-;-;0;0;-;-;-;-;-;-
OF;PP0463;"Glucosefit (Beli 3 Gratis 1 Asta-gold)";374120;9;3367080;0;3060982;306098;0;0
FK;01;0;0031972506059;6;2019;15/06/2019;061106084008000;"Mira Rebeka Sani";"Jl. Kesenian Blok O 1/12 Rt.016 Rw.009 Duren Sawit Jakarta Timur";1287273;128727;0;0;0;0;0;0;52758
LT;061106084008000;"Mira Rebeka Sani";-;-;-;0;0;-;-;-;-;-;-
OF;PP0493;"TOP UP Loyalty 2 Slim lock";59000;24;1416000;0;1287273;128727;0;0
FK;01;0;0031972506060;6;2019;15/06/2019;061106084008000;"Mira Rebeka Sani";"Jl. Kesenian Blok O 1/12 Rt.016 Rw.009 Duren Sawit Jakarta Timur";165782;16578;0;0;0;0;0;0;52759
LT;061106084008000;"Mira Rebeka Sani";-;-;-;0;0;-;-;-;-;-;-
OF;NT020006;"Echina-C Plus";182360;1;182360;0;165782;16578;0;0
FK;01;0;0031972506087;6;2019;18/06/2019;061106084008000;"Mira Rebeka Sani";"Jl. Kesenian Blok O 1/12 Rt.016 Rw.009 Duren Sawit Jakarta Timur";1902218;190222;0;0;0;0;0;0;52787
LT;061106084008000;"Mira Rebeka Sani";-;-;-;0;0;-;-;-;-;-;-
OF;PP0445;"DR. Skin set (gratis 1 Magozai 750 dan 1 Astagen)";1594240;1;1594240;0;1449309;144931;0;0
OF;PP0455;"Nutrimat (Beli 2 Gratis 1)";249100;2;498200;0;452909;45291;0;0
FK;01;0;0031972506115;6;2019;19/06/2019;061106084008000;"Mira Rebeka Sani";"Jl. Kesenian Blok O 1/12 Rt.016 Rw.009 Duren Sawit Jakarta Timur";1234818;123482;0;0;0;0;0;0;52823
LT;061106084008000;"Mira Rebeka Sani";-;-;-;0;0;-;-;-;-;-;-
OF;NT0032;Gravica;271660;5;1358300;0;1234818;123482;0;0
FK;01;0;0031972506198;6;2019;24/06/2019;061106084008000;"Mira Rebeka Sani";"Jl. Kesenian Blok O 1/12 Rt.016 Rw.009 Duren Sawit Jakarta Timur";905818;90582;0;0;0;0;0;0;52903
LT;061106084008000;"Mira Rebeka Sani";-;-;-;0;0;-;-;-;-;-;-
OF;PP0455;"Nutrimat (Beli 2 Gratis 1)";249100;4;996400;0;905818;90582;0;0
FK;01;0;0031972506209;6;2019;25/06/2019;672354446619000;"Surjana Dewi Effendy";"JL. Manyar Tirtoyoso Selatan 4 no. 11 RT 007 RW 005 Manyarsabrangan Mulyorejo surabaya";4943473;494346;0;0;0;0;0;0;52915
LT;672354446619000;"Surjana Dewi Effendy";-;-;-;0;0;-;-;-;-;-;-
OF;SK0084;"Starter Kit Juni 2019 Kolesterol 199rb";199000;2;398000;0;361818;36182;0;0
OF;PP0455;"Nutrimat (Beli 2 Gratis 1)";249100;4;996400;0;905818;90582;0;0
OF;NT0040;"Calway-C Jr";267900;1;267900;0;243545;24354;0;0
OF;NT0042;Legreskin;249100;1;249100;0;226455;22645;0;0
OF;NT0036;"Magozai 375 ml";385400;2;770800;0;700727;70073;0;0
OF;NT020024;StarKidz;124080;2;248160;0;225600;22560;0;0
OF;NT0050;Osteopain;321480;1;321480;0;292255;29225;0;0
OF;PP0442;"Biorate (Beli 3 Gratis 1 Bee Propolis 90)";258500;3;775500;0;705000;70500;0;0
OF;PP0467;"Calcium With Vit D (Beli 3 Gratis 2 Astagen)";295160;3;885480;0;804982;80498;0;0
OF;MT02526;"Catalog Vol 2 Th.2019 (100 pcs)";525000;1;525000;0;477273;47727;0;0
OF;MT0235;"Nota penjualan";0;2;0;0;0;0;0;0
FK;01;0;0031972506236;6;2019;25/06/2019;579473596823000;"Supantia Saleh";"Jl. Bitung Tengah RT.010 Rw.004. Bitung Tengah - Maesa Bitung";9092363;909237;0;0;0;0;0;0;52945
LT;579473596823000;"Supantia Saleh";-;-;-;0;0;-;-;-;-;-;-
OF;NT0042;Legreskin;249100;2;498200;0;452909;45291;0;0
OF;NT020018;"Renewskin 15";124080;3;372240;0;338400;33840;0;0
OF;PP0463;"Glucosefit (Beli 3 Gratis 1 Asta-gold)";374120;3;1122360;0;1020327;102033;0;0
OF;HF0015;"Bee Propolis 30";210560;2;421120;0;382836;38284;0;0
OF;PP0495;"Glucofit Susu (Beli 2 Gratis 1)";117500;2;235000;0;213636;21364;0;0
OF;PP0442;"Biorate (Beli 3 Gratis 1 Bee Propolis 90)";258500;3;775500;0;705000;70500;0;0
OF;PP0446;"Coformula 30(Beli 2 Gratis 2 Legres)";360960;2;721920;0;656291;65629;0;0
OF;PP0457;"Sonata Night (Beli 2 Gratis 1)";134420;2;268840;0;244400;24440;0;0
OF;NT0032;Gravica;271660;2;543320;0;493927;49393;0;0
OF;NT020001;Legres;125020;1;125020;0;113655;11365;0;0
OF;PP02319;"Nutrasetika Pack 1-Antioksidan (Free Magozai 750)";1612100;2;3224200;0;2931091;293109;0;0
OF;PP02321;"Nutrasetika Pack 3-Liver&Hepatitis;(Free AstaGold)";1693880;1;1693880;0;1539891;153989;0;0
FK;01;0;0031972506237;6;2019;25/06/2019;579473596823000;"Supantia Saleh";"Jl. Bitung Tengah RT.010 Rw.004. Bitung Tengah - Maesa Bitung";804546;80454;0;0;0;0;0;0;52946
LT;579473596823000;"Supantia Saleh";-;-;-;0;0;-;-;-;-;-;-
OF;PP0420;"TOP UP Biorate 59rb";59000;5;295000;0;268182;26818;0;0
OF;PP0422;"TOP UP Salmon Oil 30 59rb";59000;5;295000;0;268182;26818;0;0
OF;PP0493;"TOP UP Loyalty 2 Slim lock";59000;5;295000;0;268182;26818;0;0
FK;01;0;0031972506294;6;2019;27/06/2019;672354446619000;"Surjana Dewi Effendy";"JL. Manyar Tirtoyoso Selatan 4 no. 11 RT 007 RW 005 Manyarsabrangan Mulyorejo surabaya";9954310;995430;0;0;0;0;0;0;53009
LT;672354446619000;"Surjana Dewi Effendy";-;-;-;0;0;-;-;-;-;-;-
OF;NT0047;"FBCx 90";218080;1;218080;0;198255;19825;0;0
OF;PP0474;"Asta-Spa Set (Gratis 1 Asta-Spa Set)";587500;1;587500;0;534091;53409;0;0
OF;NT0037;"Magozai 750 ml";620400;2;1240800;0;1128000;112800;0;0
OF;PP0466;"Asta-Gen (Beli 3 Gratis 2 Legres)";307380;6;1844280;0;1676618;167662;0;0
OF;PP0467;"Calcium With Vit D (Beli 3 Gratis 2 Astagen)";295160;3;885480;0;804982;80498;0;0
OF;PP0469;"Magozai 750 (Beli 3 Free 1 Mgoz375  & 1 Astagen)";620400;9;5583600;0;5076000;507600;0;0
OF;PP0498;"TOP UP Macolic Junior 29,5rb";29500;10;295000;0;268182;26818;0;0
OF;PP0497;"TOP UP Gravica 59rb";59000;5;295000;0;268182;26818;0;0
FK;01;0;0031972506304;6;2019;28/06/2019;672354446619000;"Surjana Dewi Effendy";"JL. Manyar Tirtoyoso Selatan 4 no. 11 RT 007 RW 005 Manyarsabrangan Mulyorejo surabaya";551182;55118;0;0;0;0;0;0;53018
LT;672354446619000;"Surjana Dewi Effendy";-;-;-;0;0;-;-;-;-;-;-
OF;PP0496;"Uticare (Beli 3 Gratis 2)";202100;3;606300;0;551182;55118;0;0
FK;01;0;0031972506314;6;2019;28/06/2019;674087382114000;"IDA FENNY ELYSA";"JL. DEBLOD SUNDORO NO. 41 LK. II";536364;53636;0;0;0;0;0;0;53032
LT;674087382114000;"IDA FENNY ELYSA";-;-;-;0;0;-;-;-;-;-;-
OF;PP0499;"TOP UP Pureway-C 59rb";59000;10;590000;0;536364;53636;0;0
FK;01;0;0031972506318;6;2019;28/06/2019;082738550831000;"Harun D. Tumbuan";"Komplek RSD Madani No.19 Kota Palu Sualwesi Tengah";2360000;236000;0;0;0;0;0;0;53041
LT;082738550831000;"Harun D. Tumbuan";-;-;-;0;0;-;-;-;-;-;-
OF;PP0493;"TOP UP Loyalty 2 Slim lock";59000;44;2596000;0;2360000;236000;0;0
FK;01;0;0031972506649;6;2019;28/06/2019;674087382114000;"IDA FENNY ELYSA";"JL. DEBLOD SUNDORO NO. 41 LK. II";13112927;1311292;0;0;0;0;0;0;53033
LT;674087382114000;"IDA FENNY ELYSA";-;-;-;0;0;-;-;-;-;-;-
OF;NT0037;"Magozai 750 ml";620400;10;6204000;0;5640000;564000;0;0
OF;NT0035;Legres;148520;30;4455600;0;4050545;405054;0;0
OF;PP0466;"Asta-Gen (Beli 3 Gratis 2 Legres)";307380;9;2766420;0;2514927;251493;0;0
OF;PP0458;"Uticare (Beli 2  Gratis 1)";202100;2;404200;0;367455;36745;0;0
OF;SK0083;"Starter Kit Juni 2019 Reg 99rb";99000;6;594000;0;540000;54000;0;0
FK;01;0;0031972506653;6;2019;28/06/2019;082738550831000;"Harun D. Tumbuan";"Komplek RSD Madani No.19 Kota Palu Sualwesi Tengah";5410217;541021;0;0;0;0;0;0;53040
LT;082738550831000;"Harun D. Tumbuan";-;-;-;0;0;-;-;-;-;-;-
OF;PP0417;"Starkidz Beli 3 Gratis 1";124080;9;1116720;0;1015200;101520;0;0
OF;PP0464;"Legalon (Beli 3 Gratis 1 Astagen)";370360;6;2222160;0;2020145;202014;0;0
OF;PP0463;"Glucosefit (Beli 3 Gratis 1 Asta-gold)";374120;3;1122360;0;1020327;102033;0;0
OF;SK0083;"Starter Kit Juni 2019 Reg 99rb";99000;5;495000;0;450000;45000;0;0
OF;SK0084;"Starter Kit Juni 2019 Kolesterol 199rb";199000;5;995000;0;904545;90454;0;0
FK;01;0;0031972506340;6;2019;29/06/2019;061106084008000;"Mira Rebeka Sani";"Jl. Kesenian Blok O 1/12 Rt.016 Rw.009 Duren Sawit Jakarta Timur";214545;21454;0;0;0;0;0;0;53067
LT;061106084008000;"Mira Rebeka Sani";-;-;-;0;0;-;-;-;-;-;-
OF;PP0501;"TOP UP Echina C 59rb";59000;4;236000;0;214545;21454;0;0
FK;01;0;0031972506384;6;2019;29/06/2019;672354446619000;"Surjana Dewi Effendy";"JL. Manyar Tirtoyoso Selatan 4 no. 11 RT 007 RW 005 Manyarsabrangan Mulyorejo surabaya";1177618;117761;0;0;0;0;0;0;53122
LT;672354446619000;"Surjana Dewi Effendy";-;-;-;0;0;-;-;-;-;-;-
OF;NT0036;"Magozai 375 ml";385400;1;385400;0;350364;35036;0;0
OF;NT0041;"Magozai Fruity 375ml";366600;1;366600;0;333273;33327;0;0
OF;HF0017;"Bee Propolis Liquid";307380;1;307380;0;279436;27944;0;0
OF;PP0503;"TOP UP Slim Lock 59rb";59000;4;236000;0;214545;21454;0;0
FK;01;0;0031972506402;6;2019;29/06/2019;594682387037000;"Zainal Arifin.";"Jl. Thalib II No.5 Krukut - Tamansari Jakarta Barat";1692000;169200;0;0;0;0;0;0;53163
LT;594682387037000;"Zainal Arifin.";-;-;-;0;0;-;-;-;-;-;-
OF;PP0469;"Magozai 750 (Beli 3 Free 1 Mgoz375  & 1 Astagen)";620400;3;1861200;0;1692000;169200;0;0
FK;01;0;0031972506696;6;2019;29/06/2019;594682387037000;"Zainal Arifin.";"Jl. Thalib II No.5 Krukut - Tamansari Jakarta Barat";1692000;169200;0;0;0;0;0;0;53159
LT;594682387037000;"Zainal Arifin.";-;-;-;0;0;-;-;-;-;-;-
OF;PP0469;"Magozai 750 (Beli 3 Free 1 Mgoz375  & 1 Astagen)";620400;3;1861200;0;1692000;169200;0;0
FK;01;0;0031972506697;6;2019;29/06/2019;594682387037000;"Zainal Arifin.";"Jl. Thalib II No.5 Krukut - Tamansari Jakarta Barat";1692000;169200;0;0;0;0;0;0;53161
LT;594682387037000;"Zainal Arifin.";-;-;-;0;0;-;-;-;-;-;-
OF;PP0469;"Magozai 750 (Beli 3 Free 1 Mgoz375  & 1 Astagen)";620400;3;1861200;0;1692000;169200;0;0
FK;01;0;0031972506698;6;2019;29/06/2019;594682387037000;"Zainal Arifin.";"Jl. Thalib II No.5 Krukut - Tamansari Jakarta Barat";1398036;139804;0;0;0;0;0;0;53162
LT;594682387037000;"Zainal Arifin.";-;-;-;0;0;-;-;-;-;-;-
OF;PP02330;"Nutrasetika Pack 2-Antioksidan Plus (Coformula30)";1537840;1;1537840;0;1398036;139804;0;0
FK;01;0;0031972506483;6;2019;30/06/2019;579473596823000;"Supantia Saleh";"Jl. Bitung Tengah RT.010 Rw.004. Bitung Tengah - Maesa Bitung";4054637;405463;0;0;0;0;0;0;53256
LT;579473596823000;"Supantia Saleh";-;-;-;0;0;-;-;-;-;-;-
OF;NT0037;"Magozai 750 ml";620400;5;3102000;0;2820000;282000;0;0
OF;PP0500;"Gastrimag (Beli 3 gratis 2)";427700;3;1283100;0;1166455;116645;0;0
OF;MT02523;"Catalog Vol 2 Th.2019";7500;10;75000;0;68182;6818;0;0
FK;01;0;0031972506503;6;2019;30/06/2019;082738550831000;"Harun D. Tumbuan";"Komplek RSD Madani No.19 Kota Palu Sualwesi Tengah";2338891;233888;0;0;0;0;0;0;53277
LT;082738550831000;"Harun D. Tumbuan";-;-;-;0;0;-;-;-;-;-;-
OF;PP02319;"Nutrasetika Pack 1-Antioksidan (Free Magozai 750)";1612100;1;1612100;0;1465545;146554;0;0
OF;PP0458;"Uticare (Beli 2  Gratis 1)";202100;2;404200;0;367455;36745;0;0
OF;PP0449;"Asta-Gluco (Beli 2 Gratis 1)";278240;2;556480;0;505891;50589;0;0
FK;01;0;0031972506504;6;2019;30/06/2019;082738550831000;"Harun D. Tumbuan";"Komplek RSD Madani No.19 Kota Palu Sualwesi Tengah";2287636;228763;0;0;0;0;0;0;53278
LT;082738550831000;"Harun D. Tumbuan";-;-;-;0;0;-;-;-;-;-;-
OF;PP0505;"Starvitz Nutra Coklat 750gr (2 Gratis 2 Starkidz)";263200;2;526400;0;478545;47854;0;0
OF;SK0084;"Starter Kit Juni 2019 Kolesterol 199rb";199000;10;1990000;0;1809091;180909;0;0
FK;01;0;0031972506511;6;2019;30/06/2019;674087382114000;"IDA FENNY ELYSA";"JL. DEBLOD SUNDORO NO. 41 LK. II";804545;80454;0;0;0;0;0;0;53288
LT;674087382114000;"IDA FENNY ELYSA";-;-;-;0;0;-;-;-;-;-;-
OF;PP0503;"TOP UP Slim Lock 59rb";59000;15;885000;0;804545;80454;0;0
FK;01;0;0031972506517;6;2019;30/06/2019;082738550831000;"Harun D. Tumbuan";"Komplek RSD Madani No.19 Kota Palu Sualwesi Tengah";1386927;138693;0;0;0;0;0;0;53292
LT;082738550831000;"Harun D. Tumbuan";-;-;-;0;0;-;-;-;-;-;-
OF;NT0032;Gravica;271660;3;814980;0;740891;74089;0;0
OF;NT0038;Sistocare;281060;2;562120;0;511018;51102;0;0
OF;NT0035;Legres;148520;1;148520;0;135018;13502;0;0
FK;01;0;0031972506714;6;2019;30/06/2019;672354446619000;"Surjana Dewi Effendy";"JL. Manyar Tirtoyoso Selatan 4 no. 11 RT 007 RW 005 Manyarsabrangan Mulyorejo surabaya";1449309;144931;0;0;0;0;0;0;53284
LT;672354446619000;"Surjana Dewi Effendy";-;-;-;0;0;-;-;-;-;-;-
OF;PP0445;"DR. Skin set (gratis 1 Magozai 750 dan 1 Astagen)";1594240;1;1594240;0;1449309;144931;0;0
FK;01;0;0031972506715;6;2019;30/06/2019;674087382114000;"IDA FENNY ELYSA";"JL. DEBLOD SUNDORO NO. 41 LK. II";13633418;1363342;0;0;0;0;0;0;53286
LT;674087382114000;"IDA FENNY ELYSA";-;-;-;0;0;-;-;-;-;-;-
OF;PP0466;"Asta-Gen (Beli 3 Gratis 2 Legres)";307380;3;922140;0;838309;83831;0;0
OF;HF0023;"Salmon Oil (90)";356260;10;3562600;0;3238727;323873;0;0
OF;HF0022;"Salmon Oil (30)";194580;5;972900;0;884455;88445;0;0
OF;NT0029;"Calcium With Vit D";295160;6;1770960;0;1609964;160996;0;0
OF;NT0032;Gravica;271660;6;1629960;0;1481782;148178;0;0
OF;PP0460;"Bee Propolis 30 (Beli 3 Gratis 1)";210560;12;2526720;0;2297018;229702;0;0
OF;PP0458;"Uticare (Beli 2  Gratis 1)";202100;4;808400;0;734909;73491;0;0
OF;PP0455;"Nutrimat (Beli 2 Gratis 1)";249100;6;1494600;0;1358727;135873;0;0
OF;PP0452;"FBCx 90 (Beli 2 Gratis 1)";218080;6;1308480;0;1189527;118953;0;0
FK;01;0;0031972506716;6;2019;30/06/2019;674087382114000;"IDA FENNY ELYSA";"JL. DEBLOD SUNDORO NO. 41 LK. II";5188800;518880;0;0;0;0;0;0;53287
LT;674087382114000;"IDA FENNY ELYSA";-;-;-;0;0;-;-;-;-;-;-
OF;NT0037;"Magozai 750 ml";620400;8;4963200;0;4512000;451200;0;0
OF;PP0417;"Starkidz Beli 3 Gratis 1";124080;6;744480;0;676800;67680;0;0
