RK;NPWP;NAMA;KD_JENIS_TRANSAKSI;FG_PENGGANTI;NOMOR_FAKTUR;TANGGAL_FAKTUR;NO_DOKUMEN_FAKTUR;TANGGAL_RETUR;MASA_PAJAK_RETUR;TAHUN_PAJAK_RETUR;NILAI_RETUR_DPP;NILAI_RETUR_PPN;NILAI_RETUR_PPNBM
RK;061106084008000;"Mira Rebeka Sani";01;0;0021873663830;04/05/2018;0051/UHNCAB/RET/2018;04/05/2018;5;2018;448636;44864;0
RK;000000000000000;Delvira.;01;0;0021873663840;04/05/2018;0053/UHNCAB/RET/2018;08/05/2018;5;2018;45455;4545;0
RK;000000000000000;"Hildegardis Semi Andryani";01;0;0021873663892;08/05/2018;0052/UHNCAB/RET/2018;08/05/2018;5;2018;949400;94940;0
RK;000000000000000;INAM;01;0;0021873664135;18/05/2018;0054/UHNCAB/RET/2018;19/05/2018;5;2018;809255;80925;0
RK;000000000000000;"A Yudi Jaya Musradhy P";01;0;0021873664176;21/05/2018;0055/UHNCAB/RET/2018;21/05/2018;5;2018;490000;49000;0
RK;000000000000000;"MARWAN AMIR";01;0;0021873664275;24/05/2018;0056/UHNCAB/RET/2018;24/05/2018;5;2018;1419509;141951;0
RK;000000000000000;Delvira.;01;0;0021873664372;26/05/2018;0057/UHNCAB/RET/2018;28/05/2018;5;2018;652873;65287;0
RK;000000000000000;"Arlayda Kusmin MPH";01;0;0021873664438;28/05/2018;0061/UHNCAB/RET/2018;28/05/2018;5;2018;2580727;258073;0
RK;000000000000000;RUSTIMAH;01;0;0021873664383;28/05/2018;0058/UHNCAB/RET/2018;28/05/2018;5;2018;50182;5018;0
RK;000000000000000;"Ekawati Kolibu";01;0;0021873664418;28/05/2018;0059/UHNCAB/RET/2018;28/05/2018;5;2018;8745845;874585;0
RK;000000000000000;"Ekawati Kolibu";01;0;0021873664418;28/05/2018;0060/UHNCAB/RET/2018;28/05/2018;5;2018;6017127;601713;0
RK;000000000000000;"Rinawati Agus Trihastuti";01;0;0021873664519;30/05/2018;0062/UHNCAB/RET/2018;31/05/2018;5;2018;440945;44095;0
RK;000000000000000;Hendri;01;0;0021873664722;31/05/2018;0063/UHNCAB/RET/2018;31/05/2018;5;2018;2727709;272771;0
