FK;KD_JENIS_TRANSAKSI;FG_PENGGANTI;NOMOR_FAKTUR;MASA_PAJAK;TAHUN_PAJAK;TANGGAL_FAKTUR;NPWP;NAMA;ALAMAT_LENGKAP;JUMLAH_DPP;JUMLAH_PPN;JUMLAH_PPNBM;ID_KETERANGAN_TAMBAHAN;FP_UANG_MUKA;UANG_MUKA_DPP;UANG_MUKA_PPN;UANG_MUKA_PPNBM;REFERENSI
LT;NPWP;NAMA;JALAN;BLOK;NOMOR;RT;RW;KECAMATAN;KELURAHAN;KABUPATEN;PROPINSI;KODE_POS;NOMOR_TELEPON
OF;KODE_OBJEK;NAMA;HARGA_SATUAN;JUMLAH_BARANG;HARGA_TOTAL;DISKON;DPP;PPN;TARIF_PPNBM;PPNBM
FK;01;0;0041957567042;9;2019;05/09/2019;082738550831000;"Harun D. Tumbuan";"Komplek RSD Madani No.19 Kota Palu Sualwesi Tengah";536364;53636;0;0;0;0;0;0;56275
LT;082738550831000;"Harun D. Tumbuan";-;-;-;0;0;-;-;-;-;-;-
OF;PP0590;"TOP UP 10 Salmon Oil 90 590rb";590000;1;590000;0;536364;53636;0;0
FK;01;0;0041957567096;9;2019;05/09/2019;674087382114000;"IDA FENNY ELYSA";"JL. DEBLOD SUNDORO NO. 41 LK. II";2377909;237790;0;0;0;0;0;0;56332
LT;674087382114000;"IDA FENNY ELYSA";-;-;-;0;0;-;-;-;-;-;-
OF;PP0519;"ANA BIOSIS Compact Powder (1 get 1 Pureway-C)";206800;2;413600;0;376000;37600;0;0
OF;PP02319;"Nutrasetika Pack 1-Antioksidan (Free Magozai 750)";1612100;1;1612100;0;1465545;146554;0;0
OF;PP0590;"TOP UP 10 Salmon Oil 90 590rb";590000;1;590000;0;536364;53636;0;0
FK;01;0;0041957567101;9;2019;05/09/2019;674087382114000;"IDA FENNY ELYSA";"JL. DEBLOD SUNDORO NO. 41 LK. II";724364;72436;0;0;0;0;0;0;56340
LT;674087382114000;"IDA FENNY ELYSA";-;-;-;0;0;-;-;-;-;-;-
OF;PP0519;"ANA BIOSIS Compact Powder (1 get 1 Pureway-C)";206800;1;206800;0;188000;18800;0;0
OF;PP0590;"TOP UP 10 Salmon Oil 90 590rb";590000;1;590000;0;536364;53636;0;0
FK;01;0;0041957567102;9;2019;05/09/2019;674087382114000;"IDA FENNY ELYSA";"JL. DEBLOD SUNDORO NO. 41 LK. II";13937600;1393760;0;0;0;0;0;0;56342
LT;674087382114000;"IDA FENNY ELYSA";-;-;-;0;0;-;-;-;-;-;-
OF;PP0543;"Kidz pack 1 Coklat (Gratis 1 Magozai 750 mL)";1037760;2;2075520;0;1886836;188684;0;0
OF;NT0030;"Curcomplex 95";599720;2;1199440;0;1090400;109040;0;0
OF;PP0556;"Slim Shake (4 gratis 2)";357200;12;4286400;0;3896727;389673;0;0
OF;NT0037;"Magozai 750 ml";620400;8;4963200;0;4512000;451200;0;0
OF;HF0022;"Salmon Oil (30)";194580;5;972900;0;884455;88445;0;0
OF;NT0027;Asta-Gen;307380;5;1536900;0;1397182;139718;0;0
OF;SK0092;"Starter Kit September 2019 Reg 99rb";99000;3;297000;0;270000;27000;0;0
FK;01;0;0041957568111;9;2019;05/09/2019;082738550831000;"Harun D. Tumbuan";"Komplek RSD Madani No.19 Kota Palu Sualwesi Tengah";11106527;1110653;0;0;0;0;0;0;56276
LT;082738550831000;"Harun D. Tumbuan";-;-;-;0;0;-;-;-;-;-;-
OF;PP02331;"Nutrasetika Pack 5 PLUS-CareforCancer(Magozai750)";2112180;1;2112180;0;1920164;192016;0;0
OF;HF0023;"Salmon Oil (90)";356260;3;1068780;0;971618;97162;0;0
OF;NT020024;StarKidz;124080;16;1985280;0;1804800;180480;0;0
OF;NT0034;Legalon;370360;3;1111080;0;1010073;101007;0;0
OF;HF0020;Glucosefit;374120;4;1496480;0;1360436;136044;0;0
OF;NT0033;ImunoForce;87420;10;874200;0;794727;79473;0;0
OF;PP0528;"Glucofit Susu (Beli 4 Gratis 2)";117500;12;1410000;0;1281818;128182;0;0
OF;HF0021;Pureway-C;134420;10;1344200;0;1222000;122200;0;0
OF;NT0032;Gravica;271660;3;814980;0;740891;74089;0;0
OF;MT0235;"Nota penjualan";0;2;0;0;0;0;0;0
FK;01;0;0041957567115;9;2019;06/09/2019;674087382114000;"IDA FENNY ELYSA";"JL. DEBLOD SUNDORO NO. 41 LK. II";1465545;146554;0;0;0;0;0;0;56354
LT;674087382114000;"IDA FENNY ELYSA";-;-;-;0;0;-;-;-;-;-;-
OF;PP02319;"Nutrasetika Pack 1-Antioksidan (Free Magozai 750)";1612100;1;1612100;0;1465545;146554;0;0
FK;01;0;0041957567116;9;2019;06/09/2019;674087382114000;"IDA FENNY ELYSA";"JL. DEBLOD SUNDORO NO. 41 LK. II";427273;42727;0;0;0;0;0;0;56355
LT;674087382114000;"IDA FENNY ELYSA";-;-;-;0;0;-;-;-;-;-;-
OF;PP0593;"Glucofit (Beli 4 gratis 2 + 1 Shaker)";117500;4;470000;0;427273;42727;0;0
FK;01;0;0041957567117;9;2019;06/09/2019;674087382114000;"IDA FENNY ELYSA";"JL. DEBLOD SUNDORO NO. 41 LK. II";188000;18800;0;0;0;0;0;0;56356
LT;674087382114000;"IDA FENNY ELYSA";-;-;-;0;0;-;-;-;-;-;-
OF;PP0519;"ANA BIOSIS Compact Powder (1 get 1 Pureway-C)";206800;1;206800;0;188000;18800;0;0
FK;01;0;0041957567143;9;2019;08/09/2019;082738550831000;"Harun D. Tumbuan";"Komplek RSD Madani No.19 Kota Palu Sualwesi Tengah";1709091;170909;0;0;0;0;0;0;56376
LT;082738550831000;"Harun D. Tumbuan";-;-;-;0;0;-;-;-;-;-;-
OF;PP0593;"Glucofit (Beli 4 gratis 2 + 1 Shaker)";117500;16;1880000;0;1709091;170909;0;0
FK;01;0;0041957567144;9;2019;08/09/2019;082738550831000;"Harun D. Tumbuan";"Komplek RSD Madani No.19 Kota Palu Sualwesi Tengah";854545;85454;0;0;0;0;0;0;56377
LT;082738550831000;"Harun D. Tumbuan";-;-;-;0;0;-;-;-;-;-;-
OF;PP0593;"Glucofit (Beli 4 gratis 2 + 1 Shaker)";117500;8;940000;0;854545;85454;0;0
FK;01;0;0041957567145;9;2019;09/09/2019;082738550831000;"Harun D. Tumbuan";"Komplek RSD Madani No.19 Kota Palu Sualwesi Tengah";1072727;107273;0;0;0;0;0;0;56378
LT;082738550831000;"Harun D. Tumbuan";-;-;-;0;0;-;-;-;-;-;-
OF;PP0591;"TOP UP Loyalty 1 Starvitz Nutra 350g Vanilla";59000;20;1180000;0;1072727;107273;0;0
FK;01;0;0041957567161;9;2019;09/09/2019;672354446619000;"Surjana Dewi Effendy";"JL. Manyar Tirtoyoso Selatan 4 no. 11 RT 007 RW 005 Manyarsabrangan Mulyorejo surabaya";558873;55887;0;0;0;0;0;0;56390
LT;672354446619000;"Surjana Dewi Effendy";-;-;-;0;0;-;-;-;-;-;-
OF;HF0017;"Bee Propolis Liquid";307380;2;614760;0;558873;55887;0;0
FK;01;0;0041957567169;9;2019;09/09/2019;810976639732000;"Ir.HJ.Hayatun Fardah";"Jl. Garuda No.81 Kel. Komet Kec. Banjar Baru Utara Kab Banjarbaru - Kalimantan Selatan";3384000;338400;0;0;0;0;0;0;56399
LT;810976639732000;"Ir.HJ.Hayatun Fardah";-;-;-;0;0;-;-;-;-;-;-
OF;PP0490;"Magozai 750ml (Beli 3 Gratis 1)";620400;6;3722400;0;3384000;338400;0;0
FK;01;0;0041957567170;9;2019;09/09/2019;810976639732000;"Ir.HJ.Hayatun Fardah";"Jl. Garuda No.81 Kel. Komet Kec. Banjar Baru Utara Kab Banjarbaru - Kalimantan Selatan";1465545;146554;0;0;0;0;0;0;56400
LT;810976639732000;"Ir.HJ.Hayatun Fardah";-;-;-;0;0;-;-;-;-;-;-
OF;PP02319;"Nutrasetika Pack 1-Antioksidan (Free Magozai 750)";1612100;1;1612100;0;1465545;146554;0;0
FK;01;0;0041957567171;9;2019;09/09/2019;810976639732000;"Ir.HJ.Hayatun Fardah";"Jl. Garuda No.81 Kel. Komet Kec. Banjar Baru Utara Kab Banjarbaru - Kalimantan Selatan";388818;38882;0;0;0;0;0;0;56401
LT;810976639732000;"Ir.HJ.Hayatun Fardah";-;-;-;0;0;-;-;-;-;-;-
OF;NT0048;Gastrimag;427700;1;427700;0;388818;38882;0;0
FK;01;0;0041957568115;9;2019;09/09/2019;810976639732000;"Ir.HJ.Hayatun Fardah";"Jl. Garuda No.81 Kel. Komet Kec. Banjar Baru Utara Kab Banjarbaru - Kalimantan Selatan";1116036;111604;0;0;0;0;0;0;56398
LT;810976639732000;"Ir.HJ.Hayatun Fardah";-;-;-;0;0;-;-;-;-;-;-
OF;BY0033;"DR. Skin Anti Aging Eye Suppresor";234060;1;234060;0;212782;21278;0;0
OF;BY0036;"DR. Skin Anti Wrinkle Serum";431460;1;431460;0;392236;39224;0;0
OF;PP0515;"Adult Formula (Beli 1 Gratis 1)";562120;1;562120;0;511018;51102;0;0
FK;01;0;0041957567175;9;2019;10/09/2019;594682387037000;"Zainal Arifin.";"Jl. Thalib II No.5 Krukut - Tamansari Jakarta Barat";1692000;169200;0;0;0;0;0;0;56405
LT;594682387037000;"Zainal Arifin.";-;-;-;0;0;-;-;-;-;-;-
OF;PP0490;"Magozai 750ml (Beli 3 Gratis 1)";620400;3;1861200;0;1692000;169200;0;0
FK;01;0;0041957567179;9;2019;10/09/2019;810976639732000;"Ir.HJ.Hayatun Fardah";"Jl. Garuda No.81 Kel. Komet Kec. Banjar Baru Utara Kab Banjarbaru - Kalimantan Selatan";1827018;182702;0;0;0;0;0;0;56410
LT;810976639732000;"Ir.HJ.Hayatun Fardah";-;-;-;0;0;-;-;-;-;-;-
OF;PP0490;"Magozai 750ml (Beli 3 Gratis 1)";620400;3;1861200;0;1692000;169200;0;0
OF;NT0035;Legres;148520;1;148520;0;135018;13502;0;0
FK;01;0;0041957568117;9;2019;10/09/2019;810976639732000;"Ir.HJ.Hayatun Fardah";"Jl. Garuda No.81 Kel. Komet Kec. Banjar Baru Utara Kab Banjarbaru - Kalimantan Selatan";323873;32387;0;0;0;0;0;0;56418
LT;810976639732000;"Ir.HJ.Hayatun Fardah";-;-;-;0;0;-;-;-;-;-;-
OF;HF0023;"Salmon Oil (90)";356260;1;356260;0;323873;32387;0;0
FK;01;0;0041957567222;9;2019;11/09/2019;810976639732000;"Ir.HJ.Hayatun Fardah";"Jl. Garuda No.81 Kel. Komet Kec. Banjar Baru Utara Kab Banjarbaru - Kalimantan Selatan";9671455;967145;0;0;0;0;0;0;56455
LT;810976639732000;"Ir.HJ.Hayatun Fardah";-;-;-;0;0;-;-;-;-;-;-
OF;PP0490;"Magozai 750ml (Beli 3 Gratis 1)";620400;15;9306000;0;8460000;846000;0;0
OF;NT0035;Legres;148520;5;742600;0;675091;67509;0;0
OF;PP0596;"TOP UP 10 Sonata Night 590rb";590000;1;590000;0;536364;53636;0;0
FK;01;0;0041957567268;9;2019;11/09/2019;810976639732000;"Ir.HJ.Hayatun Fardah";"Jl. Garuda No.81 Kel. Komet Kec. Banjar Baru Utara Kab Banjarbaru - Kalimantan Selatan";5076000;507600;0;0;0;0;0;0;56506
LT;810976639732000;"Ir.HJ.Hayatun Fardah";-;-;-;0;0;-;-;-;-;-;-
OF;PP0490;"Magozai 750ml (Beli 3 Gratis 1)";620400;9;5583600;0;5076000;507600;0;0
FK;01;0;0041957567269;9;2019;11/09/2019;672354446619000;"Surjana Dewi Effendy";"JL. Manyar Tirtoyoso Selatan 4 no. 11 RT 007 RW 005 Manyarsabrangan Mulyorejo surabaya";5640000;564000;0;0;0;0;0;0;56507
LT;672354446619000;"Surjana Dewi Effendy";-;-;-;0;0;-;-;-;-;-;-
OF;PP0490;"Magozai 750ml (Beli 3 Gratis 1)";620400;9;5583600;0;5076000;507600;0;0
OF;NT0037;"Magozai 750 ml";620400;1;620400;0;564000;56400;0;0
FK;01;0;0041957567270;9;2019;11/09/2019;810976639732000;"Ir.HJ.Hayatun Fardah";"Jl. Garuda No.81 Kel. Komet Kec. Banjar Baru Utara Kab Banjarbaru - Kalimantan Selatan";1692000;169200;0;0;0;0;0;0;56508
LT;810976639732000;"Ir.HJ.Hayatun Fardah";-;-;-;0;0;-;-;-;-;-;-
OF;PP0490;"Magozai 750ml (Beli 3 Gratis 1)";620400;3;1861200;0;1692000;169200;0;0
FK;01;0;0041957567271;9;2019;11/09/2019;810976639732000;"Ir.HJ.Hayatun Fardah";"Jl. Garuda No.81 Kel. Komet Kec. Banjar Baru Utara Kab Banjarbaru - Kalimantan Selatan";1692000;169200;0;0;0;0;0;0;56509
LT;810976639732000;"Ir.HJ.Hayatun Fardah";-;-;-;0;0;-;-;-;-;-;-
OF;PP0490;"Magozai 750ml (Beli 3 Gratis 1)";620400;3;1861200;0;1692000;169200;0;0
FK;01;0;0041957567298;9;2019;11/09/2019;082738550831000;"Harun D. Tumbuan";"Komplek RSD Madani No.19 Kota Palu Sualwesi Tengah";11844000;1184400;0;0;0;0;0;0;56536
LT;082738550831000;"Harun D. Tumbuan";-;-;-;0;0;-;-;-;-;-;-
OF;PP0490;"Magozai 750ml (Beli 3 Gratis 1)";620400;21;13028400;0;11844000;1184400;0;0
FK;01;0;0041957567322;9;2019;11/09/2019;674087382114000;"IDA FENNY ELYSA";"JL. DEBLOD SUNDORO NO. 41 LK. II";7304364;730436;0;0;0;0;0;0;56563
LT;674087382114000;"IDA FENNY ELYSA";-;-;-;0;0;-;-;-;-;-;-
OF;PP0490;"Magozai 750ml (Beli 3 Gratis 1)";620400;12;7444800;0;6768000;676800;0;0
OF;PP0567;"TOP UP Starvitz Nutra Vanila 350gr";59000;10;590000;0;536364;53636;0;0
FK;01;0;0041957567323;9;2019;11/09/2019;674087382114000;"IDA FENNY ELYSA";"JL. DEBLOD SUNDORO NO. 41 LK. II";858182;85818;0;0;0;0;0;0;56564
LT;674087382114000;"IDA FENNY ELYSA";-;-;-;0;0;-;-;-;-;-;-
OF;PP0567;"TOP UP Starvitz Nutra Vanila 350gr";59000;16;944000;0;858182;85818;0;0
FK;01;0;0041957567341;9;2019;12/09/2019;810976639732000;"Ir.HJ.Hayatun Fardah";"Jl. Garuda No.81 Kel. Komet Kec. Banjar Baru Utara Kab Banjarbaru - Kalimantan Selatan";7564436;756444;0;0;0;0;0;0;56578
LT;810976639732000;"Ir.HJ.Hayatun Fardah";-;-;-;0;0;-;-;-;-;-;-
OF;NT0035;Legres;148520;1;148520;0;135018;13502;0;0
OF;HF0019;"Coformula 60";635440;1;635440;0;577673;57767;0;0
OF;HF0016;"Bee Propolis 90";563060;3;1689180;0;1535618;153562;0;0
OF;NT0043;"Oste Forte 30";268840;1;268840;0;244400;24440;0;0
OF;HF0020;Glucosefit;374120;4;1496480;0;1360436;136044;0;0
OF;NT0037;"Magozai 750 ml";620400;5;3102000;0;2820000;282000;0;0
OF;NT0034;Legalon;370360;2;740720;0;673382;67338;0;0
OF;NT0058;"Imuno Batuk Plus";239700;1;239700;0;217909;21791;0;0
FK;01;0;0041957568126;9;2019;12/09/2019;810976639732000;"Ir.HJ.Hayatun Fardah";"Jl. Garuda No.81 Kel. Komet Kec. Banjar Baru Utara Kab Banjarbaru - Kalimantan Selatan";2392727;239273;0;0;0;0;0;0;56579
LT;810976639732000;"Ir.HJ.Hayatun Fardah";-;-;-;0;0;-;-;-;-;-;-
OF;NT0060;"Starvitz Nutra Coklat 750gr";263200;10;2632000;0;2392727;239273;0;0
FK;01;0;0041957567397;9;2019;17/09/2019;810976639732000;"Ir.HJ.Hayatun Fardah";"Jl. Garuda No.81 Kel. Komet Kec. Banjar Baru Utara Kab Banjarbaru - Kalimantan Selatan";414509;41451;0;0;0;0;0;0;56632
LT;810976639732000;"Ir.HJ.Hayatun Fardah";-;-;-;0;0;-;-;-;-;-;-
OF;NT0047;"FBCx 90";218080;2;436160;0;396509;39651;0;0
OF;MT02530;"Catalog Vol 3 Th.2019";9900;2;19800;0;18000;1800;0;0
FK;01;0;0041957567425;9;2019;17/09/2019;810976639732000;"Ir.HJ.Hayatun Fardah";"Jl. Garuda No.81 Kel. Komet Kec. Banjar Baru Utara Kab Banjarbaru - Kalimantan Selatan";159800;15980;0;0;0;0;0;0;56662
LT;810976639732000;"Ir.HJ.Hayatun Fardah";-;-;-;0;0;-;-;-;-;-;-
OF;BY0037;"DR. Olamine Medicated Shampoo";175780;1;175780;0;159800;15980;0;0
FK;01;0;0041957568129;9;2019;17/09/2019;810976639732000;"Ir.HJ.Hayatun Fardah";"Jl. Garuda No.81 Kel. Komet Kec. Banjar Baru Utara Kab Banjarbaru - Kalimantan Selatan";511018;51102;0;0;0;0;0;0;56658
LT;810976639732000;"Ir.HJ.Hayatun Fardah";-;-;-;0;0;-;-;-;-;-;-
OF;PP0515;"Adult Formula (Beli 1 Gratis 1)";562120;1;562120;0;511018;51102;0;0
FK;01;0;0041957568130;9;2019;17/09/2019;810976639732000;"Ir.HJ.Hayatun Fardah";"Jl. Garuda No.81 Kel. Komet Kec. Banjar Baru Utara Kab Banjarbaru - Kalimantan Selatan";647745;64774;0;0;0;0;0;0;56659
LT;810976639732000;"Ir.HJ.Hayatun Fardah";-;-;-;0;0;-;-;-;-;-;-
OF;HF0023;"Salmon Oil (90)";356260;2;712520;0;647745;64774;0;0
FK;01;0;0041957568131;9;2019;17/09/2019;810976639732000;"Ir.HJ.Hayatun Fardah";"Jl. Garuda No.81 Kel. Komet Kec. Banjar Baru Utara Kab Banjarbaru - Kalimantan Selatan";239273;23927;0;0;0;0;0;0;56660
LT;810976639732000;"Ir.HJ.Hayatun Fardah";-;-;-;0;0;-;-;-;-;-;-
OF;NT0060;"Starvitz Nutra Coklat 750gr";263200;1;263200;0;239273;23927;0;0
FK;01;0;0041957568132;9;2019;17/09/2019;810976639732000;"Ir.HJ.Hayatun Fardah";"Jl. Garuda No.81 Kel. Komet Kec. Banjar Baru Utara Kab Banjarbaru - Kalimantan Selatan";212782;21278;0;0;0;0;0;0;56661
LT;810976639732000;"Ir.HJ.Hayatun Fardah";-;-;-;0;0;-;-;-;-;-;-
OF;BY0033;"DR. Skin Anti Aging Eye Suppresor";234060;1;234060;0;212782;21278;0;0
FK;01;0;0041957567430;9;2019;18/09/2019;082738550831000;"Harun D. Tumbuan";"Komplek RSD Madani No.19 Kota Palu Sualwesi Tengah";1483545;148354;0;0;0;0;0;0;56667
LT;082738550831000;"Harun D. Tumbuan";-;-;-;0;0;-;-;-;-;-;-
OF;PP02319;"Nutrasetika Pack 1-Antioksidan (Free Magozai 750)";1612100;1;1612100;0;1465545;146554;0;0
OF;MT02530;"Catalog Vol 3 Th.2019";9900;2;19800;0;18000;1800;0;0
FK;01;0;0041957567436;9;2019;18/09/2019;810976639732000;"Ir.HJ.Hayatun Fardah";"Jl. Garuda No.81 Kel. Komet Kec. Banjar Baru Utara Kab Banjarbaru - Kalimantan Selatan";154546;15454;0;0;0;0;0;0;56672
LT;810976639732000;"Ir.HJ.Hayatun Fardah";-;-;-;0;0;-;-;-;-;-;-
OF;PP0591;"TOP UP Loyalty 1 Starvitz Nutra 350g Vanilla";59000;2;118000;0;107273;10727;0;0
OF;MT02530;"Catalog Vol 3 Th.2019";9900;5;49500;0;45000;4500;0;0
OF;MT0237;"Pricelist Vol. 3";500;5;2500;0;2273;227;0;0
OF;MT0235;"Nota penjualan";0;2;0;0;0;0;0;0
FK;01;0;0041957567437;9;2019;18/09/2019;810976639732000;"Ir.HJ.Hayatun Fardah";"Jl. Garuda No.81 Kel. Komet Kec. Banjar Baru Utara Kab Banjarbaru - Kalimantan Selatan";804545;80454;0;0;0;0;0;0;56673
LT;810976639732000;"Ir.HJ.Hayatun Fardah";-;-;-;0;0;-;-;-;-;-;-
OF;PP0591;"TOP UP Loyalty 1 Starvitz Nutra 350g Vanilla";59000;15;885000;0;804545;80454;0;0
FK;01;0;0041957567495;9;2019;21/09/2019;082738550831000;"Harun D. Tumbuan";"Komplek RSD Madani No.19 Kota Palu Sualwesi Tengah";4906800;490680;0;0;0;0;0;0;56737
LT;082738550831000;"Harun D. Tumbuan";-;-;-;0;0;-;-;-;-;-;-
OF;PP0441;"Curcomplex 95 (Beli 3 Gratis 1 Magozai 750ml)";599720;9;5397480;0;4906800;490680;0;0
FK;01;0;0041957567509;9;2019;23/09/2019;594682387037000;"Zainal Arifin.";"Jl. Thalib II No.5 Krukut - Tamansari Jakarta Barat";1635600;163560;0;0;0;0;0;0;56749
LT;594682387037000;"Zainal Arifin.";-;-;-;0;0;-;-;-;-;-;-
OF;PP0441;"Curcomplex 95 (Beli 3 Gratis 1 Magozai 750ml)";599720;3;1799160;0;1635600;163560;0;0
FK;01;0;0041957567538;9;2019;23/09/2019;594682387037000;"Zainal Arifin.";"Jl. Thalib II No.5 Krukut - Tamansari Jakarta Barat";45000;4500;0;0;0;0;0;0;56781
LT;594682387037000;"Zainal Arifin.";-;-;-;0;0;-;-;-;-;-;-
OF;MT02530;"Catalog Vol 3 Th.2019";9900;5;49500;0;45000;4500;0;0
FK;01;0;0041957567554;9;2019;24/09/2019;082738550831000;"Harun D. Tumbuan";"Komplek RSD Madani No.19 Kota Palu Sualwesi Tengah";2025273;202527;0;0;0;0;0;0;56798
LT;082738550831000;"Harun D. Tumbuan";-;-;-;0;0;-;-;-;-;-;-
OF;PP0587;"Legres (3 Get 1)";148520;15;2227800;0;2025273;202527;0;0
FK;01;0;0041957567558;9;2019;24/09/2019;478640824626000;"Anang Purwito";"Jl.SLAMET RIYADI GANG CENTRAL KAV 7 JEMBER 68112";1352400;135239;0;0;0;0;0;0;56803
LT;478640824626000;"Anang Purwito";-;-;-;0;0;-;-;-;-;-;-
OF;NT0029;"Calcium With Vit D";307720;1;307720;0;279745;27974;0;0
OF;NT0035;Legres;154840;4;619360;0;563055;56305;0;0
OF;NT0043;"Oste Forte 30";280280;2;560560;0;509600;50960;0;0
FK;01;0;0041957567607;9;2019;25/09/2019;594682387037000;"Zainal Arifin.";"Jl. Thalib II No.5 Krukut - Tamansari Jakarta Barat";1324545;132454;0;0;0;0;0;0;56854
LT;594682387037000;"Zainal Arifin.";-;-;-;0;0;-;-;-;-;-;-
OF;SK0094;"Starter Kit September 2019 Slimming Starter Pack";1457000;1;1457000;0;1324545;132454;0;0
FK;01;0;0041957567609;9;2019;25/09/2019;082738550831000;"Harun D. Tumbuan";"Komplek RSD Madani No.19 Kota Palu Sualwesi Tengah";4468418;446841;0;0;0;0;0;0;56856
LT;082738550831000;"Harun D. Tumbuan";-;-;-;0;0;-;-;-;-;-;-
OF;PP0587;"Legres (3 Get 1)";148520;15;2227800;0;2025273;202527;0;0
OF;PP0555;"Oste Forte (Beli 4 Gratis 2)";268840;4;1075360;0;977600;97760;0;0
OF;PP02319;"Nutrasetika Pack 1-Antioksidan (Free Magozai 750)";1612100;1;1612100;0;1465545;146554;0;0
FK;01;0;0041957567610;9;2019;25/09/2019;082738550831000;"Harun D. Tumbuan";"Komplek RSD Madani No.19 Kota Palu Sualwesi Tengah";536364;53636;0;0;0;0;0;0;56857
LT;082738550831000;"Harun D. Tumbuan";-;-;-;0;0;-;-;-;-;-;-
OF;PP0599;"TOP UP anabiosis(5 compact powder+5 facial scrub)";590000;1;590000;0;536364;53636;0;0
FK;01;0;0041957567616;9;2019;25/09/2019;674087382114000;"IDA FENNY ELYSA";"JL. DEBLOD SUNDORO NO. 41 LK. II";536364;53636;0;0;0;0;0;0;56867
LT;674087382114000;"IDA FENNY ELYSA";-;-;-;0;0;-;-;-;-;-;-
OF;PP0599;"TOP UP anabiosis(5 compact powder+5 facial scrub)";590000;1;590000;0;536364;53636;0;0
FK;01;0;0041957567617;9;2019;25/09/2019;674087382114000;"IDA FENNY ELYSA";"JL. DEBLOD SUNDORO NO. 41 LK. II";4050545;405054;0;0;0;0;0;0;56868
LT;674087382114000;"IDA FENNY ELYSA";-;-;-;0;0;-;-;-;-;-;-
OF;PP0587;"Legres (3 Get 1)";148520;30;4455600;0;4050545;405054;0;0
FK;01;0;0041957567618;9;2019;25/09/2019;810976639732000;"Ir.HJ.Hayatun Fardah";"Jl. Garuda No.81 Kel. Komet Kec. Banjar Baru Utara Kab Banjarbaru - Kalimantan Selatan";4666672;466668;0;0;0;0;0;0;56871
LT;810976639732000;"Ir.HJ.Hayatun Fardah";-;-;-;0;0;-;-;-;-;-;-
OF;PP0587;"Legres (3 Get 1)";148520;24;3564480;0;3240436;324044;0;0
OF;PP0556;"Slim Shake (4 gratis 2)";357200;4;1428800;0;1298909;129891;0;0
OF;NT0062;"Starvitz Nutra Coklat 350gr";140060;1;140060;0;127327;12733;0;0
FK;01;0;0041957567630;9;2019;25/09/2019;594682387037000;"Zainal Arifin.";"Jl. Thalib II No.5 Krukut - Tamansari Jakarta Barat";832328;83232;0;0;0;0;0;0;56881
LT;594682387037000;"Zainal Arifin.";-;-;-;0;0;-;-;-;-;-;-
OF;PP0528;"Glucofit Susu (Beli 4 Gratis 2)";117500;4;470000;0;427273;42727;0;0
OF;PP0587;"Legres (3 Get 1)";148520;3;445560;0;405055;40505;0;0
FK;01;0;0041957567648;9;2019;25/09/2019;082738550831000;"Harun D. Tumbuan";"Komplek RSD Madani No.19 Kota Palu Sualwesi Tengah";838309;83831;0;0;0;0;0;0;56897
LT;082738550831000;"Harun D. Tumbuan";-;-;-;0;0;-;-;-;-;-;-
OF;PP0588;"Asta-gen (3 get 1)";307380;3;922140;0;838309;83831;0;0
FK;01;0;0041957567659;9;2019;25/09/2019;672354446619000;"Surjana Dewi Effendy";"JL. Manyar Tirtoyoso Selatan 4 no. 11 RT 007 RW 005 Manyarsabrangan Mulyorejo surabaya";7231909;723190;0;0;0;0;0;0;56907
LT;672354446619000;"Surjana Dewi Effendy";-;-;-;0;0;-;-;-;-;-;-
OF;NT0028;Biorate;258500;1;258500;0;235000;23500;0;0
OF;HF0018;"Coformula 30";360960;1;360960;0;328145;32814;0;0
OF;HF0019;"Coformula 60";635440;1;635440;0;577673;57767;0;0
OF;HF0020;Glucosefit;374120;1;374120;0;340109;34011;0;0
OF;NT0041;"Magozai Fruity 375ml";366600;1;366600;0;333273;33327;0;0
OF;HF0023;"Salmon Oil (90)";356260;1;356260;0;323873;32387;0;0
OF;PP0588;"Asta-gen (3 get 1)";307380;9;2766420;0;2514927;251493;0;0
OF;PP0587;"Legres (3 Get 1)";148520;15;2227800;0;2025273;202527;0;0
OF;MT02538;"Catalog Vol 3 Th.2019 (100 pcs)";609000;1;609000;0;553636;55364;0;0
FK;01;0;0041957567671;9;2019;25/09/2019;672354446619000;"Surjana Dewi Effendy";"JL. Manyar Tirtoyoso Selatan 4 no. 11 RT 007 RW 005 Manyarsabrangan Mulyorejo surabaya";1243364;124336;0;0;0;0;0;0;56919
LT;672354446619000;"Surjana Dewi Effendy";-;-;-;0;0;-;-;-;-;-;-
OF;PP0588;"Asta-gen (3 get 1)";307380;3;922140;0;838309;83831;0;0
OF;PP0587;"Legres (3 Get 1)";148520;3;445560;0;405055;40505;0;0
FK;01;0;0041957568147;9;2019;25/09/2019;082738550831000;"Harun D. Tumbuan";"Komplek RSD Madani No.19 Kota Palu Sualwesi Tengah";5375091;537509;0;0;0;0;0;0;56858
LT;082738550831000;"Harun D. Tumbuan";-;-;-;0;0;-;-;-;-;-;-
OF;NT0037;"Magozai 750 ml";620400;5;3102000;0;2820000;282000;0;0
OF;PP0515;"Adult Formula (Beli 1 Gratis 1)";562120;5;2810600;0;2555091;255509;0;0
FK;01;0;0041957568151;9;2019;25/09/2019;674087382114000;"IDA FENNY ELYSA";"JL. DEBLOD SUNDORO NO. 41 LK. II";5640000;564000;0;0;0;0;0;0;56869
LT;674087382114000;"IDA FENNY ELYSA";-;-;-;0;0;-;-;-;-;-;-
OF;NT0037;"Magozai 750 ml";620400;10;6204000;0;5640000;564000;0;0
FK;01;0;0041957568152;9;2019;25/09/2019;674087382114000;"IDA FENNY ELYSA";"JL. DEBLOD SUNDORO NO. 41 LK. II";1128000;112800;0;0;0;0;0;0;56870
LT;674087382114000;"IDA FENNY ELYSA";-;-;-;0;0;-;-;-;-;-;-
OF;NT0037;"Magozai 750 ml";620400;2;1240800;0;1128000;112800;0;0
FK;01;0;0041957567675;9;2019;26/09/2019;594682387037000;"Zainal Arifin.";"Jl. Thalib II No.5 Krukut - Tamansari Jakarta Barat";90000;9000;0;0;0;0;0;0;56924
LT;594682387037000;"Zainal Arifin.";-;-;-;0;0;-;-;-;-;-;-
OF;SK0092;"Starter Kit September 2019 Reg 99rb";99000;1;99000;0;90000;9000;0;0
FK;01;0;0041957567678;9;2019;26/09/2019;594682387037000;"Zainal Arifin.";"Jl. Thalib II No.5 Krukut - Tamansari Jakarta Barat";90000;9000;0;0;0;0;0;0;56927
LT;594682387037000;"Zainal Arifin.";-;-;-;0;0;-;-;-;-;-;-
OF;SK0092;"Starter Kit September 2019 Reg 99rb";99000;1;99000;0;90000;9000;0;0
FK;01;0;0041957567793;9;2019;28/09/2019;082738550831000;"Harun D. Tumbuan";"Komplek RSD Madani No.19 Kota Palu Sualwesi Tengah";7447927;744792;0;0;0;0;0;0;57045
LT;082738550831000;"Harun D. Tumbuan";-;-;-;0;0;-;-;-;-;-;-
OF;PP02333;"Nutrasetika Pack 7-Sendi&Osteoarthitis;(Mgzai 750)";1180640;2;2361280;0;2146618;214662;0;0
OF;PP0602;"Magozai 750 (Beli 3 Free 1 Mgoz375 & 1 Legres)";620400;6;3722400;0;3384000;338400;0;0
OF;PP0600;"Anabiosis Compact Powder (3 Get 2)";206800;3;620400;0;564000;56400;0;0
OF;PP0520;"ANA BIOSIS Set plus Compact Powder(1 Get 1 Mgz750)";898640;1;898640;0;816945;81694;0;0
OF;PP0601;"TOP UP 10 Nutrimat 590rb";590000;1;590000;0;536364;53636;0;0
OF;MT0235;"Nota penjualan";0;2;0;0;0;0;0;0
FK;01;0;0041957568166;9;2019;28/09/2019;082738550831000;"Harun D. Tumbuan";"Komplek RSD Madani No.19 Kota Palu Sualwesi Tengah";3948000;394800;0;0;0;0;0;0;57044
LT;082738550831000;"Harun D. Tumbuan";-;-;-;0;0;-;-;-;-;-;-
OF;NT0037;"Magozai 750 ml";620400;7;4342800;0;3948000;394800;0;0
FK;01;0;0041957567857;9;2019;30/09/2019;594682387037000;"Zainal Arifin.";"Jl. Thalib II No.5 Krukut - Tamansari Jakarta Barat";1692000;169200;0;0;0;0;0;0;57132
LT;594682387037000;"Zainal Arifin.";-;-;-;0;0;-;-;-;-;-;-
OF;PP0602;"Magozai 750 (Beli 3 Free 1 Mgoz375 & 1 Legres)";620400;3;1861200;0;1692000;169200;0;0
FK;01;0;0041957567882;9;2019;30/09/2019;594682387037000;"Zainal Arifin.";"Jl. Thalib II No.5 Krukut - Tamansari Jakarta Barat";1039127;103913;0;0;0;0;0;0;57161
LT;594682387037000;"Zainal Arifin.";-;-;-;0;0;-;-;-;-;-;-
OF;NT0037;"Magozai 750 ml";620400;1;620400;0;564000;56400;0;0
OF;NT0035;Legres;148520;1;148520;0;135018;13502;0;0
OF;HF0020;Glucosefit;374120;1;374120;0;340109;34011;0;0
FK;01;0;0041957567890;9;2019;30/09/2019;594682387037000;"Zainal Arifin.";"Jl. Thalib II No.5 Krukut - Tamansari Jakarta Barat";90000;9000;0;0;0;0;0;0;57176
LT;594682387037000;"Zainal Arifin.";-;-;-;0;0;-;-;-;-;-;-
OF;SK0092;"Starter Kit September 2019 Reg 99rb";99000;1;99000;0;90000;9000;0;0
FK;01;0;0041957567926;9;2019;30/09/2019;594682387037000;"Zainal Arifin.";"Jl. Thalib II No.5 Krukut - Tamansari Jakarta Barat";90000;9000;0;0;0;0;0;0;57214
LT;594682387037000;"Zainal Arifin.";-;-;-;0;0;-;-;-;-;-;-
OF;SK0092;"Starter Kit September 2019 Reg 99rb";99000;1;99000;0;90000;9000;0;0
FK;01;0;0041957567930;9;2019;30/09/2019;082738550831000;"Harun D. Tumbuan";"Komplek RSD Madani No.19 Kota Palu Sualwesi Tengah";3157545;315754;0;0;0;0;0;0;57221
LT;082738550831000;"Harun D. Tumbuan";-;-;-;0;0;-;-;-;-;-;-
OF;PP0602;"Magozai 750 (Beli 3 Free 1 Mgoz375 & 1 Legres)";620400;3;1861200;0;1692000;169200;0;0
OF;PP02319;"Nutrasetika Pack 1-Antioksidan (Free Magozai 750)";1612100;1;1612100;0;1465545;146554;0;0
FK;01;0;0041957567931;9;2019;30/09/2019;082738550831000;"Harun D. Tumbuan";"Komplek RSD Madani No.19 Kota Palu Sualwesi Tengah";1953200;195320;0;0;0;0;0;0;57222
LT;082738550831000;"Harun D. Tumbuan";-;-;-;0;0;-;-;-;-;-;-
OF;BY0034;"DR. Skin Anti Aging Stem Cell Day and Night Cream";779260;2;1558520;0;1416836;141684;0;0
OF;PP0591;"TOP UP Loyalty 1 Starvitz Nutra 350g Vanilla";59000;10;590000;0;536364;53636;0;0
FK;01;0;0041957567997;9;2019;30/09/2019;594682387037000;"Zainal Arifin.";"Jl. Thalib II No.5 Krukut - Tamansari Jakarta Barat";1692000;169200;0;0;0;0;0;0;57300
LT;594682387037000;"Zainal Arifin.";-;-;-;0;0;-;-;-;-;-;-
OF;PP0602;"Magozai 750 (Beli 3 Free 1 Mgoz375 & 1 Legres)";620400;3;1861200;0;1692000;169200;0;0
FK;01;0;0041957568000;9;2019;30/09/2019;579473596823000;"Supantia Saleh";"Jl. Bitung Tengah RT.010 Rw.004. Bitung Tengah - Maesa Bitung";4590618;459061;0;0;0;0;0;0;57303
LT;579473596823000;"Supantia Saleh";-;-;-;0;0;-;-;-;-;-;-
OF;HF0023;"Salmon Oil (90)";356260;2;712520;0;647745;64774;0;0
OF;PP0526;"FBCx 90 (Beli 4 Gratis 3)";218080;4;872320;0;793018;79302;0;0
OF;NT0035;Legres;148520;11;1633720;0;1485200;148520;0;0
OF;NT0029;"Calcium With Vit D";295160;2;590320;0;536655;53665;0;0
OF;NT0037;"Magozai 750 ml";620400;2;1240800;0;1128000;112800;0;0
FK;01;0;0041957568107;9;2019;30/09/2019;594682387037000;"Zainal Arifin.";"Jl. Thalib II No.5 Krukut - Tamansari Jakarta Barat";79473;7947;0;0;0;0;0;0;57416
LT;594682387037000;"Zainal Arifin.";-;-;-;0;0;-;-;-;-;-;-
OF;NT0033;ImunoForce;87420;1;87420;0;79473;7947;0;0
FK;01;0;0041957568178;9;2019;30/09/2019;594682387037000;"Zainal Arifin.";"Jl. Thalib II No.5 Krukut - Tamansari Jakarta Barat";1398036;139804;0;0;0;0;0;0;57118
LT;594682387037000;"Zainal Arifin.";-;-;-;0;0;-;-;-;-;-;-
OF;PP02330;"Nutrasetika Pack 2-Antioksidan Plus (Coformula30)";1537840;1;1537840;0;1398036;139804;0;0
FK;01;0;0041957568179;9;2019;30/09/2019;594682387037000;"Zainal Arifin.";"Jl. Thalib II No.5 Krukut - Tamansari Jakarta Barat";1298909;129891;0;0;0;0;0;0;57119
LT;594682387037000;"Zainal Arifin.";-;-;-;0;0;-;-;-;-;-;-
OF;PP0556;"Slim Shake (4 gratis 2)";357200;4;1428800;0;1298909;129891;0;0
FK;01;0;0041957568180;9;2019;30/09/2019;594682387037000;"Zainal Arifin.";"Jl. Thalib II No.5 Krukut - Tamansari Jakarta Barat";1465545;146554;0;0;0;0;0;0;57120
LT;594682387037000;"Zainal Arifin.";-;-;-;0;0;-;-;-;-;-;-
OF;PP02319;"Nutrasetika Pack 1-Antioksidan (Free Magozai 750)";1612100;1;1612100;0;1465545;146554;0;0
FK;01;0;0041957568203;9;2019;30/09/2019;674087382114000;"IDA FENNY ELYSA";"JL. DEBLOD SUNDORO NO. 41 LK. II";2514073;251407;0;0;0;0;0;0;57250
LT;674087382114000;"IDA FENNY ELYSA";-;-;-;0;0;-;-;-;-;-;-
OF;NT020024;StarKidz;124080;11;1364880;0;1240800;124080;0;0
OF;NT0062;"Starvitz Nutra Coklat 350gr";140060;10;1400600;0;1273273;127327;0;0
