RK;NPWP;NAMA;KD_JENIS_TRANSAKSI;FG_PENGGANTI;NOMOR_FAKTUR;TANGGAL_FAKTUR;NO_DOKUMEN_FAKTUR;TANGGAL_RETUR;MASA_PAJAK_RETUR;TAHUN_PAJAK_RETUR;NILAI_RETUR_DPP;NILAI_RETUR_PPN;NILAI_RETUR_PPNBM
RK;000000000000000;"Rusiani Ely";01;0;0041509111676;06/11/2015;025/UHNCAB/RET/2015;06/11/2015;11;2015;4018073;401807;0
RK;000000000000000;"BERTINUS SIJABAT";01;0;0041509111799;14/11/2015;026/UHNCAB/RET/2015;14/11/2015;11;2015;8693291;869329;0
RK;000000000000000;"Novita G Huby";01;0;0041509111823;16/11/2015;027/UHNCAB/RET/2015;16/11/2015;11;2015;3045600;304560;0
RK;000000000000000;"Citra Meylin Jantoy.A.md";01;0;0041509111767;12/11/2015;028/UHNCAB/RET/2015;23/11/2015;11;2015;21271600;2127160;0
RK;000000000000000;"Citra Meylin Jantoy.A.md";01;0;0041509111767;12/11/2015;029/UHNCAB/RET/2015;23/11/2015;11;2015;12161273;1216127;0
RK;000000000000000;"Marry Hartini Lidan";01;0;0041534881495;30/11/2015;030/UHNCAB/RET/2015;30/11/2015;11;2015;5659655;565965;0
RK;000000000000000;"suleman mile.";01;0;0041534881508;30/11/2015;031/UHNCAB/RET/2015;30/11/2015;11;2015;5224691;522469;0
