0SP202005080033059008 00030331               00000000466753242.0000302BCA               BONUS MEMBER      APRIL 2020                                                                                                                                            
17685051231                                          00000000004706971.00A YUDI JAYA MUSRADHY P                                                B      0140397    BCA               Sungguminasa      BONUS MEMBER      APRIL 2020                          1R014
10665045078                                          00000000000101796.00AB YULIANTO OR PRISCILLA                                              B      0140397    BCA               Kemang Pratama    BONUS MEMBER      APRIL 2020                          1R014
13880409866                                          00000000000209710.00ACHMAD YUSUF DR SPKK                                                  B      0140397    BCA               Dharmahusada SurabBONUS MEMBER      APRIL 2020                          1R014
17910573050                                          00000000001039530.00ADRYAN FRISTIOHADI MSC-A                                              B      0140397    BCA               Kendari           BONUS MEMBER      APRIL 2020                          1R014
10321137252                                          00000000000101796.00AGNES SADIKIN                                                         B      0140397    BCA               0000000000        BONUS MEMBER      APRIL 2020                          1R014
17360166532                                          00000000000583984.00AGUS RINI SULISTIOWATY                                                B      0140397    BCA               tajur             BONUS MEMBER      APRIL 2020                          1R014
17400957996                                          00000000000182598.00AGUSNA                                                                B      0140397    BCA               CIBUBUR           BONUS MEMBER      APRIL 2020                          1R014
13900241151                                          00000000000101797.00AGUSTINA TANDILINTIN                                                  B      0140397    BCA               KCP Pettarani     BONUS MEMBER      APRIL 2020                          1R014
18600554868                                          00000000000105968.00AHMAD RACHYUDI PUTRA                                                  B      0140397    BCA               Palangka Raya     BONUS MEMBER      APRIL 2020                          1R014
10662705878                                          00000000000075025.00AKKASE                                                                B      0140397    BCA               Proyek Bekasi     BONUS MEMBER      APRIL 2020                          1R014
14582204377                                          00000000001183357.00ALDO LAMMY                                                            B      0140397    BCA               Jakarta           BONUS MEMBER      APRIL 2020                          1R014
12581605007                                          00000000000371748.00ALFRYATI VENTHY SANDA SAU TAN                                         B      0140397    BCA               Surabaya          BONUS MEMBER      APRIL 2020                          1R014
10120423045                                          00000000001854451.00ALIYA NAINAWA ZAINAL ARIFIN                                           B      0140397    BCA               Gajah Mada        BONUS MEMBER      APRIL 2020                          1R014
12200053624                                          00000000000116735.00AMAN YULIUS                                                           B      0140397    BCA               Pekanbaru         BONUS MEMBER      APRIL 2020                          1R014
14582369929                                          00000000000101748.00AMELIA KURNIASIH S SOS                                                B      0140397    BCA               BURSA EFEK        BONUS MEMBER      APRIL 2020                          1R014
14130329727                                          00000000000209273.00AMELIA TEDDY                                                          B      0140397    BCA               Kelapa Gading VillBONUS MEMBER      APRIL 2020                          1R014
17890103213                                          00000000000106356.00ANDI SUGIRATU LA TINRO                                                B      0140397    BCA               Makassar          BONUS MEMBER      APRIL 2020                          1R014
12731332888                                          00000000000052084.00ANDRY                                                                 B      0140397    BCA               JAKARTA           BONUS MEMBER      APRIL 2020                          1R014
17910710600                                          00000000000100972.00ANGELA WILDA GEODELITA Z                                              B      0140397    BCA               Kendari           BONUS MEMBER      APRIL 2020                          1R014
18690593301                                          00000000000210098.00ANITA JAMALUDIN SE                                                    B      0140397    BCA               Depok             BONUS MEMBER      APRIL 2020                          1R014
16720068379                                          00000000000101797.00ANNA TRISULA AL LO TJIOE                                              B      0140397    BCA               taman pondok indahBONUS MEMBER      APRIL 2020                          1R014
10320912555                                          00000000000155195.00ANTONY FIRGO IR                                                       B      0140397    BCA               KCU Padang        BONUS MEMBER      APRIL 2020                          1R014
10255775125                                          00000000000329747.00APRIYANTO LIFANDY                                                     B      0140397    BCA               Makassar          BONUS MEMBER      APRIL 2020                          1R014
11970182825                                          00000000000101796.00ARIANNY BUDIMAN SH                                                    B      0140397    BCA               Cipanas           BONUS MEMBER      APRIL 2020                          1R014
14690111948                                          00000000001785572.00ARIE YUNITAWATI SUHARSON                                              B      0140397    BCA               Surabaya          BONUS MEMBER      APRIL 2020                          1R014
16495090608                                          00000000000102864.00ARMAN                                                                 B      0140397    BCA               Baubau            BONUS MEMBER      APRIL 2020                          1R014
10431223430                                          00000000000101894.00ASNAWI                                                                B      0140397    BCA               Banda Aceh        BONUS MEMBER      APRIL 2020                          1R014
18690298652                                          00000000000128375.00ASRIZAL                                                               B      0140397    BCA               Margonda depok    BONUS MEMBER      APRIL 2020                          1R014
10341940051                                          00000000000122798.00AYU IRMA YESSY                                                        B      0140397    BCA               Sudirman PekanbaruBONUS MEMBER      APRIL 2020                          1R014
14212295292                                          00000000000168921.00BUDI RAHARDJO                                                         B      0140397    BCA               Margonda Depok    BONUS MEMBER      APRIL 2020                          1R014
10182608325                                          00000000001210701.00BUDI SANTOSO GUNAWAN                                                  B      0140397    BCA               Sidoarjo          BONUS MEMBER      APRIL 2020                          1R014
11681402735                                          00000000000066780.00BUDIMAN SABARUDDIN                                                    B      0140397    BCA               jakarta           BONUS MEMBER      APRIL 2020                          1R014
15210146387                                          00000000003226604.00BUNNAWATI                                                             B      0140397    BCA               bulever hijau     BONUS MEMBER      APRIL 2020                          1R014
10103448899                                          00000000000360083.00CALVIN ALEXANDER EFANS J                                              B      0140397    BCA               Veteran           BONUS MEMBER      APRIL 2020                          1R014
10931230921                                          00000000000337497.00CANDRA WIJAYA                                                         B      0140397    BCA               sunter            BONUS MEMBER      APRIL 2020                          1R014
10657787888                                          00000000000315391.00CASANDRA MARTA                                                        B      0140397    BCA               KCU Kelapa Gading BONUS MEMBER      APRIL 2020                          1R014
13691033021                                          00000000002119804.00CHARLIE BUDIMAN SH                                                    B      0140397    BCA               Tanah Abang       BONUS MEMBER      APRIL 2020                          1R014
14710032497                                          00000000003026492.00CHARLOTHA PUTRI SHARON                                                B      0140397    BCA               Surabaya          BONUS MEMBER      APRIL 2020                          1R014
10255687382                                          00000000000116298.00CHATERINE LIFANDY                                                     B      0140397    BCA               KCU MAKASSAR      BONUS MEMBER      APRIL 2020                          1R014
11700200953                                          00000000000102331.00CHRISTIE MONINGKEY                                                    B      0140397    BCA               Tomohon           BONUS MEMBER      APRIL 2020                          1R014
11681159849                                          00000000000060475.00CIANTO YAPAR                                                          B      0140397    BCA               Jembatan Dua      BONUS MEMBER      APRIL 2020                          1R014
12540095739                                          00000000000126629.00CORINA LUCHAS                                                         B      0140397    BCA               samarinda         BONUS MEMBER      APRIL 2020                          1R014
18050030734                                          00000000000125222.00CORNELIA CHANDRA BSC                                                  B      0140397    BCA               bukittinggi       BONUS MEMBER      APRIL 2020                          1R014
10430970968                                          00000000000103300.00CUT ZAKIA PUTRI FANDANI                                               B      0140397    BCA               BANDA ACEH        BONUS MEMBER      APRIL 2020                          1R014
10101676888                                          00000000000051745.00DAISY HAKSARINI                                                       B      0140397    BCA               Surabaya          BONUS MEMBER      APRIL 2020                          1R014
13451721435                                          00000000000229546.00DAMAYANTI                                                             B      0140397    BCA               Pondok lestari    BONUS MEMBER      APRIL 2020                          1R014
11630357205                                          00000000000635734.00DARMAWAN TEDJA                                                        B      0140397    BCA               Padang            BONUS MEMBER      APRIL 2020                          1R014
17920315482                                          00000000000930617.00DARUSMAN M LAMANGKAU SE                                               B      0140397    BCA               Palu              BONUS MEMBER      APRIL 2020                          1R014
17880500583                                          00000000005646076.00DEASY BUNGA MAYASASARI                                                B      0140397    BCA               kcu galaxy        BONUS MEMBER      APRIL 2020                          1R014
17025018966                                          00000000000101796.00DELLY MULIARIADI                                                      B      0140397    BCA               000000000         BONUS MEMBER      APRIL 2020                          1R014
11192097287                                          00000000011428463.00DELVIRA                                                               B      0140397    BCA               Jambi             BONUS MEMBER      APRIL 2020                          1R014
16070317069                                          00000000000179494.00DESSY NATALIA MANOPPO                                                 B      0140397    BCA               Bina Mulia        BONUS MEMBER      APRIL 2020                          1R014
17880492262                                          00000000000209418.00DEWI HESTYANA                                                         B      0140397    BCA               Surabaya          BONUS MEMBER      APRIL 2020                          1R014
18600528727                                          00000000000050581.00DIANI RAHMIDA                                                         B      0140397    BCA               Palangka Raya     BONUS MEMBER      APRIL 2020                          1R014
17920178531                                          00000000001569180.00DIONISIUS RORI PARENGKUA                                              B      0140397    BCA               palu              BONUS MEMBER      APRIL 2020                          1R014
14730197280                                          00000000000270577.00DJOHAN BUNAWAN GANI                                                   B      0140397    BCA               Pamulang          BONUS MEMBER      APRIL 2020                          1R014
12150181073                                          00000000000101458.00DR JOHAN PRASETYO, SP KFR                                             B      0140397    BCA               Surabaya          BONUS MEMBER      APRIL 2020                          1R014
16870836005                                          00000000000100778.00DR. MARIJANTY LEARNY V.T.B                                            B      0140397    BCA               Bekasi            BONUS MEMBER      APRIL 2020                          1R014
17920489065                                          00000000000102949.00DRS JUNAING                                                           B      0140397    BCA               Palu              BONUS MEMBER      APRIL 2020                          1R014
17245149689                                          00000000000102718.00DRS. MUSTAFA. M                                                       B      0140397    BCA               Kendari           BONUS MEMBER      APRIL 2020                          1R014
11830773718                                          00000000000208827.00DWI QHORINUR AKHIM M YAS                                              B      0140397    BCA               Cianjur           BONUS MEMBER      APRIL 2020                          1R014
11191809942                                          00000000000263738.00EKA YULI ASTUTI                                                       B      0140397    BCA               JAMBI             BONUS MEMBER      APRIL 2020                          1R014
12881041172                                          00000000000105483.00ELEAZAR SIMON                                                         B      0140397    BCA               KCU PURI INDAH    BONUS MEMBER      APRIL 2020                          1R014
10021223785                                          00000000000405262.00ELLYJATY SALIM                                                        B      0140397    BCA               00000000000000000 BONUS MEMBER      APRIL 2020                          1R014
10700175308                                          00000000000376840.00ELWIN SALUGARA PURBODINI                                              B      0140397    BCA               PEKANBARU         BONUS MEMBER      APRIL 2020                          1R014
12581563851                                          00000000011866878.00EMMY INDRIATY                                                         B      0140397    BCA               Diponegoro        BONUS MEMBER      APRIL 2020                          1R014
15415035435                                          00000000000849667.00ENDY MUHARDIN MOEGNI DR                                               B      0140397    BCA               KCP MALL GRAND INDBONUS MEMBER      APRIL 2020                          1R014
15065069935                                          00000000000270383.00ENI SUHARTATIK                                                        B      0140397    BCA               tropodo           BONUS MEMBER      APRIL 2020                          1R014
16730274112                                          00000000000266891.00ERNA SULASTRI, SE                                                     B      0140397    BCA               Rungkut           BONUS MEMBER      APRIL 2020                          1R014
10091516160                                          00000000000100778.00ERNESTINE RADHIKA SHELLA PUTRI                                        B      0140397    BCA               Semarang          BONUS MEMBER      APRIL 2020                          1R014
12910256958                                          00000000000119596.00ERNI YUDIAWATY                                                        B      0140397    BCA               Pondok indah      BONUS MEMBER      APRIL 2020                          1R014
10183675131                                          00000000000104610.00ERVINA SUHENDRO                                                       B      0140397    BCA               Sidoarjo          BONUS MEMBER      APRIL 2020                          1R014
11084639977                                          00000000004927508.00ERWAN HERLAMBANG                                                      B      0140397    BCA               TANGERANG CITY MALBONUS MEMBER      APRIL 2020                          1R014
10281796967                                          00000000000101797.00ESTER JULIATI SUSANTO                                                 B      0140397    BCA               Jakarta           BONUS MEMBER      APRIL 2020                          1R014
12881053146                                          00000000000101796.00ESTER JUNINGSIH SUDIONO                                               B      0140397    BCA               Jakarta           BONUS MEMBER      APRIL 2020                          1R014
14650374903                                          00000000000156364.00ESTER PAULINA KUSLOSARIR                                              B      0140397    BCA               PERAK             BONUS MEMBER      APRIL 2020                          1R014
16155020567                                          00000000000164120.00ESTER TJENDRAWATI                                                     B      0140397    BCA               Sidoarjo          BONUS MEMBER      APRIL 2020                          1R014
15740054777                                          00000000000066198.00ESTHER SETIAWATY HALIM                                                B      0140397    BCA               000000            BONUS MEMBER      APRIL 2020                          1R014
17010860312                                          00000000000125465.00EVERLYN MAGALINE                                                      B      0140397    BCA               Metro Permata     BONUS MEMBER      APRIL 2020                          1R014
11401026571                                          00000000000258306.00FATMA FAUZIA                                                          B      0140397    BCA               Pare              BONUS MEMBER      APRIL 2020                          1R014
13422364673                                          00000000000104416.00FERNANDI DR                                                           B      0140397    BCA               KCU MATRAMAN      BONUS MEMBER      APRIL 2020                          1R014
17920546000                                          00000000000050144.00FIFI YULIANTI SALIM                                                   B      0140397    BCA               Palu              BONUS MEMBER      APRIL 2020                          1R014
10354330802                                          00000000000423110.00FIKRI FAUZI                                                           B      0140397    BCA               jakarta           BONUS MEMBER      APRIL 2020                          1R014
17970003651                                          00000000004002205.00FITRIYANTI RASYID                                                     B      0140397    BCA               Makassar          BONUS MEMBER      APRIL 2020                          1R014
10491569688                                          00000000018407833.00FRANSISKUS YANNO SOERATMAN                                            B      0140397    BCA               maluku            BONUS MEMBER      APRIL 2020                          1R014
10255875375                                          00000000000115765.00GEMA TAKBIR MUH. SURYA T, SE                                          B      0140397    BCA               Makassar          BONUS MEMBER      APRIL 2020                          1R014
16280144396                                          00000000000066198.00GO ARIESTA NUGROHO                                                    B      0140397    BCA               DEPOK             BONUS MEMBER      APRIL 2020                          1R014
17920780088                                          00000000000105289.00GRACIA STEFANI TJIOE                                                  B      0140397    BCA               Palu              BONUS MEMBER      APRIL 2020                          1R014
15610136615                                          00000000000102428.00H SUBKHAN DRS                                                         B      0140397    BCA               kcu gresik        BONUS MEMBER      APRIL 2020                          1R014
17260909546                                          00000000001279426.00HADI SOEDJAJA PRAMONO                                                 B      0140397    BCA               DPS Surabaya      BONUS MEMBER      APRIL 2020                          1R014
17670410468                                          00000000000052715.00HALARI INSAN IHSANI                                                   B      0140397    BCA               Sesetan           BONUS MEMBER      APRIL 2020                          1R014
13900389212                                          00000000001088394.00HAMSIAH SANGKALA                                                      B      0140397    BCA               Makassar          BONUS MEMBER      APRIL 2020                          1R014
11611191079                                          00000000000066198.00HARTATI BUDIMAN                                                       B      0140397    BCA               Mangga Dua        BONUS MEMBER      APRIL 2020                          1R014
17795019669                                          00000000006882449.00HARUN DALING TUMBUAN                                                  B      0140397    BCA               Palu              BONUS MEMBER      APRIL 2020                          1R014
17920475943                                          00000000000158445.00HASNIAH SYAH,DR                                                       B      0140397    BCA               Palu              BONUS MEMBER      APRIL 2020                          1R014
17685089955                                          00000000002318048.00HASNIH S                                                              B      0140397    BCA               sungguminasa      BONUS MEMBER      APRIL 2020                          1R014
12370147615                                          00000000000057080.00HASWEDY DINO, ST., MT., ARST.                                         B      0140397    BCA               PONDOK INDAH      BONUS MEMBER      APRIL 2020                          1R014
11271073378                                          00000000000150103.00HENNY ISKANDAR                                                        B      0140397    BCA               127               BONUS MEMBER      APRIL 2020                          1R014
15110144468                                          00000000000861967.00HENNY JUARIA                                                          B      0140397    BCA               Surabaya          BONUS MEMBER      APRIL 2020                          1R014
10880652192                                          00000000001062000.00HERLIN YUNARA                                                         B      0140397    BCA               Sby Darmo Raya    BONUS MEMBER      APRIL 2020                          1R014
12903845619                                          00000000000367092.00HERMAN AMIL S HUT                                                     B      0140397    BCA               KCP Somba Opu     BONUS MEMBER      APRIL 2020                          1R014
10251598010                                          00000000000100924.00HERMAN, S. SI.                                                        B      0140397    BCA               KCU Makassar      BONUS MEMBER      APRIL 2020                          1R014
10940750938                                          00000000000592908.00HJ LILY IRIANA                                                        B      0140397    BCA               0                 BONUS MEMBER      APRIL 2020                          1R014
17160038327                                          00000000000946085.00HJ. NETTY NASIR                                                       B      0140397    BCA               MT Haryono        BONUS MEMBER      APRIL 2020                          1R014
17920342544                                          00000000000051745.00HJ.ERNY                                                               B      0140397    BCA               Palu              BONUS MEMBER      APRIL 2020                          1R014
16805111503                                          00000000000275766.00HJALMAR SIHOMBING DRS                                                 B      0140397    BCA               KCP MENARA THAMRINBONUS MEMBER      APRIL 2020                          1R014
18290179972                                          00000000000334160.00HO RIYANTO                                                            B      0140397    BCA               HR Muhammad SurabaBONUS MEMBER      APRIL 2020                          1R014
17890150807                                          00000000000264854.00HUSEN                                                                 B      0140397    BCA               Panakukang        BONUS MEMBER      APRIL 2020                          1R014
10661064721                                          00000000001862541.00IGNATIUS BAMBANG BROTOSA                                              B      0140397    BCA               bsd               BONUS MEMBER      APRIL 2020                          1R014
10291362418                                          00000000010879812.00IMACULATA KORNIA                                                      B      0140397    BCA               BCA RAHADI USMAN  BONUS MEMBER      APRIL 2020                          1R014
11981615498                                          00000000000691994.00IMANUEL ADAM                                                          B      0140397    BCA               Taman Ratu        BONUS MEMBER      APRIL 2020                          1R014
11440327261                                          00000000000101239.00IMELDA ESTER MARLINDA S                                               B      0140397    BCA               KCP JUANDA        BONUS MEMBER      APRIL 2020                          1R014
10321818365                                          00000000000187496.00INASIA                                                                B      0140397    BCA               Padang            BONUS MEMBER      APRIL 2020                          1R014
12460330001                                          00000000001165111.00INAVIANTI WINARTO                                                     B      0140397    BCA               Semarang          BONUS MEMBER      APRIL 2020                          1R014
15880209959                                          00000000018055022.00INDRIYATI SALIM                                                       B      0140397    BCA               Jakarta           BONUS MEMBER      APRIL 2020                          1R014
14260366811                                          00000000000501486.00INGE H S / THEO A D                                                   B      0140397    BCA               kcp tolegerejo    BONUS MEMBER      APRIL 2020                          1R014
16380003447                                          00000000000112467.00IR. SOEBIJANTO TRIWIBOWO                                              B      0140397    BCA               Jakarta           BONUS MEMBER      APRIL 2020                          1R014
13650265482                                          00000000000101797.00IRAWATI                                                               B      0140397    BCA               RSA Jaury Jusuf PuBONUS MEMBER      APRIL 2020                          1R014
14643157040                                          00000000000153886.00IRUM SPRM DR                                                          B      0140397    BCA               surabaya          BONUS MEMBER      APRIL 2020                          1R014
13140202303                                          00000000000101796.00IRWANTO CAHYADI                                                       B      0140397    BCA               Kupang            BONUS MEMBER      APRIL 2020                          1R014
17685039869                                          00000000000194578.00ISAEL PAULL HARYONO                                                   B      0140397    BCA               sungguminasa      BONUS MEMBER      APRIL 2020                          1R014
17920823551                                          00000000000159318.00JAWAHIR HI.MOHAMMAD AMIN                                              B      0140397    BCA               PALU              BONUS MEMBER      APRIL 2020                          1R014
13570208569                                          00000000000050290.00JOENG CHINTYA DEWI                                                    B      0140397    BCA               BANJARNEGARA      BONUS MEMBER      APRIL 2020                          1R014
10181090234                                          00000000003217946.00JOHANES PUTRA MAYNINEDO                                               B      0140397    BCA               Sidoarjo          BONUS MEMBER      APRIL 2020                          1R014
18015102523                                          00000000000092146.00JOKO SUSANTO                                                          B      0140397    BCA               Financial center  BONUS MEMBER      APRIL 2020                          1R014
11781176392                                          00000000002187378.00JOUSJE ADAM                                                           B      0140397    BCA               Permata Hijau     BONUS MEMBER      APRIL 2020                          1R014
11681694248                                          00000000000976786.00JUANITA ICHSANI                                                       B      0140397    BCA               Pluit             BONUS MEMBER      APRIL 2020                          1R014
12910359331                                          00000000000051260.00JULIANA KULLIT                                                        B      0140397    BCA               Jakarta           BONUS MEMBER      APRIL 2020                          1R014
17920829036                                          00000000000319320.00JULIANA ROSA WIDJAJANTI                                               B      0140397    BCA               palu              BONUS MEMBER      APRIL 2020                          1R014
10885727030                                          00000000000260004.00KALEB YEREMIA YUNIOR KOR                                              B      0140397    BCA               Surabaya          BONUS MEMBER      APRIL 2020                          1R014
12900146208                                          00000000000101797.00KARMILA MUSIDAR                                                       B      0140397    BCA               Makassar          BONUS MEMBER      APRIL 2020                          1R014
12620007202                                          00000000000422188.00KIKIE HARDI                                                           B      0140397    BCA               HASYIM ASHARI     BONUS MEMBER      APRIL 2020                          1R014
12850039910                                          00000000000207818.00KOE HOENG WHENG                                                       B      0140397    BCA               taman sari        BONUS MEMBER      APRIL 2020                          1R014
12211227763                                          00000000000781088.00KONNI M TAMBUNAN                                                      B      0140397    BCA               MENARA IMPERIUM   BONUS MEMBER      APRIL 2020                          1R014
12700086081                                          00000000000101796.00KRISTIANI UTOMO                                                       B      0140397    BCA               Roxi Mas          BONUS MEMBER      APRIL 2020                          1R014
17855044188                                          00000000000133257.00KRISTIN SUSILOWATI IKWAN                                              B      0140397    BCA               ternate           BONUS MEMBER      APRIL 2020                          1R014
18600573692                                          00000000000212038.00LAILA MAJENUN                                                         B      0140397    BCA               Palangka Raya     BONUS MEMBER      APRIL 2020                          1R014
14131012939                                          00000000000054655.00LANNY SANTOSO                                                         B      0140397    BCA               413               BONUS MEMBER      APRIL 2020                          1R014
11051407763                                          00000000000192395.00LANNY SULAIMAN                                                        B      0140397    BCA               jembatan lima     BONUS MEMBER      APRIL 2020                          1R014
11521037909                                          00000000000101796.00LAURENSIA SUSAN                                                       B      0140397    BCA               Surabaya          BONUS MEMBER      APRIL 2020                          1R014
10410949768                                          00000000000443140.00LELI MARULISARI                                                       B      0140397    BCA               PANGKAL PINANG    BONUS MEMBER      APRIL 2020                          1R014
10291515818                                          00000000000052084.00LIAINI HALIM                                                          B      0140397    BCA               KCU Pontianak     BONUS MEMBER      APRIL 2020                          1R014
13971165357                                          00000000000368790.00LIAN BIE HUI                                                          B      0140397    BCA               Jakarta           BONUS MEMBER      APRIL 2020                          1R014
12871470865                                          00000000000315391.00LIAN BIE KIM                                                          B      0140397    BCA               Kebun Jeruk       BONUS MEMBER      APRIL 2020                          1R014
17920702494                                          00000000000122458.00LIDYA ARMA                                                            B      0140397    BCA               Palu              BONUS MEMBER      APRIL 2020                          1R014
15060026981                                          00000000000371554.00LIE AY HWA                                                            B      0140397    BCA               Surabaya          BONUS MEMBER      APRIL 2020                          1R014
10090888919                                          00000000000159997.00LIEM ENG MEI                                                          B      0140397    BCA               Semarang          BONUS MEMBER      APRIL 2020                          1R014
10880370006                                          00000000000165817.00LIEM LINDAWATI MASAJU                                                 B      0140397    BCA               Surabaya          BONUS MEMBER      APRIL 2020                          1R014
17540460269                                          00000000000389208.00LILIANY WIJAYA                                                        B      0140397    BCA               Jakarta Barat     BONUS MEMBER      APRIL 2020                          1R014
12520230231                                          00000000000101796.00LILIK SUSIANI SUTEDJO                                                 B      0140397    BCA               MT Haryono        BONUS MEMBER      APRIL 2020                          1R014
12762222222                                          00000000016347248.00LILY NGADIMAN                                                         B      0140397    BCA               sunter            BONUS MEMBER      APRIL 2020                          1R014
12211076871                                          00000000000180367.00LINA HALIM THE                                                        B      0140397    BCA               Menara Imperium   BONUS MEMBER      APRIL 2020                          1R014
17795143955                                          00000000004041755.00LINDA                                                                 B      0140397    BCA               Cabang Palu       BONUS MEMBER      APRIL 2020                          1R014
18690254647                                          00000000000102719.00LISA ARIANTY DRG                                                      B      0140397    BCA               DEPOK             BONUS MEMBER      APRIL 2020                          1R014
17955171314                                          00000000000550082.00LISDA TUNILAN                                                         B      0140397    BCA               Abepura           BONUS MEMBER      APRIL 2020                          1R014
10182621542                                          00000000000461812.00LISTIA INDAHWATI DR.                                                  B      0140397    BCA               SIDOARJO          BONUS MEMBER      APRIL 2020                          1R014
16280639999                                          00000000000101796.00LUSIA RUDIASWORO                                                      B      0140397    BCA               Kcp Arundina CibubBONUS MEMBER      APRIL 2020                          1R014
18620235661                                          00000000000707562.00LYDIANA DEWI EFFENDY                                                  B      0140397    BCA               Citraland         BONUS MEMBER      APRIL 2020                          1R014
13900236963                                          00000000000051745.00M NAIM. T                                                             B      0140397    BCA               PETTARANI MAKASSARBONUS MEMBER      APRIL 2020                          1R014
18200465874                                          00000000000262526.00MACHDA PAKPAHAN                                                       B      0140397    BCA               Bca pematangsiantaBONUS MEMBER      APRIL 2020                          1R014
14281621569                                          00000000000208303.00MAGDALENA KUSNADI                                                     B      0140397    BCA               428               BONUS MEMBER      APRIL 2020                          1R014
18190339344                                          00000000000550390.00MANUELLA ARTAWATY PURBA                                               B      0140397    BCA               KCP JELUTUNG      BONUS MEMBER      APRIL 2020                          1R014
10260829971                                          00000000005997035.00MARIA BEATRIX LUNTUNGAN                                               B      0140397    BCA               Manado            BONUS MEMBER      APRIL 2020                          1R014
16840153876                                          00000000002232615.00MARIANCE                                                              B      0140397    BCA               Kcp KEM Tower     BONUS MEMBER      APRIL 2020                          1R014
10292155075                                          00000000000892104.00MARISA CAROLINA TEDJA                                                 B      0140397    BCA               Pontianak         BONUS MEMBER      APRIL 2020                          1R014
14650268356                                          00000000020858296.00MARSUDI                                                               B      0140397    BCA               Makro Pepelegi SidBONUS MEMBER      APRIL 2020                          1R014
11520325049                                          00000000000474573.00MARTHEN CAREL KORWA                                                   B      0140397    BCA               Kertajaya         BONUS MEMBER      APRIL 2020                          1R014
14870038254                                          00000000000101797.00MARYANA                                                               B      0140397    BCA               487               BONUS MEMBER      APRIL 2020                          1R014
18735124567                                          00000000000119160.00MAULIDA NUR ISLAMI                                                    B      0140397    BCA               Tamalanrea MakassaBONUS MEMBER      APRIL 2020                          1R014
17870295795                                          00000000000213832.00MAWADDAH                                                              B      0140397    BCA               KCP SIPIN         BONUS MEMBER      APRIL 2020                          1R014
10640167297                                          00000000001279086.00MEDYAWATI LIMANTARA DRG                                               B      0140397    BCA               Pucang Anom SurabaBONUS MEMBER      APRIL 2020                          1R014
11190435969                                          00000000000161162.00MEGAWATI EMERENTIANA OH                                               B      0140397    BCA               JAMBI             BONUS MEMBER      APRIL 2020                          1R014
14281568111                                          00000000000066198.00MEILANI SUTISNA                                                       B      0140397    BCA               sunter mall       BONUS MEMBER      APRIL 2020                          1R014
17160069281                                          00000000001556428.00MELAWATY ABYANI                                                       B      0140397    BCA               MT Haryono JakartaBONUS MEMBER      APRIL 2020                          1R014
10883225888                                          00000000000069205.00MELI WIDJAJA                                                          B      0140397    BCA               Surabaya          BONUS MEMBER      APRIL 2020                          1R014
15870038323                                          00000000000066198.00MELINDA FLONA TJANG                                                   B      0140397    BCA               A M sangaji       BONUS MEMBER      APRIL 2020                          1R014
13053007500                                          00000000003499547.00MEYLIA                                                                B      0140397    BCA               PS Cikini         BONUS MEMBER      APRIL 2020                          1R014
17260969484                                          00000000000231486.00MIKHAEL BUDI SETIAWAN                                                 B      0140397    BCA               simpang darmo     BONUS MEMBER      APRIL 2020                          1R014
11100221515                                          00000000000101796.00MILDA PRATIWI MUSIDAR                                                 B      0140397    BCA               Makassar          BONUS MEMBER      APRIL 2020                          1R014
12741034559                                          00000000005603215.00MIRA REBEKA SANI                                                      B      0140397    BCA               00000             BONUS MEMBER      APRIL 2020                          1R014
13900371216                                          00000000000354870.00MUH ALI HUSAIN TJ                                                     B      0140397    BCA               panakukang MakassaBONUS MEMBER      APRIL 2020                          1R014
10255460574                                          00000000000683312.00MUH. KADIR                                                            B      0140397    BCA               Sungguminasa      BONUS MEMBER      APRIL 2020                          1R014
13900341708                                          00000000000066780.00MUH. NUR ALIM                                                         B      0140397    BCA               Pettarani MakassarBONUS MEMBER      APRIL 2020                          1R014
12940047318                                          00000000000304478.00MUKLAM                                                                B      0140397    BCA               PANGERAN ANTASARI BONUS MEMBER      APRIL 2020                          1R014
18600232798                                          00000000000320484.00NANA                                                                  B      0140397    BCA               Palangka Raya     BONUS MEMBER      APRIL 2020                          1R014
18090809777                                          00000000000057128.00NANIEK HARDIYANI                                                      B      0140397    BCA                KCP Ahmad Yani IIBONUS MEMBER      APRIL 2020                          1R014
10561465591                                          00000000000201174.00NI KETUT MEGAWATI                                                     B      0140397    BCA               MATARAM           BONUS MEMBER      APRIL 2020                          1R014
10560789939                                          00000000000264224.00NI NYOMAN NGURAH ASTUTI                                               B      0140397    BCA               CAKRANEGARA       BONUS MEMBER      APRIL 2020                          1R014
10653453890                                          00000000000234832.00NILAWATI"BDN RATU PRATIW                                              B      0140397    BCA               Kelapa Gading     BONUS MEMBER      APRIL 2020                          1R014
18290171513                                          00000000000547366.00NINIK ELSAWATIE                                                       B      0140397    BCA               Surabaya          BONUS MEMBER      APRIL 2020                          1R014
10067888883                                          00000000000101797.00NITRA TIARA                                                           B      0140397    BCA               EQUITY TOWER SCBD BONUS MEMBER      APRIL 2020                          1R014
18680552801                                          00000000006179604.00NONSI MARIANA                                                         B      0140397    BCA               kcp cikokol       BONUS MEMBER      APRIL 2020                          1R014
15210742605                                          00000000016344437.00NOVI HANDAYANI                                                        B      0140397    BCA               KCP BULEVAR HIJAU BONUS MEMBER      APRIL 2020                          1R014
18140393399                                          00000000000547172.00NOVIKA LOUDERS ROSELLINI                                              B      0140397    BCA               Abepura           BONUS MEMBER      APRIL 2020                          1R014
13900376251                                          00000000000321260.00NUR NIKMA ANUGRAWATI                                                  B      0140397    BCA               Makassar          BONUS MEMBER      APRIL 2020                          1R014
10272541254                                          00000000000403264.00NURAENI                                                               B      0140397    BCA               samarinda         BONUS MEMBER      APRIL 2020                          1R014
11199004598                                          00000000000693448.00NURHASANAH HS                                                         B      0140397    BCA               Jambi             BONUS MEMBER      APRIL 2020                          1R014
10255830223                                          00000000000101748.00NURJAYA SH                                                            B      0140397    BCA               MAKASSAR          BONUS MEMBER      APRIL 2020                          1R014
17640857212                                          00000000001321620.00NURUL AZIZAH                                                          B      0140397    BCA               CITRA RAYA        BONUS MEMBER      APRIL 2020                          1R014
13751308106                                          00000000000103155.00NY MARGARETHA I NGANTUNG                                              B      0140397    BCA               Graha Inti        BONUS MEMBER      APRIL 2020                          1R014
15255023656                                          00000000000066780.00ONI YULIANA PARUAK                                                    B      0140397    BCA               Jakarta           BONUS MEMBER      APRIL 2020                          1R014
10353041450                                          00000000000119596.00OSBORN BUDIMAN                                                        B      0140397    BCA               KCU Sudirman      BONUS MEMBER      APRIL 2020                          1R014
17155072989                                          00000000000212862.00PATRISIA SUPARTINA                                                    B      0140397    BCA               PONTIANAK         BONUS MEMBER      APRIL 2020                          1R014
15390484234                                          00000000000149958.00PAULINA TJHIN                                                         B      0140397    BCA               KCP CITRA GARDEN IBONUS MEMBER      APRIL 2020                          1R014
11691938561                                          00000000001494397.00PONCO HANDAYAWATI                                                     B      0140397    BCA               Kcp Ahmad Dahlan  BONUS MEMBER      APRIL 2020                          1R014
14681270978                                          00000000000155972.00PRASTI ADHI DHARMASANTI DR                                            B      0140397    BCA               Indrapura SurabayaBONUS MEMBER      APRIL 2020                          1R014
17800213392                                          00000000000126183.00PREISY ANGEL MARIA GOLIO                                              B      0140397    BCA               Ranotana          BONUS MEMBER      APRIL 2020                          1R014
17870667081                                          00000000000102088.00PRIMA YULIANTY                                                        B      0140397    BCA               Jambi             BONUS MEMBER      APRIL 2020                          1R014
18830376781                                          00000000000101796.00PUDJAWATI                                                             B      0140397    BCA               Gading serpong    BONUS MEMBER      APRIL 2020                          1R014
10479371051                                          00000000000102960.00PURNAMASARI SETIAWAN                                                  B      0140397    BCA               kcu tegal         BONUS MEMBER      APRIL 2020                          1R014
12140625208                                          00000000000280762.00PUSPITA SARI                                                          B      0140397    BCA               Surabaya          BONUS MEMBER      APRIL 2020                          1R014
17970160625                                          00000000000366437.00RAHMITA BURHAMZAH                                                     B      0140397    BCA               Maricaya Makassar BONUS MEMBER      APRIL 2020                          1R014
11821231235                                          00000000000156942.00RATNA DEWI                                                            B      0140397    BCA               Semarang          BONUS MEMBER      APRIL 2020                          1R014
17890006471                                          00000000000408026.00RATNA WIJAYA                                                          B      0140397    BCA               sungguminasa      BONUS MEMBER      APRIL 2020                          1R014
12741009970                                          00000000001023161.00RAY LAMMY                                                             B      0140397    BCA               Pondok Bambu      BONUS MEMBER      APRIL 2020                          1R014
10481246481                                          00000000000200834.00RIA YUSIANA                                                           B      0140397    BCA               Tulungagung       BONUS MEMBER      APRIL 2020                          1R014
10255755531                                          00000000000222998.00RICHARD LIFANDY                                                       B      0140397    BCA               AHMAD YANI        BONUS MEMBER      APRIL 2020                          1R014
17910036585                                          00000000000740542.00RINA ARIYANIE TAHIR                                                   B      0140397    BCA               kendari           BONUS MEMBER      APRIL 2020                          1R014
17920717351                                          00000000010633747.00RISDIYANTO                                                            B      0140397    BCA               palu              BONUS MEMBER      APRIL 2020                          1R014
14052203388                                          00000000000323151.00RISKA                                                                 B      0140397    BCA               kcp sulawesi      BONUS MEMBER      APRIL 2020                          1R014
14260130698                                          00000000000101748.00RIZA POERWANI POERBOWO                                                B      0140397    BCA               Semarang          BONUS MEMBER      APRIL 2020                          1R014
17060095269                                          00000000000750339.00ROBERT DEDE BANGUN                                                    B      0140397    BCA               Cempaka Putih     BONUS MEMBER      APRIL 2020                          1R014
17920441119                                          00000000011815213.00ROBERTH PARENGKUAN                                                    B      0140397    BCA               Palu              BONUS MEMBER      APRIL 2020                          1R014
12465738888                                          00000000000119596.00ROSANA LIM                                                            B      0140397    BCA               KCP Siliwangi     BONUS MEMBER      APRIL 2020                          1R014
11683399977                                          00000000001653671.00RULLY ARISCHANDRA                                                     B      0140397    BCA               Cabang Landmark PlBONUS MEMBER      APRIL 2020                          1R014
16665050541                                          00000000026290643.00RUSIANI                                                               B      0140397    BCA               Sambas            BONUS MEMBER      APRIL 2020                          1R014
11410324047                                          00000000004503919.00RUTH HANDAYANI DARMAWAN                                               B      0140397    BCA               Nganjuk           BONUS MEMBER      APRIL 2020                          1R014
17920779136                                          00000000000703682.00SAHRAN                                                                B      0140397    BCA               Palu              BONUS MEMBER      APRIL 2020                          1R014
12581015901                                          00000000004231026.00SALIM                                                                 B      0140397    BCA               Diponogoro        BONUS MEMBER      APRIL 2020                          1R014
17910170583                                          00000000048987159.00SALMIA RODHIYA HUSAINY                                                B      0140397    BCA               Kendari           BONUS MEMBER      APRIL 2020                          1R014
11451058741                                          00000000000119596.00SAMUEL. BUDIJANTO SUSANTO                                             B      0140397    BCA               KCP Gatot Subroto BONUS MEMBER      APRIL 2020                          1R014
18375052136                                          00000000000352833.00SARAH ATTHAHIRAH                                                      B      0140397    BCA               KCP Rahmadsyah    BONUS MEMBER      APRIL 2020                          1R014
10040049177                                          00000000000102476.00SARAH AYUDA                                                           B      0140397    BCA               KCP REG. TANAH ABABONUS MEMBER      APRIL 2020                          1R014
18200654570                                          00000000004880611.00SARMED IDA RISAN NABABAN                                              B      0140397    BCA               pematangsiantar   BONUS MEMBER      APRIL 2020                          1R014
16370116677                                          00000000000136086.00SATIADI SUTISNA                                                       B      0140397    BCA               KCP Muara Karang 2BONUS MEMBER      APRIL 2020                          1R014
18985132778                                          00000000000101700.00SETIYOWATI DARSONO                                                    B      0140397    BCA               cabang Puri AnjasmBONUS MEMBER      APRIL 2020                          1R014
11010200209                                          00000000001195225.00SETYOTUHU TATIK                                                       B      0140397    BCA               KCP Kapas KrampungBONUS MEMBER      APRIL 2020                          1R014
13981074465                                          00000000000101554.00SILVIA                                                                B      0140397    BCA               Kcp mandala raya  BONUS MEMBER      APRIL 2020                          1R014
15530170456                                          00000000000966168.00SITI FATONAH                                                          B      0140397    BCA               OTISTA            BONUS MEMBER      APRIL 2020                          1R014
16110470086                                          00000000000227412.00SITI MURTI UTAMI                                                      B      0140397    BCA               GRAND SUDIRMAN    BONUS MEMBER      APRIL 2020                          1R014
14681155656                                          00000000000157766.00SOEWITO ISMAWAN                                                       B      0140397    BCA               kcu indrapura sby BONUS MEMBER      APRIL 2020                          1R014
13981030522                                          00000000000066198.00SOFI                                                                  B      0140397    BCA               Jakarta           BONUS MEMBER      APRIL 2020                          1R014
10353367274                                          00000000000102572.00SRI BUANA PATI, SP                                                    B      0140397    BCA               Unaaha            BONUS MEMBER      APRIL 2020                          1R014
17911017206                                          00000000000051200.00SRI MARYATI                                                           B      0140397    BCA               kendari           BONUS MEMBER      APRIL 2020                          1R014
17955222211                                          00000000000552750.00SRI MULIADEWI GUNARTO                                                 B      0140397    BCA               Abepura           BONUS MEMBER      APRIL 2020                          1R014
14520006091                                          00000000000081572.00SRI REJEKI                                                            B      0140397    BCA               jakarta           BONUS MEMBER      APRIL 2020                          1R014
18810104431                                          00000000000066198.00SRI WAGIARTI                                                          B      0140397    BCA               kcp Balai Pustaka BONUS MEMBER      APRIL 2020                          1R014
18020384591                                          00000000005110279.00ST BALQIS NURCAHYANI AM                                               B      0140397    BCA               invalid account   BONUS MEMBER      APRIL 2020                          1R014
10948187151                                          00000000000101918.00STANISLAUS DIDIMUS SILVESTER                                          B      0140397    BCA               RAWAMANGUN        BONUS MEMBER      APRIL 2020                          1R014
17920883006                                          00000000000104610.00STEFANI BEATRIX                                                       B      0140397    BCA               Palu              BONUS MEMBER      APRIL 2020                          1R014
16155040894                                          00000000000060572.00STEFANUS BUDI SETIAWAN                                                B      0140397    BCA               kcu suncity       BONUS MEMBER      APRIL 2020                          1R014
12533338585                                          00000000022253964.00STEVIE LENGKONG                                                       B      0140397    BCA               Green Garden      BONUS MEMBER      APRIL 2020                          1R014
13530096458                                          00000000000056644.00SUBIANTO HARSOJO                                                      B      0140397    BCA               kcp industri      BONUS MEMBER      APRIL 2020                          1R014
17401245719                                          00000000000585148.00SUCIPTO                                                               B      0140397    BCA               KCU CIBUBUR       BONUS MEMBER      APRIL 2020                          1R014
12120132787                                          00000000000056256.00SUDI SELAMET                                                          B      0140397    BCA               GUNUNG SAHARI     BONUS MEMBER      APRIL 2020                          1R014
12750167091                                          00000000002768046.00SUDI WARSITO                                                          B      0140397    BCA               Jakarta           BONUS MEMBER      APRIL 2020                          1R014
17910249091                                          00000000016695481.00SULEMAN MILE                                                          B      0140397    BCA               0000000000        BONUS MEMBER      APRIL 2020                          1R014
12861012044                                          00000000000155972.00SULHANA ARMAINI                                                       B      0140397    BCA               KEMANG TEBET      BONUS MEMBER      APRIL 2020                          1R014
18190166873                                          00000000000101894.00SUPRANATA S                                                           B      0140397    BCA               Jelutung-Jambi    BONUS MEMBER      APRIL 2020                          1R014
10021709335                                          00000000000101700.00SUSANA.F.WAWORGA                                                      B      0140397    BCA               JAMBI             BONUS MEMBER      APRIL 2020                          1R014
12540333371                                          00000000000958776.00SUSANTI OEY                                                           B      0140397    BCA               samarinda         BONUS MEMBER      APRIL 2020                          1R014
10291671861                                          00000000000157475.00SUSANTI SE                                                            B      0140397    BCA               RAHADI USMAN      BONUS MEMBER      APRIL 2020                          1R014
14970985048                                          00000000000101748.00SUSILOWATI                                                            B      0140397    BCA               Serpong           BONUS MEMBER      APRIL 2020                          1R014
17795777792                                          00000000000102088.00SUWANDI, S,SI                                                         B      0140397    BCA               Palu              BONUS MEMBER      APRIL 2020                          1R014
11410476271                                          00000000004916351.00SUZANNA ELLY SENTOSA                                                  B      0140397    BCA               nganjuk           BONUS MEMBER      APRIL 2020                          1R014
10613350559                                          00000000000741948.00SYAHRIZAL                                                             B      0140397    BCA               MEDAN             BONUS MEMBER      APRIL 2020                          1R014
18735133019                                          00000000000102389.00TAPPE                                                                 B      0140397    BCA               KCP TAMALANREA    BONUS MEMBER      APRIL 2020                          1R014
13080072162                                          00000000005162044.00TEDDY WIJAYAPUTRA                                                     B      0140397    BCA               Duta Merlin       BONUS MEMBER      APRIL 2020                          1R014
10010455375                                          00000000000112467.00TEGUH RIYADI                                                          B      0140397    BCA               Jakarta           BONUS MEMBER      APRIL 2020                          1R014
11520385858                                          00000000000061300.00THE THETY MEYCIYANA SUEL                                              B      0140397    BCA               kcp kertajaya     BONUS MEMBER      APRIL 2020                          1R014
18220202764                                          00000000000102960.00THERESIA MARGRIET LAZAR                                               B      0140397    BCA               Surabaya          BONUS MEMBER      APRIL 2020                          1R014
10031705486                                          00000000000155195.00TIO TJEN AI                                                           B      0140397    BCA               Gunung Sahari     BONUS MEMBER      APRIL 2020                          1R014
17050073038                                          00000000000172994.00TJIANG TJI PENG                                                       B      0140397    BCA               kcp tanjung duren BONUS MEMBER      APRIL 2020                          1R014
11196004352                                          00000000000060718.00TONGON SARIHON SITORUS                                                B      0140397    BCA               SIPIN - JAMBI     BONUS MEMBER      APRIL 2020                          1R014
11710553897                                          00000000000195160.00TRI PUJI ASTUTI                                                       B      0140397    BCA               PONTIANAK         BONUS MEMBER      APRIL 2020                          1R014
12903024461                                          00000000000111400.00UMMU CALSUM KADIR                                                     B      0140397    BCA               Somba Opu makassarBONUS MEMBER      APRIL 2020                          1R014
16070096151                                          00000000000404388.00UTING ROCHIMA                                                         B      0140397    BCA               kcp cyber II      BONUS MEMBER      APRIL 2020                          1R014
17795023381                                          00000000000302392.00VERDIANA TARUNTUNG                                                    B      0140397    BCA               Palu              BONUS MEMBER      APRIL 2020                          1R014
11510319164                                          00000000000155196.00VIVI DAMAYANTI                                                        B      0140397    BCA               KCP KENTEN        BONUS MEMBER      APRIL 2020                          1R014
17920844159                                          00000000000159803.00VONNY HASNAH                                                          B      0140397    BCA               Palu              BONUS MEMBER      APRIL 2020                          1R014
11101550899                                          00000000000191510.00WAHIDAH                                                               B      0140397    BCA               Makassar          BONUS MEMBER      APRIL 2020                          1R014
16010017074                                          00000000000319416.00WANDA MARIA NADIYENSI                                                 B      0140397    BCA               KCP ARJUNA        BONUS MEMBER      APRIL 2020                          1R014
15085723160                                          00000000000101796.00WARAS                                                                 B      0140397    BCA               Surabaya          BONUS MEMBER      APRIL 2020                          1R014
11410592998                                          00000000001166372.00WELLY JUNAIDI LEE                                                     B      0140397    BCA               nganjuk           BONUS MEMBER      APRIL 2020                          1R014
17920333456                                          00000000000101748.00WILLYANTO GOSAL                                                       B      0140397    BCA               PALU              BONUS MEMBER      APRIL 2020                          1R014
16871660741                                          00000000000274166.00YATI NURHAYATI                                                        B      0140397    BCA               PONDOK GEDE BEKASIBONUS MEMBER      APRIL 2020                          1R014
11520368066                                          00000000001195913.00YAYUK RIWAYATI                                                        B      0140397    BCA               Kertajaya         BONUS MEMBER      APRIL 2020                          1R014
11630205677                                          00000000000134098.00YENNY                                                                 B      0140397    BCA               Kcp pemuda padang BONUS MEMBER      APRIL 2020                          1R014
17890999195                                          00000000000101215.00YENNY NIOS                                                            B      0140397    BCA               Makassar          BONUS MEMBER      APRIL 2020                          1R014
17990807692                                          00000000000105338.00YOHANIS BARA PADANG                                                   B      0140397    BCA               KCP Kawasan IndustBONUS MEMBER      APRIL 2020                          1R014
18735102741                                          00000000000101748.00YOSEP SAMPE LALONG                                                    B      0140397    BCA               KCP TAMALANREA    BONUS MEMBER      APRIL 2020                          1R014
14290532944                                          00000000000519115.00YOYOK DWI HIMALAYA                                                    B      0140397    BCA               ahmad yani        BONUS MEMBER      APRIL 2020                          1R014
10354000039                                          00000000000101797.00YUKE INDRIANA                                                         B      0140397    BCA               Jakarta           BONUS MEMBER      APRIL 2020                          1R014
15210665007                                          00000000000066198.00YULI ASTERINA                                                         B      0140397    BCA               KCP BULEVAR HIJAU BONUS MEMBER      APRIL 2020                          1R014
18600218230                                          00000000000369711.00YULIAN WINDRI                                                         B      0140397    BCA               Ahmad Yani PalangkBONUS MEMBER      APRIL 2020                          1R014
12872372513                                          00000000018474521.00YULIANTI LIAN                                                         B      0140397    BCA               00000             BONUS MEMBER      APRIL 2020                          1R014
10255823073                                          00000000000159172.00YULITA PANGGALO                                                       B      0140397    BCA               makassar          BONUS MEMBER      APRIL 2020                          1R014
12160361231                                          00000000000104852.00YUSUF HARIJANTO                                                       B      0140397    BCA               PONDOK CHANDRA    BONUS MEMBER      APRIL 2020                          1R014
10341708396                                          00000000000441442.00ZAIDAR YANTI PURBODINING                                              B      0140397    BCA               PEKAN BARU        BONUS MEMBER      APRIL 2020                          1R014
17921011869                                          00000000000050775.00ZAINAB                                                                B      0140397    BCA               Palu              BONUS MEMBER      APRIL 2020                          1R014
10120280899                                          00000000003513268.00ZAINAL ARIFIN                                                         B      0140397    BCA               Gajah Mada        BONUS MEMBER      APRIL 2020                          1R014
10280110752                                          00000000000144816.00ZIRA ENDYANA NURSYAHBANI                                              B      0140397    BCA               KCU WAHID HASYIM  BONUS MEMBER      APRIL 2020                          1R014
