FK;KD_JENIS_TRANSAKSI;FG_PENGGANTI;NOMOR_FAKTUR;MASA_PAJAK;TAHUN_PAJAK;TANGGAL_FAKTUR;NPWP;NAMA;ALAMAT_LENGKAP;JUMLAH_DPP;JUMLAH_PPN;JUMLAH_PPNBM;ID_KETERANGAN_TAMBAHAN;FP_UANG_MUKA;UANG_MUKA_DPP;UANG_MUKA_PPN;UANG_MUKA_PPNBM;REFERENSI
LT;NPWP;NAMA;JALAN;BLOK;NOMOR;RT;RW;KECAMATAN;KELURAHAN;KABUPATEN;PROPINSI;KODE_POS;NOMOR_TELEPON
OF;KODE_OBJEK;NAMA;HARGA_SATUAN;JUMLAH_BARANG;HARGA_TOTAL;DISKON;DPP;PPN;TARIF_PPNBM;PPNBM
FK;01;0;0041957569433;10;2019;03/10/2019;594682387037000;"Zainal Arifin.";"Jl. Thalib II No.5 Krukut - Tamansari Jakarta Barat";1465545;146554;0;0;0;0;0;0;57443
LT;594682387037000;"Zainal Arifin.";-;-;-;0;0;-;-;-;-;-;-
OF;PP02319;"Nutrasetika Pack 1-Antioksidan (Free Magozai 750)";1612100;1;1612100;0;1465545;146554;0;0
FK;01;0;0041957569434;10;2019;03/10/2019;594682387037000;"Zainal Arifin.";"Jl. Thalib II No.5 Krukut - Tamansari Jakarta Barat";1465545;146554;0;0;0;0;0;0;57444
LT;594682387037000;"Zainal Arifin.";-;-;-;0;0;-;-;-;-;-;-
OF;PP02319;"Nutrasetika Pack 1-Antioksidan (Free Magozai 750)";1612100;1;1612100;0;1465545;146554;0;0
FK;01;0;0041957569435;10;2019;03/10/2019;594682387037000;"Zainal Arifin.";"Jl. Thalib II No.5 Krukut - Tamansari Jakarta Barat";785328;78532;0;0;0;0;0;0;57445
LT;594682387037000;"Zainal Arifin.";-;-;-;0;0;-;-;-;-;-;-
OF;HF0017;"Bee Propolis Liquid";307380;2;614760;0;558873;55887;0;0
OF;NT0042;Legreskin;249100;1;249100;0;226455;22645;0;0
FK;01;0;0041957569436;10;2019;03/10/2019;594682387037000;"Zainal Arifin.";"Jl. Thalib II No.5 Krukut - Tamansari Jakarta Barat";292255;29225;0;0;0;0;0;0;57446
LT;594682387037000;"Zainal Arifin.";-;-;-;0;0;-;-;-;-;-;-
OF;NT0050;Osteopain;321480;1;321480;0;292255;29225;0;0
FK;01;0;0041957568253;10;2019;04/10/2019;594682387037000;"Zainal Arifin.";"Jl. Thalib II No.5 Krukut - Tamansari Jakarta Barat";1465545;146554;0;0;0;0;0;0;57462
LT;594682387037000;"Zainal Arifin.";-;-;-;0;0;-;-;-;-;-;-
OF;PP02319;"Nutrasetika Pack 1-Antioksidan (Free Magozai 750)";1612100;1;1612100;0;1465545;146554;0;0
FK;01;0;0041957568266;10;2019;05/10/2019;594682387037000;"Zainal Arifin.";"Jl. Thalib II No.5 Krukut - Tamansari Jakarta Barat";180000;18000;0;0;0;0;0;0;57474
LT;594682387037000;"Zainal Arifin.";-;-;-;0;0;-;-;-;-;-;-
OF;SK0096;"Starter Kit Oktober 2019 Reg 99rb";99000;2;198000;0;180000;18000;0;0
FK;01;0;0041957568277;10;2019;05/10/2019;810976639732000;"Ir.HJ.Hayatun Fardah";"Jl. Garuda No.81 Kel. Komet Kec. Banjar Baru Utara Kab Banjarbaru - Kalimantan Selatan";2931091;293109;0;0;0;0;0;0;57485
LT;810976639732000;"Ir.HJ.Hayatun Fardah";-;-;-;0;0;-;-;-;-;-;-
OF;PP02319;"Nutrasetika Pack 1-Antioksidan (Free Magozai 750)";1612100;2;3224200;0;2931091;293109;0;0
FK;01;0;0041957568278;10;2019;05/10/2019;810976639732000;"Ir.HJ.Hayatun Fardah";"Jl. Garuda No.81 Kel. Komet Kec. Banjar Baru Utara Kab Banjarbaru - Kalimantan Selatan";956236;95624;0;0;0;0;0;0;57486
LT;810976639732000;"Ir.HJ.Hayatun Fardah";-;-;-;0;0;-;-;-;-;-;-
OF;NT0037;"Magozai 750 ml";620400;1;620400;0;564000;56400;0;0
OF;NT0051;"Sonata Night";134420;1;134420;0;122200;12220;0;0
OF;NT0035;Legres;148520;2;297040;0;270036;27004;0;0
FK;01;0;0041957569437;10;2019;05/10/2019;810976639732000;"Ir.HJ.Hayatun Fardah";"Jl. Garuda No.81 Kel. Komet Kec. Banjar Baru Utara Kab Banjarbaru - Kalimantan Selatan";4932436;493244;0;0;0;0;0;0;57487
LT;810976639732000;"Ir.HJ.Hayatun Fardah";-;-;-;0;0;-;-;-;-;-;-
OF;PP0556;"Slim Shake (4 gratis 2)";357200;12;4286400;0;3896727;389673;0;0
OF;BY0016;"Asta Spa Body Serum";202100;1;202100;0;183727;18373;0;0
OF;BY0037;"DR. Olamine Medicated Shampoo";175780;4;703120;0;639200;63920;0;0
OF;BY0033;"DR. Skin Anti Aging Eye Suppresor";234060;1;234060;0;212782;21278;0;0
FK;01;0;0041957568295;10;2019;07/10/2019;594682387037000;"Zainal Arifin.";"Jl. Thalib II No.5 Krukut - Tamansari Jakarta Barat";271818;27182;0;0;0;0;0;0;57504
LT;594682387037000;"Zainal Arifin.";-;-;-;0;0;-;-;-;-;-;-
OF;SK0097;"Starter Kit Oktober 2019 Cantik 299rb";299000;1;299000;0;271818;27182;0;0
FK;01;0;0041957568301;10;2019;07/10/2019;594682387037000;"Zainal Arifin.";"Jl. Thalib II No.5 Krukut - Tamansari Jakarta Barat";90000;9000;0;0;0;0;0;0;57507
LT;594682387037000;"Zainal Arifin.";-;-;-;0;0;-;-;-;-;-;-
OF;SK0096;"Starter Kit Oktober 2019 Reg 99rb";99000;1;99000;0;90000;9000;0;0
FK;01;0;0041957568305;10;2019;07/10/2019;594682387037000;"Zainal Arifin.";"Jl. Thalib II No.5 Krukut - Tamansari Jakarta Barat";1555545;155554;0;0;0;0;0;0;57510
LT;594682387037000;"Zainal Arifin.";-;-;-;0;0;-;-;-;-;-;-
OF;PP02319;"Nutrasetika Pack 1-Antioksidan (Free Magozai 750)";1612100;1;1612100;0;1465545;146554;0;0
OF;SK0096;"Starter Kit Oktober 2019 Reg 99rb";99000;1;99000;0;90000;9000;0;0
FK;01;0;0041957568307;10;2019;07/10/2019;810976639732000;"Ir.HJ.Hayatun Fardah";"Jl. Garuda No.81 Kel. Komet Kec. Banjar Baru Utara Kab Banjarbaru - Kalimantan Selatan";826055;82605;0;0;0;0;0;0;57511
LT;810976639732000;"Ir.HJ.Hayatun Fardah";-;-;-;0;0;-;-;-;-;-;-
OF;SL0005;"Slim Health 90";318660;1;318660;0;289691;28969;0;0
OF;PP0603;"TOP UP 10 Slim Shake + 10 Shaker";590000;1;590000;0;536364;53636;0;0
FK;01;0;0041957568309;10;2019;07/10/2019;594682387037000;"Zainal Arifin.";"Jl. Thalib II No.5 Krukut - Tamansari Jakarta Barat";271818;27182;0;0;0;0;0;0;57513
LT;594682387037000;"Zainal Arifin.";-;-;-;0;0;-;-;-;-;-;-
OF;SK0097;"Starter Kit Oktober 2019 Cantik 299rb";299000;1;299000;0;271818;27182;0;0
FK;01;0;0041957568352;10;2019;08/10/2019;594682387037000;"Zainal Arifin.";"Jl. Thalib II No.5 Krukut - Tamansari Jakarta Barat";6768000;676800;0;0;0;0;0;0;57552
LT;594682387037000;"Zainal Arifin.";-;-;-;0;0;-;-;-;-;-;-
OF;PP0490;"Magozai 750ml (Beli 3 Gratis 1)";620400;12;7444800;0;6768000;676800;0;0
FK;01;0;0041957568353;10;2019;08/10/2019;594682387037000;"Zainal Arifin.";"Jl. Thalib II No.5 Krukut - Tamansari Jakarta Barat";1692000;169200;0;0;0;0;0;0;57553
LT;594682387037000;"Zainal Arifin.";-;-;-;0;0;-;-;-;-;-;-
OF;PP0490;"Magozai 750ml (Beli 3 Gratis 1)";620400;3;1861200;0;1692000;169200;0;0
FK;01;0;0041957568354;10;2019;08/10/2019;594682387037000;"Zainal Arifin.";"Jl. Thalib II No.5 Krukut - Tamansari Jakarta Barat";1827018;182702;0;0;0;0;0;0;57554
LT;594682387037000;"Zainal Arifin.";-;-;-;0;0;-;-;-;-;-;-
OF;PP0490;"Magozai 750ml (Beli 3 Gratis 1)";620400;3;1861200;0;1692000;169200;0;0
OF;NT0035;Legres;148520;1;148520;0;135018;13502;0;0
FK;01;0;0041957568355;10;2019;08/10/2019;594682387037000;"Zainal Arifin.";"Jl. Thalib II No.5 Krukut - Tamansari Jakarta Barat";1692000;169200;0;0;0;0;0;0;57555
LT;594682387037000;"Zainal Arifin.";-;-;-;0;0;-;-;-;-;-;-
OF;PP0490;"Magozai 750ml (Beli 3 Gratis 1)";620400;3;1861200;0;1692000;169200;0;0
FK;01;0;0041957568362;10;2019;08/10/2019;594682387037000;"Zainal Arifin.";"Jl. Thalib II No.5 Krukut - Tamansari Jakarta Barat";3722400;372240;0;0;0;0;0;0;57562
LT;594682387037000;"Zainal Arifin.";-;-;-;0;0;-;-;-;-;-;-
OF;PP0490;"Magozai 750ml (Beli 3 Gratis 1)";682440;6;4094640;0;3722400;372240;0;0
FK;01;0;0041957568380;10;2019;09/10/2019;594682387037000;"Zainal Arifin.";"Jl. Thalib II No.5 Krukut - Tamansari Jakarta Barat";1692000;169200;0;0;0;0;0;0;57580
LT;594682387037000;"Zainal Arifin.";-;-;-;0;0;-;-;-;-;-;-
OF;PP0490;"Magozai 750ml (Beli 3 Gratis 1)";620400;3;1861200;0;1692000;169200;0;0
FK;01;0;0041957568382;10;2019;09/10/2019;674087382114000;"IDA FENNY ELYSA";"JL. DEBLOD SUNDORO NO. 41 LK. II";9937564;993756;0;0;0;0;0;0;57582
LT;674087382114000;"IDA FENNY ELYSA";-;-;-;0;0;-;-;-;-;-;-
OF;PP0490;"Magozai 750ml (Beli 3 Gratis 1)";620400;15;9306000;0;8460000;846000;0;0
OF;BY0028;"BI2 Serum ";212440;3;637320;0;579382;57938;0;0
OF;SK0096;"Starter Kit Oktober 2019 Reg 99rb";99000;1;99000;0;90000;9000;0;0
OF;SK0097;"Starter Kit Oktober 2019 Cantik 299rb";299000;1;299000;0;271818;27182;0;0
OF;PP0605;"TOP UP 10 Glucofit Susu + 5 Shaker";590000;1;590000;0;536364;53636;0;0
FK;01;0;0041957568388;10;2019;09/10/2019;082738550831000;"Harun D. Tumbuan";"Komplek RSD Madani No.19 Kota Palu Sualwesi Tengah";13167400;1316740;0;0;0;0;0;0;57588
LT;082738550831000;"Harun D. Tumbuan";-;-;-;0;0;-;-;-;-;-;-
OF;PP0490;"Magozai 750ml (Beli 3 Gratis 1)";620400;21;13028400;0;11844000;1184400;0;0
OF;NT020019;"Renewskin 30";217140;2;434280;0;394800;39480;0;0
OF;BY0036;"DR. Skin Anti Wrinkle Serum";431460;1;431460;0;392236;39224;0;0
OF;PP0605;"TOP UP 10 Glucofit Susu + 5 Shaker";590000;1;590000;0;536364;53636;0;0
FK;01;0;0041957568389;10;2019;09/10/2019;594682387037000;"Zainal Arifin.";"Jl. Thalib II No.5 Krukut - Tamansari Jakarta Barat";1692000;169200;0;0;0;0;0;0;57589
LT;594682387037000;"Zainal Arifin.";-;-;-;0;0;-;-;-;-;-;-
OF;PP0490;"Magozai 750ml (Beli 3 Gratis 1)";620400;3;1861200;0;1692000;169200;0;0
FK;01;0;0041957568410;10;2019;09/10/2019;082738550831000;"Harun D. Tumbuan";"Komplek RSD Madani No.19 Kota Palu Sualwesi Tengah";450000;45000;0;0;0;0;0;0;57610
LT;082738550831000;"Harun D. Tumbuan";-;-;-;0;0;-;-;-;-;-;-
OF;SK0096;"Starter Kit Oktober 2019 Reg 99rb";99000;5;495000;0;450000;45000;0;0
FK;01;0;0041957568464;10;2019;09/10/2019;672354446619000;"Surjana Dewi Effendy";"JL. Manyar Tirtoyoso Selatan 4 no. 11 RT 007 RW 005 Manyarsabrangan Mulyorejo surabaya";4671800;467180;0;0;0;0;0;0;57665
LT;672354446619000;"Surjana Dewi Effendy";-;-;-;0;0;-;-;-;-;-;-
OF;PP0515;"Adult Formula (Beli 1 Gratis 1)";562120;3;1686360;0;1533055;153305;0;0
OF;PP0521;"DR. Alopec Set (Beli 1 Gratis 1)";1068780;1;1068780;0;971618;97162;0;0
OF;PP0490;"Magozai 750ml (Beli 3 Gratis 1)";620400;3;1861200;0;1692000;169200;0;0
OF;NT0035;Legres;148520;1;148520;0;135018;13502;0;0
OF;HF0020;Glucosefit;374120;1;374120;0;340109;34011;0;0
FK;01;0;0041957568470;10;2019;09/10/2019;672354446619000;"Surjana Dewi Effendy";"JL. Manyar Tirtoyoso Selatan 4 no. 11 RT 007 RW 005 Manyarsabrangan Mulyorejo surabaya";1692000;169200;0;0;0;0;0;0;57671
LT;672354446619000;"Surjana Dewi Effendy";-;-;-;0;0;-;-;-;-;-;-
OF;PP0490;"Magozai 750ml (Beli 3 Gratis 1)";620400;3;1861200;0;1692000;169200;0;0
FK;01;0;0041957568482;10;2019;09/10/2019;579473596823000;"Supantia Saleh";"Jl. Bitung Tengah RT.010 Rw.004. Bitung Tengah - Maesa Bitung";1692000;169200;0;0;0;0;0;0;57683
LT;579473596823000;"Supantia Saleh";-;-;-;0;0;-;-;-;-;-;-
OF;PP0490;"Magozai 750ml (Beli 3 Gratis 1)";620400;3;1861200;0;1692000;169200;0;0
FK;01;0;0041957568498;10;2019;09/10/2019;594682387037000;"Zainal Arifin.";"Jl. Thalib II No.5 Krukut - Tamansari Jakarta Barat";3384000;338400;0;0;0;0;0;0;57699
LT;594682387037000;"Zainal Arifin.";-;-;-;0;0;-;-;-;-;-;-
OF;PP0490;"Magozai 750ml (Beli 3 Gratis 1)";620400;6;3722400;0;3384000;338400;0;0
FK;01;0;0041957568502;10;2019;09/10/2019;594682387037000;"Zainal Arifin.";"Jl. Thalib II No.5 Krukut - Tamansari Jakarta Barat";1692000;169200;0;0;0;0;0;0;57703
LT;594682387037000;"Zainal Arifin.";-;-;-;0;0;-;-;-;-;-;-
OF;PP0490;"Magozai 750ml (Beli 3 Gratis 1)";620400;3;1861200;0;1692000;169200;0;0
FK;01;0;0041957568547;10;2019;10/10/2019;810976639732000;"Ir.HJ.Hayatun Fardah";"Jl. Garuda No.81 Kel. Komet Kec. Banjar Baru Utara Kab Banjarbaru - Kalimantan Selatan";10166237;1016623;0;0;0;0;0;0;57746
LT;810976639732000;"Ir.HJ.Hayatun Fardah";-;-;-;0;0;-;-;-;-;-;-
OF;PP0490;"Magozai 750ml (Beli 3 Gratis 1)";620400;15;9306000;0;8460000;846000;0;0
OF;NT0047;"FBCx 90";218080;1;218080;0;198255;19825;0;0
OF;PP0521;"DR. Alopec Set (Beli 1 Gratis 1)";1068780;1;1068780;0;971618;97162;0;0
OF;PP0608;"TOP UP 10 Starvitz Nutra Coklat 750gr + 5 Shaker";590000;1;590000;0;536364;53636;0;0
FK;01;0;0041957568569;10;2019;11/10/2019;594682387037000;"Zainal Arifin.";"Jl. Thalib II No.5 Krukut - Tamansari Jakarta Barat";1398036;139804;0;0;0;0;0;0;57763
LT;594682387037000;"Zainal Arifin.";-;-;-;0;0;-;-;-;-;-;-
OF;PP02330;"Nutrasetika Pack 2-Antioksidan Plus (Coformula30)";1537840;1;1537840;0;1398036;139804;0;0
FK;01;0;0041957568586;10;2019;12/10/2019;594682387037000;"Zainal Arifin.";"Jl. Thalib II No.5 Krukut - Tamansari Jakarta Barat";246964;24696;0;0;0;0;0;0;57778
LT;594682387037000;"Zainal Arifin.";-;-;-;0;0;-;-;-;-;-;-
OF;NT0032;Gravica;271660;1;271660;0;246964;24696;0;0
FK;01;0;0041957568590;10;2019;12/10/2019;082738550831000;"Harun D. Tumbuan";"Komplek RSD Madani No.19 Kota Palu Sualwesi Tengah";4737600;473760;0;0;0;0;0;0;57783
LT;082738550831000;"Harun D. Tumbuan";-;-;-;0;0;-;-;-;-;-;-
OF;PP0417;"Starkidz Beli 3 Gratis 1";124080;42;5211360;0;4737600;473760;0;0
FK;01;0;0041957568609;10;2019;13/10/2019;082738550831000;"Harun D. Tumbuan";"Komplek RSD Madani No.19 Kota Palu Sualwesi Tengah";4935564;493556;0;0;0;0;0;0;57806
LT;082738550831000;"Harun D. Tumbuan";-;-;-;0;0;-;-;-;-;-;-
OF;PP0417;"Starkidz Beli 3 Gratis 1";124080;39;4839120;0;4399200;439920;0;0
OF;PP0608;"TOP UP 10 Starvitz Nutra Coklat 750gr + 5 Shaker";590000;1;590000;0;536364;53636;0;0
FK;01;0;0041957568611;10;2019;13/10/2019;674087382114000;"IDA FENNY ELYSA";"JL. DEBLOD SUNDORO NO. 41 LK. II";536364;53636;0;0;0;0;0;0;57808
LT;674087382114000;"IDA FENNY ELYSA";-;-;-;0;0;-;-;-;-;-;-
OF;PP0608;"TOP UP 10 Starvitz Nutra Coklat 750gr + 5 Shaker";590000;1;590000;0;536364;53636;0;0
FK;01;0;0041957568614;10;2019;13/10/2019;674087382114000;"IDA FENNY ELYSA";"JL. DEBLOD SUNDORO NO. 41 LK. II";3828364;382836;0;0;0;0;0;0;57815
LT;674087382114000;"IDA FENNY ELYSA";-;-;-;0;0;-;-;-;-;-;-
OF;PP0508;"Starvitz Nutra Coklat750(4 get 2 Starvit cklt 350)";263200;16;4211200;0;3828364;382836;0;0
FK;01;0;0041957568615;10;2019;13/10/2019;674087382114000;"IDA FENNY ELYSA";"JL. DEBLOD SUNDORO NO. 41 LK. II";5742545;574254;0;0;0;0;0;0;57816
LT;674087382114000;"IDA FENNY ELYSA";-;-;-;0;0;-;-;-;-;-;-
OF;PP0511;"Starvitz Nutra Vanila750(4 get 2 Strvt Vanila350)";263200;24;6316800;0;5742545;574254;0;0
FK;01;0;0041957568617;10;2019;13/10/2019;810976639732000;"Ir.HJ.Hayatun Fardah";"Jl. Garuda No.81 Kel. Komet Kec. Banjar Baru Utara Kab Banjarbaru - Kalimantan Selatan";2931091;293109;0;0;0;0;0;0;57818
LT;810976639732000;"Ir.HJ.Hayatun Fardah";-;-;-;0;0;-;-;-;-;-;-
OF;PP02319;"Nutrasetika Pack 1-Antioksidan (Free Magozai 750)";1612100;2;3224200;0;2931091;293109;0;0
FK;01;0;0041957568618;10;2019;13/10/2019;810976639732000;"Ir.HJ.Hayatun Fardah";"Jl. Garuda No.81 Kel. Komet Kec. Banjar Baru Utara Kab Banjarbaru - Kalimantan Selatan";1692000;169200;0;0;0;0;0;0;57819
LT;810976639732000;"Ir.HJ.Hayatun Fardah";-;-;-;0;0;-;-;-;-;-;-
OF;PP0417;"Starkidz Beli 3 Gratis 1";124080;15;1861200;0;1692000;169200;0;0
FK;01;0;0041957568674;10;2019;14/10/2019;594682387037000;"Zainal Arifin.";"Jl. Thalib II No.5 Krukut - Tamansari Jakarta Barat";1317709;131771;0;0;0;0;0;0;57876
LT;594682387037000;"Zainal Arifin.";-;-;-;0;0;-;-;-;-;-;-
OF;PP0555;"Oste Forte (Beli 4 Gratis 2)";268840;4;1075360;0;977600;97760;0;0
OF;HF0020;Glucosefit;374120;1;374120;0;340109;34011;0;0
FK;01;0;0041957568699;10;2019;15/10/2019;810976639732000;"Ir.HJ.Hayatun Fardah";"Jl. Garuda No.81 Kel. Komet Kec. Banjar Baru Utara Kab Banjarbaru - Kalimantan Selatan";252945;25294;0;0;0;0;0;0;57896
LT;810976639732000;"Ir.HJ.Hayatun Fardah";-;-;-;0;0;-;-;-;-;-;-
OF;NT0044;Asta-Gluco;278240;1;278240;0;252945;25294;0;0
FK;01;0;0041957569446;10;2019;15/10/2019;810976639732000;"Ir.HJ.Hayatun Fardah";"Jl. Garuda No.81 Kel. Komet Kec. Banjar Baru Utara Kab Banjarbaru - Kalimantan Selatan";3528418;352842;0;0;0;0;0;0;57887
LT;810976639732000;"Ir.HJ.Hayatun Fardah";-;-;-;0;0;-;-;-;-;-;-
OF;HF0023;"Salmon Oil (90)";356260;10;3562600;0;3238727;323873;0;0
OF;SL0005;"Slim Health 90";318660;1;318660;0;289691;28969;0;0
FK;01;0;0041957569447;10;2019;15/10/2019;810976639732000;"Ir.HJ.Hayatun Fardah";"Jl. Garuda No.81 Kel. Komet Kec. Banjar Baru Utara Kab Banjarbaru - Kalimantan Selatan";656291;65629;0;0;0;0;0;0;57897
LT;810976639732000;"Ir.HJ.Hayatun Fardah";-;-;-;0;0;-;-;-;-;-;-
OF;HF0018;"Coformula 30";360960;2;721920;0;656291;65629;0;0
FK;01;0;0041957568705;10;2019;16/10/2019;672354446619000;"Surjana Dewi Effendy";"JL. Manyar Tirtoyoso Selatan 4 no. 11 RT 007 RW 005 Manyarsabrangan Mulyorejo surabaya";2514927;251493;0;0;0;0;0;0;57902
LT;672354446619000;"Surjana Dewi Effendy";-;-;-;0;0;-;-;-;-;-;-
OF;PP0588;"Asta-gen (3 get 1)";307380;9;2766420;0;2514927;251493;0;0
FK;01;0;0041957568706;10;2019;16/10/2019;810976639732000;"Ir.HJ.Hayatun Fardah";"Jl. Garuda No.81 Kel. Komet Kec. Banjar Baru Utara Kab Banjarbaru - Kalimantan Selatan";388818;38882;0;0;0;0;0;0;57903
LT;810976639732000;"Ir.HJ.Hayatun Fardah";-;-;-;0;0;-;-;-;-;-;-
OF;NT0048;Gastrimag;427700;1;427700;0;388818;38882;0;0
FK;01;0;0041957568719;10;2019;16/10/2019;810976639732000;"Ir.HJ.Hayatun Fardah";"Jl. Garuda No.81 Kel. Komet Kec. Banjar Baru Utara Kab Banjarbaru - Kalimantan Selatan";72636;7264;0;0;0;0;0;0;57918
LT;810976639732000;"Ir.HJ.Hayatun Fardah";-;-;-;0;0;-;-;-;-;-;-
OF;NT0046;"Echina Tocher";79900;1;79900;0;72636;7264;0;0
FK;01;0;0041957569448;10;2019;16/10/2019;810976639732000;"Ir.HJ.Hayatun Fardah";"Jl. Garuda No.81 Kel. Komet Kec. Banjar Baru Utara Kab Banjarbaru - Kalimantan Selatan";2563636;256364;0;0;0;0;0;0;57916
LT;810976639732000;"Ir.HJ.Hayatun Fardah";-;-;-;0;0;-;-;-;-;-;-
OF;NT0029;"Calcium With Vit D";295160;5;1475800;0;1341636;134164;0;0
OF;NT0043;"Oste Forte 30";268840;5;1344200;0;1222000;122200;0;0
FK;01;0;0041957569449;10;2019;16/10/2019;810976639732000;"Ir.HJ.Hayatun Fardah";"Jl. Garuda No.81 Kel. Komet Kec. Banjar Baru Utara Kab Banjarbaru - Kalimantan Selatan";2119273;211927;0;0;0;0;0;0;57917
LT;810976639732000;"Ir.HJ.Hayatun Fardah";-;-;-;0;0;-;-;-;-;-;-
OF;NT0037;"Magozai 750 ml";620400;1;620400;0;564000;56400;0;0
OF;PP0527;"Gastrimag (Beli 4 Gratis 2)";427700;4;1710800;0;1555273;155527;0;0
FK;01;0;0041957568738;10;2019;17/10/2019;810976639732000;"Ir.HJ.Hayatun Fardah";"Jl. Garuda No.81 Kel. Komet Kec. Banjar Baru Utara Kab Banjarbaru - Kalimantan Selatan";243545;24354;0;0;0;0;0;0;57936
LT;810976639732000;"Ir.HJ.Hayatun Fardah";-;-;-;0;0;-;-;-;-;-;-
OF;NT0040;"Calway-C Jr";267900;1;267900;0;243545;24354;0;0
FK;01;0;0041957569452;10;2019;17/10/2019;810976639732000;"Ir.HJ.Hayatun Fardah";"Jl. Garuda No.81 Kel. Komet Kec. Banjar Baru Utara Kab Banjarbaru - Kalimantan Selatan";907527;90752;0;0;0;0;0;0;57938
LT;810976639732000;"Ir.HJ.Hayatun Fardah";-;-;-;0;0;-;-;-;-;-;-
OF;HF0018;"Coformula 30";360960;1;360960;0;328145;32814;0;0
OF;SL0005;"Slim Health 90";318660;2;637320;0;579382;57938;0;0
FK;01;0;0041957569453;10;2019;17/10/2019;810976639732000;"Ir.HJ.Hayatun Fardah";"Jl. Garuda No.81 Kel. Komet Kec. Banjar Baru Utara Kab Banjarbaru - Kalimantan Selatan";564000;56400;0;0;0;0;0;0;57939
LT;810976639732000;"Ir.HJ.Hayatun Fardah";-;-;-;0;0;-;-;-;-;-;-
OF;NT0037;"Magozai 750 ml";620400;1;620400;0;564000;56400;0;0
FK;01;0;0041957568742;10;2019;18/10/2019;672354446619000;"Surjana Dewi Effendy";"JL. Manyar Tirtoyoso Selatan 4 no. 11 RT 007 RW 005 Manyarsabrangan Mulyorejo surabaya";5400727;540073;0;0;0;0;0;0;57941
LT;672354446619000;"Surjana Dewi Effendy";-;-;-;0;0;-;-;-;-;-;-
OF;PP0611;"Asta-Gold (Beli 4 Gratis 2)";371300;16;5940800;0;5400727;540073;0;0
FK;01;0;0041957568759;10;2019;18/10/2019;810976639732000;"Ir.HJ.Hayatun Fardah";"Jl. Garuda No.81 Kel. Komet Kec. Banjar Baru Utara Kab Banjarbaru - Kalimantan Selatan";7731927;773192;0;0;0;0;0;0;57952
LT;810976639732000;"Ir.HJ.Hayatun Fardah";-;-;-;0;0;-;-;-;-;-;-
OF;PP02319;"Nutrasetika Pack 1-Antioksidan (Free Magozai 750)";1612100;1;1612100;0;1465545;146554;0;0
OF;HF0017;"Bee Propolis Liquid";307380;5;1536900;0;1397182;139718;0;0
OF;NT0037;"Magozai 750 ml";620400;5;3102000;0;2820000;282000;0;0
OF;NT0048;Gastrimag;427700;4;1710800;0;1555273;155527;0;0
OF;NT0032;Gravica;271660;2;543320;0;493927;49393;0;0
FK;01;0;0041957568769;10;2019;19/10/2019;674087382114000;"IDA FENNY ELYSA";"JL. DEBLOD SUNDORO NO. 41 LK. II";8147238;814722;0;0;0;0;0;0;57961
LT;674087382114000;"IDA FENNY ELYSA";-;-;-;0;0;-;-;-;-;-;-
OF;PP0543;"Kidz pack 1 Coklat (Gratis 1 Magozai 750 mL)";1037760;1;1037760;0;943418;94342;0;0
OF;HF0015;"Bee Propolis 30";210560;3;631680;0;574255;57425;0;0
OF;HF0022;"Salmon Oil (30)";194580;4;778320;0;707564;70756;0;0
OF;NT0060;"Starvitz Nutra Coklat 750gr";263200;4;1052800;0;957091;95709;0;0
OF;SK0096;"Starter Kit Oktober 2019 Reg 99rb";99000;3;297000;0;270000;27000;0;0
OF;PP0606;"TOP UP Loyalty 2 Imuno Junior + Macolic Junior";59000;24;1416000;0;1287273;128727;0;0
OF;PP0610;"TOP UP 5 Calway-C Jr + 5 Starkidz Fish Oil";590000;1;590000;0;536364;53636;0;0
OF;PP0508;"Starvitz Nutra Coklat750(4 get 2 Starvit cklt 350)";263200;12;3158400;0;2871273;287127;0;0
FK;01;0;0041957568771;10;2019;19/10/2019;674087382114000;"IDA FENNY ELYSA";"JL. DEBLOD SUNDORO NO. 41 LK. II";3828364;382836;0;0;0;0;0;0;57963
LT;674087382114000;"IDA FENNY ELYSA";-;-;-;0;0;-;-;-;-;-;-
OF;PP0511;"Starvitz Nutra Vanila750(4 get 2 Strvt Vanila350)";263200;16;4211200;0;3828364;382836;0;0
FK;01;0;0041957568774;10;2019;19/10/2019;594682387037000;"Zainal Arifin.";"Jl. Thalib II No.5 Krukut - Tamansari Jakarta Barat";369145;36915;0;0;0;0;0;0;57965
LT;594682387037000;"Zainal Arifin.";-;-;-;0;0;-;-;-;-;-;-
OF;SK0096;"Starter Kit Oktober 2019 Reg 99rb";99000;1;99000;0;90000;9000;0;0
OF;NT0057;"Glucofit Susu";117500;1;117500;0;106818;10682;0;0
OF;NT0063;"Starvitz Nutra Vanilla 350gr";140060;1;140060;0;127327;12733;0;0
OF;MT02530;"Catalog Vol 3 Th.2019";9900;5;49500;0;45000;4500;0;0
FK;01;0;0041957568822;10;2019;21/10/2019;672354446619000;"Surjana Dewi Effendy";"JL. Manyar Tirtoyoso Selatan 4 no. 11 RT 007 RW 005 Manyarsabrangan Mulyorejo surabaya";7942709;794269;0;0;0;0;0;0;58022
LT;672354446619000;"Surjana Dewi Effendy";-;-;-;0;0;-;-;-;-;-;-
OF;NT0027;Asta-Gen;307380;2;614760;0;558873;55887;0;0
OF;HF0020;Glucosefit;374120;1;374120;0;340109;34011;0;0
OF;NT0041;"Magozai Fruity 375ml";366600;2;733200;0;666545;66654;0;0
OF;HF0023;"Salmon Oil (90)";356260;1;356260;0;323873;32387;0;0
OF;NT0037;"Magozai 750 ml";620400;2;1240800;0;1128000;112800;0;0
OF;NT020024;StarKidz;124080;3;372240;0;338400;33840;0;0
OF;PP0611;"Asta-Gold (Beli 4 Gratis 2)";371300;12;4455600;0;4050545;405054;0;0
OF;PP0612;"TOP UP 10 FBCx";590000;1;590000;0;536364;53636;0;0
FK;01;0;0041957569461;10;2019;21/10/2019;672354446619000;"Surjana Dewi Effendy";"JL. Manyar Tirtoyoso Selatan 4 no. 11 RT 007 RW 005 Manyarsabrangan Mulyorejo surabaya";1943236;194324;0;0;0;0;0;0;58021
LT;672354446619000;"Surjana Dewi Effendy";-;-;-;0;0;-;-;-;-;-;-
OF;PP0521;"DR. Alopec Set (Beli 1 Gratis 1)";1068780;2;2137560;0;1943236;194324;0;0
FK;01;0;0041957568858;10;2019;22/10/2019;579473596823000;"Supantia Saleh";"Jl. Bitung Tengah RT.010 Rw.004. Bitung Tengah - Maesa Bitung";4588910;458890;0;0;0;0;0;0;58055
LT;579473596823000;"Supantia Saleh";-;-;-;0;0;-;-;-;-;-;-
OF;PP0611;"Asta-Gold (Beli 4 Gratis 2)";371300;8;2970400;0;2700364;270036;0;0
OF;PP0516;"Asta Cardix (Beli 2 Gratis 1 Salmon 90)";460600;2;921200;0;837455;83745;0;0
OF;PP0521;"DR. Alopec Set (Beli 1 Gratis 1)";1068780;1;1068780;0;971618;97162;0;0
OF;NT0033;ImunoForce;87420;1;87420;0;79473;7947;0;0
FK;01;0;0041957568866;10;2019;23/10/2019;810976639732000;"Ir.HJ.Hayatun Fardah";"Jl. Garuda No.81 Kel. Komet Kec. Banjar Baru Utara Kab Banjarbaru - Kalimantan Selatan";3974491;397449;0;0;0;0;0;0;58065
LT;810976639732000;"Ir.HJ.Hayatun Fardah";-;-;-;0;0;-;-;-;-;-;-
OF;PP0556;"Slim Shake (4 gratis 2)";357200;4;1428800;0;1298909;129891;0;0
OF;PP0526;"FBCx 90 (Beli 4 Gratis 3)";218080;4;872320;0;793018;79302;0;0
OF;NT0045;"Echina Sniff";271660;1;271660;0;246964;24696;0;0
OF;PP0441;"Curcomplex 95 (Beli 3 Gratis 1 Magozai 750ml)";599720;3;1799160;0;1635600;163560;0;0
FK;01;0;0041957568867;10;2019;23/10/2019;810976639732000;"Ir.HJ.Hayatun Fardah";"Jl. Garuda No.81 Kel. Komet Kec. Banjar Baru Utara Kab Banjarbaru - Kalimantan Selatan";957091;95709;0;0;0;0;0;0;58066
LT;810976639732000;"Ir.HJ.Hayatun Fardah";-;-;-;0;0;-;-;-;-;-;-
OF;PP0511;"Starvitz Nutra Vanila750(4 get 2 Strvt Vanila350)";263200;4;1052800;0;957091;95709;0;0
FK;01;0;0041957568930;10;2019;25/10/2019;594682387037000;"Zainal Arifin.";"Jl. Thalib II No.5 Krukut - Tamansari Jakarta Barat";4396636;439664;0;0;0;0;0;0;58115
LT;594682387037000;"Zainal Arifin.";-;-;-;0;0;-;-;-;-;-;-
OF;PP02319;"Nutrasetika Pack 1-Antioksidan (Free Magozai 750)";1612100;3;4836300;0;4396636;439664;0;0
FK;01;0;0041957568954;10;2019;25/10/2019;594682387037000;"Zainal Arifin.";"Jl. Thalib II No.5 Krukut - Tamansari Jakarta Barat";4145400;414540;0;0;0;0;0;0;58138
LT;594682387037000;"Zainal Arifin.";-;-;-;0;0;-;-;-;-;-;-
OF;PP02319;"Nutrasetika Pack 1-Antioksidan (Free Magozai 750)";1773310;2;3546620;0;3224200;322420;0;0
OF;PP0516;"Asta Cardix (Beli 2 Gratis 1 Salmon 90)";506660;2;1013320;0;921200;92120;0;0
FK;01;0;0041957568955;10;2019;25/10/2019;594682387037000;"Zainal Arifin.";"Jl. Thalib II No.5 Krukut - Tamansari Jakarta Barat";1465545;146554;0;0;0;0;0;0;58139
LT;594682387037000;"Zainal Arifin.";-;-;-;0;0;-;-;-;-;-;-
OF;PP02319;"Nutrasetika Pack 1-Antioksidan (Free Magozai 750)";1612100;1;1612100;0;1465545;146554;0;0
FK;01;0;0041957568956;10;2019;25/10/2019;594682387037000;"Zainal Arifin.";"Jl. Thalib II No.5 Krukut - Tamansari Jakarta Barat";1979127;197913;0;0;0;0;0;0;58140
LT;594682387037000;"Zainal Arifin.";-;-;-;0;0;-;-;-;-;-;-
OF;PP0587;"Legres (3 Get 1)";148520;6;891120;0;810109;81011;0;0
OF;PP0535;"Osteopain (Beli 4 Gratis 2)";321480;4;1285920;0;1169018;116902;0;0
FK;01;0;0041957568957;10;2019;25/10/2019;594682387037000;"Zainal Arifin.";"Jl. Thalib II No.5 Krukut - Tamansari Jakarta Barat";1620218;162022;0;0;0;0;0;0;58143
LT;594682387037000;"Zainal Arifin.";-;-;-;0;0;-;-;-;-;-;-
OF;PP0587;"Legres (3 Get 1)";148520;12;1782240;0;1620218;162022;0;0
FK;01;0;0041957568964;10;2019;26/10/2019;478640824626000;"Anang Purwito";"Jl.SLAMET RIYADI GANG CENTRAL KAV 7 JEMBER 68112";1478909;147890;0;0;0;0;0;0;58153
LT;478640824626000;"Anang Purwito";-;-;-;0;0;-;-;-;-;-;-
OF;NT0029;"Calcium With Vit D";307720;1;307720;0;279745;27974;0;0
OF;NT0042;Legreskin;259700;4;1038800;0;944364;94436;0;0
OF;NT0043;"Oste Forte 30";280280;1;280280;0;254800;25480;0;0
FK;01;0;0041957568971;10;2019;26/10/2019;810976639732000;"Ir.HJ.Hayatun Fardah";"Jl. Garuda No.81 Kel. Komet Kec. Banjar Baru Utara Kab Banjarbaru - Kalimantan Selatan";4985527;498553;0;0;0;0;0;0;58161
LT;810976639732000;"Ir.HJ.Hayatun Fardah";-;-;-;0;0;-;-;-;-;-;-
OF;PP0587;"Legres (3 Get 1)";148520;12;1782240;0;1620218;162022;0;0
OF;NT020024;StarKidz;124080;3;372240;0;338400;33840;0;0
OF;PP0556;"Slim Shake (4 gratis 2)";357200;8;2857600;0;2597818;259782;0;0
OF;PP0606;"TOP UP Loyalty 2 Imuno Junior + Macolic Junior";59000;8;472000;0;429091;42909;0;0
FK;01;0;0041957568995;10;2019;26/10/2019;594682387037000;"Zainal Arifin.";"Jl. Thalib II No.5 Krukut - Tamansari Jakarta Barat";405055;40505;0;0;0;0;0;0;58186
LT;594682387037000;"Zainal Arifin.";-;-;-;0;0;-;-;-;-;-;-
OF;PP0587;"Legres (3 Get 1)";148520;3;445560;0;405055;40505;0;0
FK;01;0;0041957569004;10;2019;26/10/2019;594682387037000;"Zainal Arifin.";"Jl. Thalib II No.5 Krukut - Tamansari Jakarta Barat";4674927;467492;0;0;0;0;0;0;58196
LT;594682387037000;"Zainal Arifin.";-;-;-;0;0;-;-;-;-;-;-
OF;PP0587;"Legres (3 Get 1)";148520;9;1336680;0;1215164;121516;0;0
OF;PP0555;"Oste Forte (Beli 4 Gratis 2)";268840;4;1075360;0;977600;97760;0;0
OF;PP0521;"DR. Alopec Set (Beli 1 Gratis 1)";1068780;1;1068780;0;971618;97162;0;0
OF;MT02530;"Catalog Vol 3 Th.2019";9900;5;49500;0;45000;4500;0;0
OF;PP02319;"Nutrasetika Pack 1-Antioksidan (Free Magozai 750)";1612100;1;1612100;0;1465545;146554;0;0
FK;01;0;0041957569474;10;2019;26/10/2019;594682387037000;"Zainal Arifin.";"Jl. Thalib II No.5 Krukut - Tamansari Jakarta Barat";427273;42727;0;0;0;0;0;0;58191
LT;594682387037000;"Zainal Arifin.";-;-;-;0;0;-;-;-;-;-;-
OF;PP0528;"Glucofit Susu (Beli 4 Gratis 2)";117500;4;470000;0;427273;42727;0;0
FK;01;0;0041957569475;10;2019;26/10/2019;594682387037000;"Zainal Arifin.";"Jl. Thalib II No.5 Krukut - Tamansari Jakarta Barat";1465545;146554;0;0;0;0;0;0;58195
LT;594682387037000;"Zainal Arifin.";-;-;-;0;0;-;-;-;-;-;-
OF;PP02319;"Nutrasetika Pack 1-Antioksidan (Free Magozai 750)";1612100;1;1612100;0;1465545;146554;0;0
FK;01;0;0041957569018;10;2019;27/10/2019;672354446619000;"Surjana Dewi Effendy";"JL. Manyar Tirtoyoso Selatan 4 no. 11 RT 007 RW 005 Manyarsabrangan Mulyorejo surabaya";1620218;162022;0;0;0;0;0;0;58210
LT;672354446619000;"Surjana Dewi Effendy";-;-;-;0;0;-;-;-;-;-;-
OF;PP0587;"Legres (3 Get 1)";148520;12;1782240;0;1620218;162022;0;0
FK;01;0;0041957569020;10;2019;27/10/2019;082738550831000;"Harun D. Tumbuan";"Komplek RSD Madani No.19 Kota Palu Sualwesi Tengah";536364;53636;0;0;0;0;0;0;58212
LT;082738550831000;"Harun D. Tumbuan";-;-;-;0;0;-;-;-;-;-;-
OF;PP0581;"TOP UP 10 Starkidz Fish oil 590rb";590000;1;590000;0;536364;53636;0;0
FK;01;0;0041957569021;10;2019;27/10/2019;082738550831000;"Harun D. Tumbuan";"Komplek RSD Madani No.19 Kota Palu Sualwesi Tengah";2430327;243033;0;0;0;0;0;0;58213
LT;082738550831000;"Harun D. Tumbuan";-;-;-;0;0;-;-;-;-;-;-
OF;PP0587;"Legres (3 Get 1)";148520;18;2673360;0;2430327;243033;0;0
FK;01;0;0041957569022;10;2019;27/10/2019;082738550831000;"Harun D. Tumbuan";"Komplek RSD Madani No.19 Kota Palu Sualwesi Tengah";3074164;307416;0;0;0;0;0;0;58214
LT;082738550831000;"Harun D. Tumbuan";-;-;-;0;0;-;-;-;-;-;-
OF;NT0031;Ginsana;408900;2;817800;0;743455;74345;0;0
OF;SK0097;"Starter Kit Oktober 2019 Cantik 299rb";299000;5;1495000;0;1359091;135909;0;0
OF;PP0521;"DR. Alopec Set (Beli 1 Gratis 1)";1068780;1;1068780;0;971618;97162;0;0
FK;01;0;0041957569030;10;2019;27/10/2019;082738550831000;"Harun D. Tumbuan";"Komplek RSD Madani No.19 Kota Palu Sualwesi Tengah";4860655;486065;0;0;0;0;0;0;58223
LT;082738550831000;"Harun D. Tumbuan";-;-;-;0;0;-;-;-;-;-;-
OF;PP0587;"Legres (3 Get 1)";148520;36;5346720;0;4860655;486065;0;0
FK;01;0;0041957569044;10;2019;27/10/2019;674087382114000;"IDA FENNY ELYSA";"JL. DEBLOD SUNDORO NO. 41 LK. II";7227747;722773;0;0;0;0;0;0;58239
LT;674087382114000;"IDA FENNY ELYSA";-;-;-;0;0;-;-;-;-;-;-
OF;PP0587;"Legres (3 Get 1)";148520;36;5346720;0;4860655;486065;0;0
OF;PP0536;"Slim Health 90 (Beli 4 Gratis 2 Slim Shake 90)";318660;4;1274640;0;1158764;115876;0;0
OF;SL0006;"Slim Lock 90";369420;2;738840;0;671673;67167;0;0
OF;NT0029;"Calcium With Vit D";295160;2;590320;0;536655;53665;0;0
FK;01;0;0041957569047;10;2019;27/10/2019;594682387037000;"Zainal Arifin.";"Jl. Thalib II No.5 Krukut - Tamansari Jakarta Barat";405055;40505;0;0;0;0;0;0;58242
LT;594682387037000;"Zainal Arifin.";-;-;-;0;0;-;-;-;-;-;-
OF;PP0587;"Legres (3 Get 1)";148520;3;445560;0;405055;40505;0;0
FK;01;0;0041957569476;10;2019;27/10/2019;082738550831000;"Harun D. Tumbuan";"Komplek RSD Madani No.19 Kota Palu Sualwesi Tengah";5099926;509992;0;0;0;0;0;0;58215
LT;082738550831000;"Harun D. Tumbuan";-;-;-;0;0;-;-;-;-;-;-
OF;HF0019;"Coformula 60";635440;2;1270880;0;1155345;115534;0;0
OF;HF0016;"Bee Propolis 90";563060;2;1126120;0;1023745;102374;0;0
OF;PP0555;"Oste Forte (Beli 4 Gratis 2)";268840;4;1075360;0;977600;97760;0;0
OF;PP0521;"DR. Alopec Set (Beli 1 Gratis 1)";1068780;2;2137560;0;1943236;194324;0;0
FK;01;0;0041957569094;10;2019;28/10/2019;594682387037000;"Zainal Arifin.";"Jl. Thalib II No.5 Krukut - Tamansari Jakarta Barat";1465545;146554;0;0;0;0;0;0;58277
LT;594682387037000;"Zainal Arifin.";-;-;-;0;0;-;-;-;-;-;-
OF;PP02319;"Nutrasetika Pack 1-Antioksidan (Free Magozai 750)";1612100;1;1612100;0;1465545;146554;0;0
FK;01;0;0041957569098;10;2019;28/10/2019;594682387037000;"Zainal Arifin.";"Jl. Thalib II No.5 Krukut - Tamansari Jakarta Barat";1465545;146554;0;0;0;0;0;0;58280
LT;594682387037000;"Zainal Arifin.";-;-;-;0;0;-;-;-;-;-;-
OF;PP02319;"Nutrasetika Pack 1-Antioksidan (Free Magozai 750)";1612100;1;1612100;0;1465545;146554;0;0
FK;01;0;0041957569100;10;2019;28/10/2019;594682387037000;"Zainal Arifin.";"Jl. Thalib II No.5 Krukut - Tamansari Jakarta Barat";854545;85454;0;0;0;0;0;0;58283
LT;594682387037000;"Zainal Arifin.";-;-;-;0;0;-;-;-;-;-;-
OF;PP0528;"Glucofit Susu (Beli 4 Gratis 2)";117500;8;940000;0;854545;85454;0;0
FK;01;0;0041957569117;10;2019;29/10/2019;082738550831000;"Harun D. Tumbuan";"Komplek RSD Madani No.19 Kota Palu Sualwesi Tengah";1701000;170100;0;0;0;0;0;0;58296
LT;082738550831000;"Harun D. Tumbuan";-;-;-;0;0;-;-;-;-;-;-
OF;PP0602;"Magozai 750 (Beli 3 Free 1 Mgoz375 & 1 Legres)";620400;3;1861200;0;1692000;169200;0;0
OF;MT02530;"Catalog Vol 3 Th.2019";9900;1;9900;0;9000;900;0;0
FK;01;0;0041957569164;10;2019;30/10/2019;810976639732000;"Ir.HJ.Hayatun Fardah";"Jl. Garuda No.81 Kel. Komet Kec. Banjar Baru Utara Kab Banjarbaru - Kalimantan Selatan";4411164;441116;0;0;0;0;0;0;58341
LT;810976639732000;"Ir.HJ.Hayatun Fardah";-;-;-;0;0;-;-;-;-;-;-
OF;PP0602;"Magozai 750 (Beli 3 Free 1 Mgoz375 & 1 Legres)";620400;6;3722400;0;3384000;338400;0;0
OF;NT0034;Legalon;370360;2;740720;0;673382;67338;0;0
OF;HF0022;"Salmon Oil (30)";194580;2;389160;0;353782;35378;0;0
FK;01;0;0041957569180;10;2019;30/10/2019;672354446619000;"Surjana Dewi Effendy";"JL. Manyar Tirtoyoso Selatan 4 no. 11 RT 007 RW 005 Manyarsabrangan Mulyorejo surabaya";10126073;1012607;0;0;0;0;0;0;58358
LT;672354446619000;"Surjana Dewi Effendy";-;-;-;0;0;-;-;-;-;-;-
OF;HF0020;Glucosefit;374120;1;374120;0;340109;34011;0;0
OF;NT0037;"Magozai 750 ml";620400;2;1240800;0;1128000;112800;0;0
OF;PP02319;"Nutrasetika Pack 1-Antioksidan (Free Magozai 750)";1612100;2;3224200;0;2931091;293109;0;0
OF;BY0026;"BI2 Facial Wash ";125960;1;125960;0;114509;11451;0;0
OF;PP0602;"Magozai 750 (Beli 3 Free 1 Mgoz375 & 1 Legres)";620400;9;5583600;0;5076000;507600;0;0
OF;PP0613;"TOP UP 10 Glucofit Susu";590000;1;590000;0;536364;53636;0;0
FK;01;0;0041957569196;10;2019;30/10/2019;082738550831000;"Harun D. Tumbuan";"Komplek RSD Madani No.19 Kota Palu Sualwesi Tengah";14680436;1468043;0;0;0;0;0;0;58377
LT;082738550831000;"Harun D. Tumbuan";-;-;-;0;0;-;-;-;-;-;-
OF;PP0602;"Magozai 750 (Beli 3 Free 1 Mgoz375 & 1 Legres)";620400;18;11167200;0;10152000;1015200;0;0
OF;PP0526;"FBCx 90 (Beli 4 Gratis 3)";218080;4;872320;0;793018;79302;0;0
OF;PP0525;"Echina Tocher (Beli 4 Gratis 2)";79900;4;319600;0;290545;29054;0;0
OF;HF0020;Glucosefit;374120;3;1122360;0;1020327;102033;0;0
OF;PP0606;"TOP UP Loyalty 2 Imuno Junior + Macolic Junior";59000;20;1180000;0;1072727;107273;0;0
OF;PP0613;"TOP UP 10 Glucofit Susu";590000;1;590000;0;536364;53636;0;0
OF;SK0097;"Starter Kit Oktober 2019 Cantik 299rb";299000;3;897000;0;815455;81545;0;0
OF;MT0235;"Nota penjualan";0;2;0;0;0;0;0;0
OF;MT0236;"Formulir member 1 buku";0;2;0;0;0;0;0;0
FK;01;0;0041957569197;10;2019;30/10/2019;082738550831000;"Harun D. Tumbuan";"Komplek RSD Madani No.19 Kota Palu Sualwesi Tengah";543636;54364;0;0;0;0;0;0;58378
LT;082738550831000;"Harun D. Tumbuan";-;-;-;0;0;-;-;-;-;-;-
OF;SK0097;"Starter Kit Oktober 2019 Cantik 299rb";299000;2;598000;0;543636;54364;0;0
FK;01;0;0041957569199;10;2019;30/10/2019;594682387037000;"Zainal Arifin.";"Jl. Thalib II No.5 Krukut - Tamansari Jakarta Barat";429090;42908;0;0;0;0;0;0;58380
LT;594682387037000;"Zainal Arifin.";-;-;-;0;0;-;-;-;-;-;-
OF;PP0566;"TOP UP Starvitz Nutra Coklat 350gr";59000;4;236000;0;214545;21454;0;0
OF;PP0567;"TOP UP Starvitz Nutra Vanila 350gr";59000;4;236000;0;214545;21454;0;0
FK;01;0;0041957569483;10;2019;30/10/2019;594682387037000;"Zainal Arifin.";"Jl. Thalib II No.5 Krukut - Tamansari Jakarta Barat";217909;21791;0;0;0;0;0;0;58373
LT;594682387037000;"Zainal Arifin.";-;-;-;0;0;-;-;-;-;-;-
OF;NT0058;"Imuno Batuk Plus";239700;1;239700;0;217909;21791;0;0
FK;01;0;0041957569484;10;2019;30/10/2019;594682387037000;"Zainal Arifin.";"Jl. Thalib II No.5 Krukut - Tamansari Jakarta Barat";72636;7264;0;0;0;0;0;0;58375
LT;594682387037000;"Zainal Arifin.";-;-;-;0;0;-;-;-;-;-;-
OF;NT0046;"Echina Tocher";79900;1;79900;0;72636;7264;0;0
FK;01;0;0041957569238;10;2019;31/10/2019;594682387037000;"Zainal Arifin.";"Jl. Thalib II No.5 Krukut - Tamansari Jakarta Barat";1398036;139804;0;0;0;0;0;0;58426
LT;594682387037000;"Zainal Arifin.";-;-;-;0;0;-;-;-;-;-;-
OF;PP02330;"Nutrasetika Pack 2-Antioksidan Plus (Coformula30)";1537840;1;1537840;0;1398036;139804;0;0
FK;01;0;0041957569254;10;2019;31/10/2019;594682387037000;"Zainal Arifin.";"Jl. Thalib II No.5 Krukut - Tamansari Jakarta Barat";90000;9000;0;0;0;0;0;0;58443
LT;594682387037000;"Zainal Arifin.";-;-;-;0;0;-;-;-;-;-;-
OF;SK0096;"Starter Kit Oktober 2019 Reg 99rb";99000;1;99000;0;90000;9000;0;0
FK;01;0;0041957569283;10;2019;31/10/2019;810976639732000;"Ir.HJ.Hayatun Fardah";"Jl. Garuda No.81 Kel. Komet Kec. Banjar Baru Utara Kab Banjarbaru - Kalimantan Selatan";90000;9000;0;0;0;0;0;0;58481
LT;810976639732000;"Ir.HJ.Hayatun Fardah";-;-;-;0;0;-;-;-;-;-;-
OF;SK0096;"Starter Kit Oktober 2019 Reg 99rb";99000;1;99000;0;90000;9000;0;0
FK;01;0;0041957569294;10;2019;31/10/2019;674087382114000;"IDA FENNY ELYSA";"JL. DEBLOD SUNDORO NO. 41 LK. II";4772727;477273;0;0;0;0;0;0;356452
LT;674087382114000;"IDA FENNY ELYSA";-;-;-;0;0;-;-;-;-;-;-
OF;MT0336;"Produk Event Starvitz Coklat 350(105)Tebing Tinggi";5250000;1;5250000;0;4772727;477273;0;0
FK;01;0;0041957569299;10;2019;31/10/2019;082738550831000;"Harun D. Tumbuan";"Komplek RSD Madani No.19 Kota Palu Sualwesi Tengah";6795091;679509;0;0;0;0;0;0;58498
LT;082738550831000;"Harun D. Tumbuan";-;-;-;0;0;-;-;-;-;-;-
OF;PP0602;"Magozai 750 (Beli 3 Free 1 Mgoz375 & 1 Legres)";620400;9;5583600;0;5076000;507600;0;0
OF;SK0097;"Starter Kit Oktober 2019 Cantik 299rb";299000;5;1495000;0;1359091;135909;0;0
OF;SK0096;"Starter Kit Oktober 2019 Reg 99rb";99000;4;396000;0;360000;36000;0;0
FK;01;0;0041957569300;10;2019;31/10/2019;674087382114000;"IDA FENNY ELYSA";"JL. DEBLOD SUNDORO NO. 41 LK. II";450000;45000;0;0;0;0;0;0;58499
LT;674087382114000;"IDA FENNY ELYSA";-;-;-;0;0;-;-;-;-;-;-
OF;SK0096;"Starter Kit Oktober 2019 Reg 99rb";99000;5;495000;0;450000;45000;0;0
FK;01;0;0041957569311;10;2019;31/10/2019;594682387037000;"Zainal Arifin.";"Jl. Thalib II No.5 Krukut - Tamansari Jakarta Barat";226455;22645;0;0;0;0;0;0;58512
LT;594682387037000;"Zainal Arifin.";-;-;-;0;0;-;-;-;-;-;-
OF;NT0042;Legreskin;249100;1;249100;0;226455;22645;0;0
FK;01;0;0041957569332;10;2019;31/10/2019;672354446619000;"Surjana Dewi Effendy";"JL. Manyar Tirtoyoso Selatan 4 no. 11 RT 007 RW 005 Manyarsabrangan Mulyorejo surabaya";2015873;201587;0;0;0;0;0;0;58533
LT;672354446619000;"Surjana Dewi Effendy";-;-;-;0;0;-;-;-;-;-;-
OF;HF0023;"Salmon Oil (90)";356260;1;356260;0;323873;32387;0;0
OF;PP0602;"Magozai 750 (Beli 3 Free 1 Mgoz375 & 1 Legres)";620400;3;1861200;0;1692000;169200;0;0
FK;01;0;0041957569334;10;2019;31/10/2019;082738550831000;"Harun D. Tumbuan";"Komplek RSD Madani No.19 Kota Palu Sualwesi Tengah";3384000;338400;0;0;0;0;0;0;58541
LT;082738550831000;"Harun D. Tumbuan";-;-;-;0;0;-;-;-;-;-;-
OF;PP0602;"Magozai 750 (Beli 3 Free 1 Mgoz375 & 1 Legres)";620400;6;3722400;0;3384000;338400;0;0
FK;01;0;0041957569339;10;2019;31/10/2019;082738550831000;"Harun D. Tumbuan";"Komplek RSD Madani No.19 Kota Palu Sualwesi Tengah";1692000;169200;0;0;0;0;0;0;58546
LT;082738550831000;"Harun D. Tumbuan";-;-;-;0;0;-;-;-;-;-;-
OF;PP0602;"Magozai 750 (Beli 3 Free 1 Mgoz375 & 1 Legres)";620400;3;1861200;0;1692000;169200;0;0
FK;01;0;0041957569378;10;2019;31/10/2019;579473596823000;"Supantia Saleh";"Jl. Bitung Tengah RT.010 Rw.004. Bitung Tengah - Maesa Bitung";4583582;458357;0;0;0;0;0;0;58605
LT;579473596823000;"Supantia Saleh";-;-;-;0;0;-;-;-;-;-;-
OF;HF0023;"Salmon Oil (90)";356260;1;356260;0;323873;32387;0;0
OF;NT0030;"Curcomplex 95";599720;1;599720;0;545200;54520;0;0
OF;NT0035;Legres;148520;7;1039640;0;945127;94513;0;0
OF;PP0528;"Glucofit Susu (Beli 4 Gratis 2)";117500;4;470000;0;427273;42727;0;0
OF;NT0034;Legalon;370360;3;1111080;0;1010073;101007;0;0
OF;PP0606;"TOP UP Loyalty 2 Imuno Junior + Macolic Junior";59000;1;59000;0;53636;5364;0;0
OF;PP0516;"Asta Cardix (Beli 2 Gratis 1 Salmon 90)";460600;2;921200;0;837455;83745;0;0
OF;HF0018;"Coformula 30";360960;1;360960;0;328145;32814;0;0
OF;NT020018;"Renewskin 15";124080;1;124080;0;112800;11280;0;0
FK;01;0;0041957569383;10;2019;31/10/2019;674087382114000;"IDA FENNY ELYSA";"JL. DEBLOD SUNDORO NO. 41 LK. II";4692309;469231;0;0;0;0;0;0;58611
LT;674087382114000;"IDA FENNY ELYSA";-;-;-;0;0;-;-;-;-;-;-
OF;NT0037;"Magozai 750 ml";620400;4;2481600;0;2256000;225600;0;0
OF;NT0035;Legres;148520;13;1930760;0;1755236;175524;0;0
OF;HF0017;"Bee Propolis Liquid";307380;2;614760;0;558873;55887;0;0
OF;NT0051;"Sonata Night";134420;1;134420;0;122200;12220;0;0
FK;01;0;0041957569406;10;2019;31/10/2019;674087382114000;"IDA FENNY ELYSA";"JL. DEBLOD SUNDORO NO. 41 LK. II";180000;18000;0;0;0;0;0;0;58634
LT;674087382114000;"IDA FENNY ELYSA";-;-;-;0;0;-;-;-;-;-;-
OF;SK0096;"Starter Kit Oktober 2019 Reg 99rb";99000;2;198000;0;180000;18000;0;0
FK;01;0;0041957569415;10;2019;31/10/2019;674087382114000;"IDA FENNY ELYSA";"JL. DEBLOD SUNDORO NO. 41 LK. II";6892182;689218;0;0;0;0;0;0;58643
LT;674087382114000;"IDA FENNY ELYSA";-;-;-;0;0;-;-;-;-;-;-
OF;NT0036;"Magozai 375 ml";385400;4;1541600;0;1401455;140145;0;0
OF;NT0035;Legres;148520;40;5940800;0;5400727;540073;0;0
OF;SK0096;"Starter Kit Oktober 2019 Reg 99rb";99000;1;99000;0;90000;9000;0;0
FK;01;0;0041957569416;10;2019;31/10/2019;674087382114000;"IDA FENNY ELYSA";"JL. DEBLOD SUNDORO NO. 41 LK. II";5640000;564000;0;0;0;0;0;0;58644
LT;674087382114000;"IDA FENNY ELYSA";-;-;-;0;0;-;-;-;-;-;-
OF;NT0037;"Magozai 750 ml";620400;10;6204000;0;5640000;564000;0;0
FK;01;0;0041957569523;10;2019;31/10/2019;594682387037000;"Zainal Arifin.";"Jl. Thalib II No.5 Krukut - Tamansari Jakarta Barat";2875546;287554;0;0;0;0;0;0;58591
LT;594682387037000;"Zainal Arifin.";-;-;-;0;0;-;-;-;-;-;-
OF;PP02330;"Nutrasetika Pack 2-Antioksidan Plus (Coformula30)";1537840;2;3075680;0;2796073;279607;0;0
OF;NT0033;ImunoForce;87420;1;87420;0;79473;7947;0;0
FK;01;0;0041957569525;10;2019;31/10/2019;674087382114000;"IDA FENNY ELYSA";"JL. DEBLOD SUNDORO NO. 41 LK. II";9011182;901118;0;0;0;0;0;0;58593
LT;674087382114000;"IDA FENNY ELYSA";-;-;-;0;0;-;-;-;-;-;-
OF;NT0027;Asta-Gen;307380;10;3073800;0;2794364;279436;0;0
OF;PP0527;"Gastrimag (Beli 4 Gratis 2)";427700;4;1710800;0;1555273;155527;0;0
OF;HF0018;"Coformula 30";360960;5;1804800;0;1640727;164073;0;0
OF;SL0006;"Slim Lock 90";369420;5;1847100;0;1679182;167918;0;0
OF;NT0029;"Calcium With Vit D";295160;5;1475800;0;1341636;134164;0;0
