0SP201905090033059008 00030331               00000000374729726.0000344BCA               BONUS MEMBER      APRIL 2019                                                                                                                                            
15000563635                                          00000000000072600.00.USPO GUNARTI                                                         B      0140397    BCA               .                 BONUS MEMBER      APRIL 2019                          1R014
17685051231                                          00000000004323688.00A YUDI JAYA MUSRADHY P                                                B      0140397    BCA               Sungguminasa      BONUS MEMBER      APRIL 2019                          1R014
14501001575                                          00000000000051988.00A.NUNIK PRABOWO                                                       B      0140397    BCA               JAKARTA SELATAN   BONUS MEMBER      APRIL 2019                          1R014
13880409866                                          00000000000161840.00ACHMAD YUSUF DR SPKK                                                  B      0140397    BCA               Dharmahusada SurabBONUS MEMBER      APRIL 2019                          1R014
11750534542                                          00000000000050290.00ADDIEN FAHMI                                                          B      0140397    BCA               kcp binjai        BONUS MEMBER      APRIL 2019                          1R014
17910573050                                          00000000001077552.00ADRYAN FRISTIOHADI MSC-A                                              B      0140397    BCA               Kendari           BONUS MEMBER      APRIL 2019                          1R014
18140224457                                          00000000000050872.00AFRIAN NURCAHYO SALEH                                                 B      0140397    BCA               Jayapura          BONUS MEMBER      APRIL 2019                          1R014
12160019363                                          00000000001656723.00AGNES MAGDALENA EFFENDY                                               B      0140397    BCA               Rungkut           BONUS MEMBER      APRIL 2019                          1R014
10222542055                                          00000000000084313.00AGUS KURNIAWAN                                                        B      0140397    BCA               MEDAN             BONUS MEMBER      APRIL 2019                          1R014
17360166532                                          00000000001709405.00AGUS RINI SULISTIOWATY                                                B      0140397    BCA               tajur             BONUS MEMBER      APRIL 2019                          1R014
18195213158                                          00000000000308630.00AGUS WONGSO                                                           B      0140397    BCA               KAWASAN INDUSTRI MBONUS MEMBER      APRIL 2019                          1R014
14361532885                                          00000000000107198.00AJI KRESNO                                                            B      0140397    BCA               Tebet Barat       BONUS MEMBER      APRIL 2019                          1R014
10540962600                                          00000000000231034.00ALAN DWILANGGA                                                        B      0140397    BCA               Tasikmalaya       BONUS MEMBER      APRIL 2019                          1R014
14582204377                                          00000000000559800.00ALDO LAMMY                                                            B      0140397    BCA               Jakarta           BONUS MEMBER      APRIL 2019                          1R014
12581605007                                          00000000000384212.00ALFRYATI VENTHY SANDA SAU TAN                                         B      0140397    BCA               Surabaya          BONUS MEMBER      APRIL 2019                          1R014
12200053624                                          00000000000053200.00AMAN YULIUS                                                           B      0140397    BCA               Pekanbaru         BONUS MEMBER      APRIL 2019                          1R014
14130329727                                          00000000000191491.00AMELIA TEDDY                                                          B      0140397    BCA               Kelapa Gading VillBONUS MEMBER      APRIL 2019                          1R014
12851104242                                          00000000000300550.00AMIN SUMA                                                             B      0140397    BCA               285               BONUS MEMBER      APRIL 2019                          1R014
16470402626                                          00000000000053200.00ANDI TIRTA WIJAYA                                                     B      0140397    BCA               JAKARTA BARAT     BONUS MEMBER      APRIL 2019                          1R014
11450036460                                          00000000000105580.00ANDREAS ARTHASASTA TAROREH                                            B      0140397    BCA               Luwuk             BONUS MEMBER      APRIL 2019                          1R014
16120114211                                          00000000000106550.00ANDREAS NATA SUPU                                                     B      0140397    BCA               Kupang jaya surabaBONUS MEMBER      APRIL 2019                          1R014
11821922238                                          00000000000109702.00ANG MARINA ARYATI S                                                   B      0140397    BCA               Semarang          BONUS MEMBER      APRIL 2019                          1R014
18170610360                                          00000000000052230.00ANISA AMARANI A MD KEP                                                B      0140397    BCA               SINGKAWANG        BONUS MEMBER      APRIL 2019                          1R014
10952399274                                          00000000000053200.00ANTONIUS                                                              B      0140397    BCA               BANJAR            BONUS MEMBER      APRIL 2019                          1R014
13850309778                                          00000000000053200.00ARDIJONO TEDJO                                                        B      0140397    BCA               Malang            BONUS MEMBER      APRIL 2019                          1R014
11970182825                                          00000000000053200.00ARIANNY BUDIMAN SH                                                    B      0140397    BCA               Cipanas           BONUS MEMBER      APRIL 2019                          1R014
14050227427                                          00000000001093817.00ARIS YULIANTO                                                         B      0140397    BCA               Makassar          BONUS MEMBER      APRIL 2019                          1R014
12903009322                                          00000000000053200.00ASTRI MARIA YAGIANTO                                                  B      0140397    BCA               somba opu         BONUS MEMBER      APRIL 2019                          1R014
10921366671                                          00000000000124980.00AZHAR TATY KARIM                                                      B      0140397    BCA               Saharjo           BONUS MEMBER      APRIL 2019                          1R014
16730262564                                          00000000000053200.00BASUKI SISWANTA                                                       B      0140397    BCA               Rungkut           BONUS MEMBER      APRIL 2019                          1R014
15660270860                                          00000000000050290.00BERNADETHA MARIES PRANAN                                              B      0140397    BCA               KCP PANGLIMA POLIMBONUS MEMBER      APRIL 2019                          1R014
14641121589                                          00000000000161840.00BUDI HARTONO                                                          B      0140397    BCA               Surabaya          BONUS MEMBER      APRIL 2019                          1R014
14212295292                                          00000000000169414.00BUDI RAHARDJO                                                         B      0140397    BCA               Margonda Depok    BONUS MEMBER      APRIL 2019                          1R014
10182608325                                          00000000000377665.00BUDI SANTOSO GUNAWAN                                                  B      0140397    BCA               Sidoarjo          BONUS MEMBER      APRIL 2019                          1R014
10103448899                                          00000000000235754.00CALVIN ALEXANDER EFANS J                                              B      0140397    BCA               Veteran           BONUS MEMBER      APRIL 2019                          1R014
10931230921                                          00000000000344200.00CANDRA WIJAYA                                                         B      0140397    BCA               sunter            BONUS MEMBER      APRIL 2019                          1R014
10831225253                                          00000000000053200.00CHAERUL UMAM                                                          B      0140397    BCA               P. Jayakarta      BONUS MEMBER      APRIL 2019                          1R014
13691033021                                          00000000002506259.00CHARLIE BUDIMAN SH                                                    B      0140397    BCA               Tanah Abang       BONUS MEMBER      APRIL 2019                          1R014
14710032497                                          00000000002568037.00CHARLOTHA PUTRI SHARON                                                B      0140397    BCA               Surabaya          BONUS MEMBER      APRIL 2019                          1R014
10262469075                                          00000000000227800.00CHINTYA SALU                                                          B      0140397    BCA               Manado            BONUS MEMBER      APRIL 2019                          1R014
10690308983                                          00000000000050484.00CHRISELDA TANTRA                                                      B      0140397    BCA               bukittinggi       BONUS MEMBER      APRIL 2019                          1R014
12540401601                                          00000000001374595.00CHRISTIANUS A DWIDO                                                   B      0140397    BCA               SAMARINDA         BONUS MEMBER      APRIL 2019                          1R014
17920438878                                          00000000000184392.00CHRISTINE                                                             B      0140397    BCA               Palu              BONUS MEMBER      APRIL 2019                          1R014
12211205123                                          00000000000072600.00CITRA HALIM                                                           B      0140397    BCA               Menara Imperium   BONUS MEMBER      APRIL 2019                          1R014
10272173000                                          00000000000101717.00COHAN LUCHAS                                                          B      0140397    BCA               SAMARINDA         BONUS MEMBER      APRIL 2019                          1R014
16800040017                                          00000000000053200.00CONNY R TOMBOKAN                                                      B      0140397    BCA               Kelapa Gading     BONUS MEMBER      APRIL 2019                          1R014
12540095739                                          00000000000161013.00CORINA LUCHAS                                                         B      0140397    BCA               samarinda         BONUS MEMBER      APRIL 2019                          1R014
18050030734                                          00000000000161064.00CORNELIA CHANDRA BSC                                                  B      0140397    BCA               bukittinggi       BONUS MEMBER      APRIL 2019                          1R014
11710941510                                          00000000000516036.00CORNELLYA KANDARY                                                     B      0140397    BCA               RAMADI USMAN      BONUS MEMBER      APRIL 2019                          1R014
10430970968                                          00000000001644668.00CUT ZAKIA PUTRI FANDANI                                               B      0140397    BCA               BANDA ACEH        BONUS MEMBER      APRIL 2019                          1R014
17895400173                                          00000000001480616.00CYINTIA DEVI ARINDA PUTRI                                             B      0140397    BCA               BANJARBARU        BONUS MEMBER      APRIL 2019                          1R014
11710422172                                          00000000000069205.00CYNTHIA GRESTANTICA                                                   B      0140397    BCA               Pontianak         BONUS MEMBER      APRIL 2019                          1R014
18585131683                                          00000000000954985.00DAMARIS TIKU                                                          B      0140397    BCA               PANGKALAN BUN     BONUS MEMBER      APRIL 2019                          1R014
13451721435                                          00000000000072600.00DAMAYANTI                                                             B      0140397    BCA               Pondok lestari    BONUS MEMBER      APRIL 2019                          1R014
11630357205                                          00000000000180108.00DARMAWAN TEDJA                                                        B      0140397    BCA               Padang            BONUS MEMBER      APRIL 2019                          1R014
17920315482                                          00000000000822945.00DARUSMAN M LAMANGKAU SE                                               B      0140397    BCA               Palu              BONUS MEMBER      APRIL 2019                          1R014
11191847658                                          00000000000052717.00DARYANTI                                                              B      0140397    BCA               kcu jambi         BONUS MEMBER      APRIL 2019                          1R014
18620033481                                          00000000000050290.00DAVID ERNEST RUKIS                                                    B      0140397    BCA               Wiyung - Surabaya BONUS MEMBER      APRIL 2019                          1R014
17025018966                                          00000000000053200.00DELLY MULIARIADI                                                      B      0140397    BCA               000000000         BONUS MEMBER      APRIL 2019                          1R014
11192097287                                          00000000003614389.00DELVIRA                                                               B      0140397    BCA               Jambi             BONUS MEMBER      APRIL 2019                          1R014
17975224015                                          00000000000050872.00DENNY RUSLIN MUSTAPA                                                  B      0140397    BCA               KCP GORONTALO     BONUS MEMBER      APRIL 2019                          1R014
18205033315                                          00000000006536003.00DERMAWATI TURNIP                                                      B      0140397    BCA               SETIA BUDI        BONUS MEMBER      APRIL 2019                          1R014
15280198139                                          00000000000227800.00DESRIYANNI SUMARDI OR LI                                              B      0140397    BCA               Jelambar baru rayaBONUS MEMBER      APRIL 2019                          1R014
16460000791                                          00000000000072600.00DEVI MARIASWATY                                                       B      0140397    BCA               SUNTER MALL       BONUS MEMBER      APRIL 2019                          1R014
11285783614                                          00000000000148505.00DHARMA SALIM                                                          B      0140397    BCA               Jakarta barat     BONUS MEMBER      APRIL 2019                          1R014
11302095897                                          00000000000167749.00DIAN TJAHYARINA                                                       B      0140397    BCA               Manyar surabaya   BONUS MEMBER      APRIL 2019                          1R014
17920178531                                          00000000000431311.00DIONISIUS RORI PARENGKUA                                              B      0140397    BCA               palu              BONUS MEMBER      APRIL 2019                          1R014
10102196773                                          00000000000172576.00DR ESTHER MAGDALENA RUMONDOR                                          B      0140397    BCA               KREMBANGAN        BONUS MEMBER      APRIL 2019                          1R014
17955045882                                          00000000000276804.00DR. INEKE V. SUMOLANG.SP.KK                                           B      0140397    BCA               kcp abepura       BONUS MEMBER      APRIL 2019                          1R014
10241104175                                          00000000000147974.00EDELTRUDIS RAHAYU WAHYU                                               B      0140397    BCA               Jember            BONUS MEMBER      APRIL 2019                          1R014
10292110772                                          00000000000111400.00EDISON P SARAGIH SP                                                   B      0140397    BCA               PONTIANAK         BONUS MEMBER      APRIL 2019                          1R014
10110566182                                          00000000000071388.00EDISON PINONDANG NAULI TOBING                                         B      0140397    BCA               Kota Malang       BONUS MEMBER      APRIL 2019                          1R014
18535226802                                          00000000000281688.00EFRIDA YULITA MEO SR CLA                                              B      0140397    BCA               kcp masjid jamik  BONUS MEMBER      APRIL 2019                          1R014
11191809942                                          00000000000099015.00EKA YULI ASTUTI                                                       B      0140397    BCA               JAMBI             BONUS MEMBER      APRIL 2019                          1R014
10291031624                                          00000000000072600.00EKAYONO SUWITO SE                                                     B      0140397    BCA               KCU PONTIANAK     BONUS MEMBER      APRIL 2019                          1R014
10312198787                                          00000000000058874.00ELIA ELVI                                                             B      0140397    BCA               Kudus             BONUS MEMBER      APRIL 2019                          1R014
18140022188                                          00000000000111400.00ELISA ARYANTI                                                         B      0140397    BCA               Jakarta           BONUS MEMBER      APRIL 2019                          1R014
18430330561                                          00000000000106550.00ELIZA WAHYUNINGSIH                                                    B      0140397    BCA               MEDAN             BONUS MEMBER      APRIL 2019                          1R014
10021223785                                          00000000000434701.00ELLYJATY SALIM                                                        B      0140397    BCA               00000000000000000 BONUS MEMBER      APRIL 2019                          1R014
11199009948                                          00000000000263218.00ELVY SUHARTI MAHYUDIN                                                 B      0140397    BCA               Jambi             BONUS MEMBER      APRIL 2019                          1R014
18140021777                                          00000000000053491.00EMILIA ARYANTI                                                        B      0140397    BCA               Jakarta Barat     BONUS MEMBER      APRIL 2019                          1R014
12581563851                                          00000000016909718.00EMMY INDRIATY                                                         B      0140397    BCA               Diponegoro        BONUS MEMBER      APRIL 2019                          1R014
17830196981                                          00000000000052634.00EMMYLIA SUTEDJA                                                       B      0140397    BCA               semarang          BONUS MEMBER      APRIL 2019                          1R014
16720504306                                          00000000000053200.00ENDANG ERNIATI                                                        B      0140397    BCA               Surabaya          BONUS MEMBER      APRIL 2019                          1R014
10182961688                                          00000000000051381.00ENDANG SRI MURWATI                                                    B      0140397    BCA               KCU Sidoarjo      BONUS MEMBER      APRIL 2019                          1R014
15415035435                                          00000000001520131.00ENDY MUHARDIN MOEGNI DR                                               B      0140397    BCA               KCP MALL GRAND INDBONUS MEMBER      APRIL 2019                          1R014
15065069935                                          00000000002814671.00ENI SUHARTATIK                                                        B      0140397    BCA               tropodo           BONUS MEMBER      APRIL 2019                          1R014
16130003135                                          00000000000126386.00EPLIN MANGEMBULUDE                                                    B      0140397    BCA               847484            BONUS MEMBER      APRIL 2019                          1R014
18205012345                                          00000000000053200.00ERINA NAINGGOLAN                                                      B      0140397    BCA               MEDAN             BONUS MEMBER      APRIL 2019                          1R014
10270316000                                          00000000000079260.00ERNA JULIANA                                                          B      0140397    BCA               Samarinda         BONUS MEMBER      APRIL 2019                          1R014
12910256958                                          00000000000072600.00ERNI YUDIAWATY                                                        B      0140397    BCA               Pondok indah      BONUS MEMBER      APRIL 2019                          1R014
18600271122                                          00000000000158809.00ESLYN R. JABAR                                                        B      0140397    BCA               Palangkaraya      BONUS MEMBER      APRIL 2019                          1R014
10281796967                                          00000000000189000.00ESTER JULIATI SUSANTO                                                 B      0140397    BCA               Jakarta           BONUS MEMBER      APRIL 2019                          1R014
12881053146                                          00000000000053200.00ESTER JUNINGSIH SUDIONO                                               B      0140397    BCA               Jakarta           BONUS MEMBER      APRIL 2019                          1R014
14650374903                                          00000000000052642.00ESTER PAULINA KUSLOSARIR                                              B      0140397    BCA               PERAK             BONUS MEMBER      APRIL 2019                          1R014
16155020567                                          00000000000334742.00ESTER TJENDRAWATI                                                     B      0140397    BCA               Sidoarjo          BONUS MEMBER      APRIL 2019                          1R014
14940019112                                          00000000000053564.00FATINI KUSNO                                                          B      0140397    BCA               KCP ALAYDRUS      BONUS MEMBER      APRIL 2019                          1R014
11010841743                                          00000000000050290.00FEMMY ANTE                                                            B      0140397    BCA               Kapas Krampung    BONUS MEMBER      APRIL 2019                          1R014
18710157988                                          00000000000072600.00FIONA ANDLIANA                                                        B      0140397    BCA               Kelapa Gading     BONUS MEMBER      APRIL 2019                          1R014
17970003651                                          00000000005437249.00FITRIYANTI RASYID                                                     B      0140397    BCA               Makassar          BONUS MEMBER      APRIL 2019                          1R014
10491569688                                          00000000006860551.00FRANSISKUS YANNO SOERATMAN                                            B      0140397    BCA               maluku            BONUS MEMBER      APRIL 2019                          1R014
16690092539                                          00000000000050484.00FRIDA ANGGRAENI                                                       B      0140397    BCA               Denpasar          BONUS MEMBER      APRIL 2019                          1R014
10331665532                                          00000000000050290.00GIMBARANIS                                                            B      0140397    BCA               Kediri            BONUS MEMBER      APRIL 2019                          1R014
10870065515                                          00000000000053200.00GO MEYER GAUTAMA                                                      B      0140397    BCA               Surabaya          BONUS MEMBER      APRIL 2019                          1R014
11710933029                                          00000000000383000.00GOLDINA PRITI PINTARTI C                                              B      0140397    BCA               KCP RAHADI USMAN  BONUS MEMBER      APRIL 2019                          1R014
17245011369                                          00000000000161112.00GUSTI SETIAWAN HAFID                                                  B      0140397    BCA               KCP MANDONGA      BONUS MEMBER      APRIL 2019                          1R014
10651929724                                          00000000000130800.00H JURMANSYAH KAOEM                                                    B      0140397    BCA               KCP Pemuda        BONUS MEMBER      APRIL 2019                          1R014
15610136615                                          00000000000147290.00H SUBKHAN DRS                                                         B      0140397    BCA               kcu gresik        BONUS MEMBER      APRIL 2019                          1R014
17260909546                                          00000000001466504.00HADI SOEDJAJA PRAMONO                                                 B      0140397    BCA               DPS Surabaya      BONUS MEMBER      APRIL 2019                          1R014
17670410468                                          00000000000130600.00HALARI INSAN IHSANI                                                   B      0140397    BCA               Sesetan           BONUS MEMBER      APRIL 2019                          1R014
13900389212                                          00000000000789265.00HAMSIAH SANGKALA                                                      B      0140397    BCA               Makassar          BONUS MEMBER      APRIL 2019                          1R014
17920451742                                          00000000000291683.00HANIFA                                                                B      0140397    BCA               PALU              BONUS MEMBER      APRIL 2019                          1R014
17570037697                                          00000000000415980.00HANNA KUSNADI                                                         B      0140397    BCA               757               BONUS MEMBER      APRIL 2019                          1R014
10262244251                                          00000000000629688.00HANNA SILVANNA MANONGKO                                               B      0140397    BCA               manado            BONUS MEMBER      APRIL 2019                          1R014
10312348720                                          00000000000075107.00HANS HANANTO ANDREAS                                                  B      0140397    BCA               Kudus             BONUS MEMBER      APRIL 2019                          1R014
11451329036                                          00000000000145496.00HAPPY SIRINGORINGO                                                    B      0140397    BCA               GATOT SUBROTO     BONUS MEMBER      APRIL 2019                          1R014
17955187806                                          00000000000612162.00HARDIANTI MANOPPO                                                     B      0140397    BCA               Abepura           BONUS MEMBER      APRIL 2019                          1R014
10291799719                                          00000000000130800.00HARI LIEWARNATA IR MM                                                 B      0140397    BCA               Pontianak         BONUS MEMBER      APRIL 2019                          1R014
12460388999                                          00000000000053200.00HARIMAN LOEWARSO                                                      B      0140397    BCA               Semarang          BONUS MEMBER      APRIL 2019                          1R014
17795019669                                          00000000003406019.00HARUN D. TUMBUAN                                                      B      0140397    BCA               Palu              BONUS MEMBER      APRIL 2019                          1R014
10221692241                                          00000000000053200.00HASAN                                                                 B      0140397    BCA               Cabang Diponegoro BONUS MEMBER      APRIL 2019                          1R014
17685089955                                          00000000000842233.00HASNIH S                                                              B      0140397    BCA               sungguminasa      BONUS MEMBER      APRIL 2019                          1R014
18320091552                                          00000000000053200.00HELEN ALPRIDA LIMBONG                                                 B      0140397    BCA               Bandung           BONUS MEMBER      APRIL 2019                          1R014
10281733167                                          00000000000072600.00HELENA WIDJAJA                                                        B      0140397    BCA               Jakarta           BONUS MEMBER      APRIL 2019                          1R014
10210293884                                          00000000000119039.00HENDARTO SANTOSO                                                      B      0140397    BCA               Palembang         BONUS MEMBER      APRIL 2019                          1R014
11271073378                                          00000000000050290.00HENNY ISKANDAR                                                        B      0140397    BCA               127               BONUS MEMBER      APRIL 2019                          1R014
15110144468                                          00000000000871067.00HENNY JUARIA                                                          B      0140397    BCA               Surabaya          BONUS MEMBER      APRIL 2019                          1R014
14720195645                                          00000000000107843.00HENY IRAWATI                                                          B      0140397    BCA               Surabaya          BONUS MEMBER      APRIL 2019                          1R014
18585064722                                          00000000000114795.00HERIYANE YANCAR ARUS                                                  B      0140397    BCA               KCP Pangkalan Bun BONUS MEMBER      APRIL 2019                          1R014
10880652192                                          00000000001173584.00HERLIN YUNARA                                                         B      0140397    BCA               Sby Darmo Raya    BONUS MEMBER      APRIL 2019                          1R014
13650261258                                          00000000000218869.00HERLINA H.                                                            B      0140397    BCA               RSAJ Akademis     BONUS MEMBER      APRIL 2019                          1R014
12731206963                                          00000000000101245.00HERMALINDA R PANJAITAN A                                              B      0140397    BCA               DEWI SARTIKA      BONUS MEMBER      APRIL 2019                          1R014
10650239687                                          00000000000053200.00HERU SARWONO                                                          B      0140397    BCA               Jakarta           BONUS MEMBER      APRIL 2019                          1R014
17160038327                                          00000000003233985.00HJ. NETTY NASIR                                                       B      0140397    BCA               MT Haryono        BONUS MEMBER      APRIL 2019                          1R014
14820187488                                          00000000000221980.00IKE DIANITA                                                           B      0140397    BCA               WISMA SLIPI       BONUS MEMBER      APRIL 2019                          1R014
10291362418                                          00000000011520086.00IMACULATA KORNIA                                                      B      0140397    BCA               BCA RAHADI USMAN  BONUS MEMBER      APRIL 2019                          1R014
11981615498                                          00000000000470009.00IMANUEL ADAM                                                          B      0140397    BCA               Taman Ratu        BONUS MEMBER      APRIL 2019                          1R014
11440327261                                          00000000000103859.00IMELDA ESTER MARLINDA S                                               B      0140397    BCA               KCP JUANDA        BONUS MEMBER      APRIL 2019                          1R014
12460330001                                          00000000001413069.00INAVIANTI WINARTO                                                     B      0140397    BCA               Semarang          BONUS MEMBER      APRIL 2019                          1R014
12560098696                                          00000000000389224.00INDAH CITRA DEWI SUCITRO                                              B      0140397    BCA               Surabaya          BONUS MEMBER      APRIL 2019                          1R014
14540284551                                          00000000000204792.00INDANIARTI RAMBU                                                      B      0140397    BCA               cabang surabaya   BONUS MEMBER      APRIL 2019                          1R014
12151750500                                          00000000000650478.00INDRAJATI SRIRAHAJU                                                   B      0140397    BCA               Surabaya jl. UndaaBONUS MEMBER      APRIL 2019                          1R014
10272112299                                          00000000000155535.00INDRAWATY JUNITA H.                                                   B      0140397    BCA               Samarinda         BONUS MEMBER      APRIL 2019                          1R014
15880209959                                          00000000015444209.00INDRIYATI SALIM                                                       B      0140397    BCA               Jakarta           BONUS MEMBER      APRIL 2019                          1R014
14260366811                                          00000000000452398.00INGE H S / THEO A D                                                   B      0140397    BCA               kcp tolegerejo    BONUS MEMBER      APRIL 2019                          1R014
18035179999                                          00000000000053200.00INGGRIANI WINARTO                                                     B      0140397    BCA               Semarang          BONUS MEMBER      APRIL 2019                          1R014
10884771397                                          00000000000052424.00INGGRIATI DJOJOSEPUTRO D                                              B      0140397    BCA               KCU DARMO         BONUS MEMBER      APRIL 2019                          1R014
16380003447                                          00000000000053200.00IR. SOEBIJANTO TRIWIBOWO                                              B      0140397    BCA               Jakarta           BONUS MEMBER      APRIL 2019                          1R014
11071083387                                          00000000000072600.00IRA IDAWATI                                                           B      0140397    BCA               Surabaya          BONUS MEMBER      APRIL 2019                          1R014
10222086661                                          00000000000106227.00IRAWATI NASUTION                                                      B      0140397    BCA               Iskandar muda     BONUS MEMBER      APRIL 2019                          1R014
15270747762                                          00000000000053485.00IRENE KARYADI                                                         B      0140397    BCA               000000000         BONUS MEMBER      APRIL 2019                          1R014
17925038300                                          00000000000072600.00IVINA                                                                 B      0140397    BCA               Pontianak         BONUS MEMBER      APRIL 2019                          1R014
10030200101                                          00000000000380478.00JANTI W                                                               B      0140397    BCA               Gunsa 45          BONUS MEMBER      APRIL 2019                          1R014
12420942217                                          00000000000056430.00JANWARTI                                                              B      0140397    BCA               Medan             BONUS MEMBER      APRIL 2019                          1R014
12060071317                                          00000000000053200.00JESSLYN ARIESTA JOHAN                                                 B      0140397    BCA               KCU Thamrin       BONUS MEMBER      APRIL 2019                          1R014
13570208569                                          00000000000050290.00JOENG CHINTYA DEWI                                                    B      0140397    BCA               BANJARNEGARA      BONUS MEMBER      APRIL 2019                          1R014
10181090234                                          00000000001599005.00JOHANES PUTRA MAYNINEDO                                               B      0140397    BCA               Sidoarjo          BONUS MEMBER      APRIL 2019                          1R014
18870216450                                          00000000000053879.00JOHNNY LUKAS                                                          B      0140397    BCA               KCP PURI BOTANICALBONUS MEMBER      APRIL 2019                          1R014
10871902975                                          00000000000057468.00JOHNNY WONGSONEGORO                                                   B      0140397    BCA               Surabaya          BONUS MEMBER      APRIL 2019                          1R014
11681694248                                          00000000000581488.00JUANITA ICHSANI                                                       B      0140397    BCA               Pluit             BONUS MEMBER      APRIL 2019                          1R014
12411120211                                          00000000000050993.00JULIANA                                                               B      0140397    BCA               jembatan merah    BONUS MEMBER      APRIL 2019                          1R014
10870842562                                          00000000000055043.00JUNI PANTJAWATI SUTANTO                                               B      0140397    BCA               kcp sundokono     BONUS MEMBER      APRIL 2019                          1R014
10885727030                                          00000000000051260.00KALEB YEREMIA YUNIOR KOR                                              B      0140397    BCA               Surabaya          BONUS MEMBER      APRIL 2019                          1R014
10051024086                                          00000000000102439.00KARWITA NURLAELASARI                                                  B      0140397    BCA               WISMA MILENIA     BONUS MEMBER      APRIL 2019                          1R014
14970573513                                          00000000000101409.00KIEMI MANALU                                                          B      0140397    BCA               SERPONG           BONUS MEMBER      APRIL 2019                          1R014
12620007202                                          00000000000286000.00KIKIE HARDI                                                           B      0140397    BCA               HASYIM ASHARI     BONUS MEMBER      APRIL 2019                          1R014
12211227763                                          00000000000236918.00KONNI M TAMBUNAN                                                      B      0140397    BCA               MENARA IMPERIUM   BONUS MEMBER      APRIL 2019                          1R014
17880132037                                          00000000000077450.00LANY MANDANG                                                          B      0140397    BCA               KCU Galaxi        BONUS MEMBER      APRIL 2019                          1R014
10410949768                                          00000000000493391.00LELI MARULISARI                                                       B      0140397    BCA               PANGKAL PINANG    BONUS MEMBER      APRIL 2019                          1R014
18140000168                                          00000000000286291.00LENNY SETYAWATI LIEM                                                  B      0140397    BCA               Jayapura          BONUS MEMBER      APRIL 2019                          1R014
18803839233                                          00000000000072600.00LIANITA TANUWIJAYA                                                    B      0140397    BCA               Kcu gading serpongBONUS MEMBER      APRIL 2019                          1R014
15060026981                                          00000000000335874.00LIE AY HWA                                                            B      0140397    BCA               Surabaya          BONUS MEMBER      APRIL 2019                          1R014
13500307811                                          00000000000103640.00LIE HENNY                                                             B      0140397    BCA               Hayam Wuruk       BONUS MEMBER      APRIL 2019                          1R014
10090888919                                          00000000000053200.00LIEM ENG MEI                                                          B      0140397    BCA               Semarang          BONUS MEMBER      APRIL 2019                          1R014
10880370006                                          00000000000127070.00LIEM LINDAWATI MASAJU                                                 B      0140397    BCA               Surabaya          BONUS MEMBER      APRIL 2019                          1R014
15200070064                                          00000000000051999.00LILI MULJANI, SE                                                      B      0140397    BCA               Surabaya          BONUS MEMBER      APRIL 2019                          1R014
16665150929                                          00000000000106938.00LILIA ANA                                                             B      0140397    BCA               PEMANGKAT         BONUS MEMBER      APRIL 2019                          1R014
17540460269                                          00000000000383000.00LILIANY WIJAYA                                                        B      0140397    BCA               Jakarta Barat     BONUS MEMBER      APRIL 2019                          1R014
11710479824                                          00000000000157033.00LILIK YUNIATI                                                         B      0140397    BCA               PONTIANAK         BONUS MEMBER      APRIL 2019                          1R014
12762222222                                          00000000010497440.00LILY NGADIMAN                                                         B      0140397    BCA               sunter            BONUS MEMBER      APRIL 2019                          1R014
10010306388                                          00000000000053200.00LIM SIOE LING                                                         B      0140397    BCA               Asemka            BONUS MEMBER      APRIL 2019                          1R014
17795143955                                          00000000000753896.00LINDA                                                                 B      0140397    BCA               Cabang Palu       BONUS MEMBER      APRIL 2019                          1R014
10490010009                                          00000000000072600.00LINDA PUSPA DEWI                                                      B      0140397    BCA               maluku            BONUS MEMBER      APRIL 2019                          1R014
17830557878                                          00000000000053200.00LIONG SIOE GIE                                                        B      0140397    BCA               Semarang          BONUS MEMBER      APRIL 2019                          1R014
10153304324                                          00000000000072600.00LISA OLIVIA YOSEPHINE                                                 B      0140397    BCA               Jakarta Barat     BONUS MEMBER      APRIL 2019                          1R014
10182621542                                          00000000000106550.00LISTIA INDAHWATI DR.                                                  B      0140397    BCA               SIDOARJO          BONUS MEMBER      APRIL 2019                          1R014
10281828478                                          00000000000061612.00LOLITA PATRICIA CHANDRA                                               B      0140397    BCA               Wahid Hasyim      BONUS MEMBER      APRIL 2019                          1R014
10651516659                                          00000000000053200.00LUCIA MARTINA A                                                       B      0140397    BCA               JAKARTA           BONUS MEMBER      APRIL 2019                          1R014
17975271188                                          00000000000146753.00LUTFIA Y. K. NASIB ALAMR                                              B      0140397    BCA               Gorontalo         BONUS MEMBER      APRIL 2019                          1R014
18620235661                                          00000000001675522.00LYDIANA DEWI EFFENDY                                                  B      0140397    BCA               Citraland         BONUS MEMBER      APRIL 2019                          1R014
16252763836                                          00000000000206936.00M JABIDI YUSUF                                                        B      0140397    BCA               palembang         BONUS MEMBER      APRIL 2019                          1R014
18160408007                                          00000000000398284.00MAGDALANI SANTOSO                                                     B      0140397    BCA               KCU BOROBUDUR MALABONUS MEMBER      APRIL 2019                          1R014
14281621569                                          00000000000678802.00MAGDALENA KUSNADI                                                     B      0140397    BCA               428               BONUS MEMBER      APRIL 2019                          1R014
18190339344                                          00000000000904096.00MANUELLA ARTAWATY PURBA                                               B      0140397    BCA               KCP JELUTUNG      BONUS MEMBER      APRIL 2019                          1R014
10260829971                                          00000000003912109.00MARIA BEATRIX LUNTUNGAN                                               B      0140397    BCA               Manado            BONUS MEMBER      APRIL 2019                          1R014
11710419074                                          00000000000105580.00MARIA OKTAVIA                                                         B      0140397    BCA               RAHAQI USMAN PONTIBONUS MEMBER      APRIL 2019                          1R014
10292155075                                          00000000000377520.00MARISA CAROLINA TEDJA                                                 B      0140397    BCA               Pontianak         BONUS MEMBER      APRIL 2019                          1R014
14650268356                                          00000000019301078.00MARSUDI                                                               B      0140397    BCA               Makro Pepelegi SidBONUS MEMBER      APRIL 2019                          1R014
11520325049                                          00000000000898977.00MARTHEN CAREL KORWA                                                   B      0140397    BCA               Kertajaya         BONUS MEMBER      APRIL 2019                          1R014
16705015990                                          00000000000255202.00MARTINA TJITRADY                                                      B      0140397    BCA               Bontang           BONUS MEMBER      APRIL 2019                          1R014
17910353122                                          00000000000052230.00MARWAN                                                                B      0140397    BCA               KCU KENDARI       BONUS MEMBER      APRIL 2019                          1R014
17795044337                                          00000000000237104.00MARWAN AMIR                                                           B      0140397    BCA               Palu Barat        BONUS MEMBER      APRIL 2019                          1R014
12469091818                                          00000000000053200.00MASHURI                                                               B      0140397    BCA               Semarang          BONUS MEMBER      APRIL 2019                          1R014
11910801674                                          00000000000072600.00MAX LEVI BOHAM                                                        B      0140397    BCA               balikpapan        BONUS MEMBER      APRIL 2019                          1R014
10640167297                                          00000000001407678.00MEDYAWATI LIMANTARA DRG                                               B      0140397    BCA               Pucang Anom SurabaBONUS MEMBER      APRIL 2019                          1R014
17019193739                                          00000000000296270.00MEGAWATY KAMIR SE                                                     B      0140397    BCA               KCP AHMAD YANI MKSBONUS MEMBER      APRIL 2019                          1R014
12541020103                                          00000000000072600.00MEILIANTI LAWINATA LAUW                                               B      0140397    BCA               Samarinda         BONUS MEMBER      APRIL 2019                          1R014
17160069281                                          00000000008977796.00MELAWATY ABYANI                                                       B      0140397    BCA               MT Haryono JakartaBONUS MEMBER      APRIL 2019                          1R014
17830404788                                          00000000000053200.00MELIA FRIDA SANTOSO                                                   B      0140397    BCA               Kcp Grajen        BONUS MEMBER      APRIL 2019                          1R014
17155077034                                          00000000000103580.00MELLI RULIANI                                                         B      0140397    BCA               SEI RAYA DALAM    BONUS MEMBER      APRIL 2019                          1R014
16460048361                                          00000000000164350.00MELY TJANDRA                                                          B      0140397    BCA               646               BONUS MEMBER      APRIL 2019                          1R014
10884820207                                          00000000001574782.00MELYSA YULIANA                                                        B      0140397    BCA               Darmo             BONUS MEMBER      APRIL 2019                          1R014
11710716788                                          00000000002854959.00MERVYN                                                                B      0140397    BCA               pontianak         BONUS MEMBER      APRIL 2019                          1R014
10210293175                                          00000000000054388.00METRY WIDJAJA KOHAR                                                   B      0140397    BCA               Utama ARivai      BONUS MEMBER      APRIL 2019                          1R014
13053007500                                          00000000002927600.00MEYLIA                                                                B      0140397    BCA               PS Cikini         BONUS MEMBER      APRIL 2019                          1R014
17260969484                                          00000000000100851.00MIKHAEL BUDI SETIAWAN                                                 B      0140397    BCA               simpang darmo     BONUS MEMBER      APRIL 2019                          1R014
17880158575                                          00000000000102971.00MIMIK DIAH LESTARI                                                    B      0140397    BCA               Galaxy            BONUS MEMBER      APRIL 2019                          1R014
12752058912                                          00000000000168630.00MINARNI KOMALA SARI                                                   B      0140397    BCA               Jakarta           BONUS MEMBER      APRIL 2019                          1R014
12741034559                                          00000000004991134.00MIRA REBEKA SANI                                                      B      0140397    BCA               00000             BONUS MEMBER      APRIL 2019                          1R014
17920345365                                          00000000000077008.00MOH YAKUB KARAENG MATASA                                              B      0140397    BCA               PALU              BONUS MEMBER      APRIL 2019                          1R014
18140254534                                          00000000000053200.00MONNY SABACHTANI MAYOR S                                              B      0140397    BCA               Jayapura          BONUS MEMBER      APRIL 2019                          1R014
17970228947                                          00000000000371749.00MUFTIHATURRAHMAH BURHAMZ                                              B      0140397    BCA               Makassar          BONUS MEMBER      APRIL 2019                          1R014
10255460574                                          00000000000556835.00MUH. KADIR                                                            B      0140397    BCA               Sungguminasa      BONUS MEMBER      APRIL 2019                          1R014
10292386140                                          00000000000053200.00MUHAMMAD YASHFI SETIAWAN                                              B      0140397    BCA               PONTIANAK         BONUS MEMBER      APRIL 2019                          1R014
12940047318                                          00000000000383000.00MUKLAM                                                                B      0140397    BCA               PANGERAN ANTASARI BONUS MEMBER      APRIL 2019                          1R014
13860011858                                          00000000000053485.00MULIANA                                                               B      0140397    BCA               Pluit Utara       BONUS MEMBER      APRIL 2019                          1R014
10250248121                                          00000000000102816.00MULIAWATI MUHIDDIN                                                    B      0140397    BCA               PETTARANI         BONUS MEMBER      APRIL 2019                          1R014
14960003646                                          00000000000107198.00NENSIH BH MOCH. AMSOR                                                 B      0140397    BCA               Tebet Barat       BONUS MEMBER      APRIL 2019                          1R014
18530066534                                          00000000000055382.00NETI ZAHARA                                                           B      0140397    BCA               cab celentang paleBONUS MEMBER      APRIL 2019                          1R014
18290171513                                          00000000002021792.00NINIK ELSAWATIE                                                       B      0140397    BCA               Surabaya          BONUS MEMBER      APRIL 2019                          1R014
14211439151                                          00000000000053200.00NINING KURNIANINGSIH                                                  B      0140397    BCA               KCP Margo City    BONUS MEMBER      APRIL 2019                          1R014
18140091414                                          00000000000216160.00NONTJE CH LUMINGKEWAS                                                 B      0140397    BCA               Jayapura          BONUS MEMBER      APRIL 2019                          1R014
10262097011                                          00000000000338622.00NONTJE TANGAHU                                                        B      0140397    BCA               manado            BONUS MEMBER      APRIL 2019                          1R014
18585146125                                          00000000000052472.00NOOR LAILY                                                            B      0140397    BCA               pangkalan bun     BONUS MEMBER      APRIL 2019                          1R014
11500680870                                          00000000000053200.00NOVA SILVAWATI NAPITUPULU                                             B      0140397    BCA               WAHID HASIM       BONUS MEMBER      APRIL 2019                          1R014
10255830223                                          00000000001109073.00NURJAYA SH                                                            B      0140397    BCA               MAKASSAR          BONUS MEMBER      APRIL 2019                          1R014
12850039910                                          00000000000153530.00NURLAELA JUMIATI                                                      B      0140397    BCA               285               BONUS MEMBER      APRIL 2019                          1R014
17640857212                                          00000000004675790.00NURUL AZIZAH                                                          B      0140397    BCA               CITRA RAYA        BONUS MEMBER      APRIL 2019                          1R014
12853001911                                          00000000000072600.00OEI IRENE ANGELINE WIJAY                                              B      0140397    BCA               KCP TAMAN SARI    BONUS MEMBER      APRIL 2019                          1R014
10353041450                                          00000000000072600.00OSBORN BUDIMAN                                                        B      0140397    BCA               KCU Sudirman      BONUS MEMBER      APRIL 2019                          1R014
10320899222                                          00000000000072600.00OTTO BERINA IR                                                        B      0140397    BCA               Sawahan padang    BONUS MEMBER      APRIL 2019                          1R014
17155072989                                          00000000000516053.00PATRISIA SUPARTINA                                                    B      0140397    BCA               PONTIANAK         BONUS MEMBER      APRIL 2019                          1R014
14580236842                                          00000000000218100.00PAULINA                                                               B      0140397    BCA               BEI               BONUS MEMBER      APRIL 2019                          1R014
13491397924                                          00000000000050290.00PERAWATI BR BARUS                                                     B      0140397    BCA               ISKANDAR MUDA MEDABONUS MEMBER      APRIL 2019                          1R014
10420449763                                          00000000000104983.00PINDAYATI                                                             B      0140397    BCA               TEBING TINGGI     BONUS MEMBER      APRIL 2019                          1R014
14681270978                                          00000000000106150.00PRASTI ADHI DHARMASANTI DR                                            B      0140397    BCA               Indrapura SurabayaBONUS MEMBER      APRIL 2019                          1R014
10510084501                                          00000000000053200.00PUSPA DJELITA SINDUNATA                                               B      0140397    BCA               banjarmasin       BONUS MEMBER      APRIL 2019                          1R014
11850983417                                          00000000000050290.00RA ENDANG SRI W                                                       B      0140397    BCA               Bangkalan Madura  BONUS MEMBER      APRIL 2019                          1R014
17970160625                                          00000000000823472.00RAHMITA BURHAMZAH                                                     B      0140397    BCA               Maricaya Makassar BONUS MEMBER      APRIL 2019                          1R014
11821231235                                          00000000000111685.00RATNA DEWI                                                            B      0140397    BCA               Semarang          BONUS MEMBER      APRIL 2019                          1R014
12741009970                                          00000000000425552.00RAY LAMMY                                                             B      0140397    BCA               Pondok Bambu      BONUS MEMBER      APRIL 2019                          1R014
18275283882                                          00000000000090410.00RENI JAYANTI ANGGRAINI                                                B      0140397    BCA               KCP A YANI II     BONUS MEMBER      APRIL 2019                          1R014
17910371635                                          00000000000326849.00REZKY ULFA RAHMADANI-R                                                B      0140397    BCA               Kendari           BONUS MEMBER      APRIL 2019                          1R014
14970191921                                          00000000000077450.00RIKA                                                                  B      0140397    BCA               497               BONUS MEMBER      APRIL 2019                          1R014
19710036585                                          00000000000277923.00RINA ARIYANIE TAHIR                                                   B      0140397    BCA               KENDARI           BONUS MEMBER      APRIL 2019                          1R014
17920717351                                          00000000010699719.00RISDIYANTO                                                            B      0140397    BCA               palu              BONUS MEMBER      APRIL 2019                          1R014
10350709339                                          00000000000093455.00ROBERT HARIYADI KUSTEDJO                                              B      0140397    BCA               KCU Sudirman, JakaBONUS MEMBER      APRIL 2019                          1R014
17920441119                                          00000000007150521.00ROBERTH PARENGKUAN                                                    B      0140397    BCA               Palu              BONUS MEMBER      APRIL 2019                          1R014
18000517471                                          00000000000223598.00ROSALINA SIPAYUNG                                                     B      0140397    BCA               KATAMSO MEDAN     BONUS MEMBER      APRIL 2019                          1R014
18705168993                                          00000000000121600.00ROSITA NATADARMA DJAJA                                                B      0140397    BCA               KCP Mal Kelapa GadBONUS MEMBER      APRIL 2019                          1R014
14970287464                                          00000000000072600.00RR WIDIASRI PUJI APHINI                                               B      0140397    BCA               KCU SERPONG       BONUS MEMBER      APRIL 2019                          1R014
11410577344                                          00000000000263416.00RUDI SANTOSO                                                          B      0140397    BCA               sawahan           BONUS MEMBER      APRIL 2019                          1R014
12881095361                                          00000000000106550.00RULLY ARISCHANDRA                                                     B      0140397    BCA               kcu Puri Indah    BONUS MEMBER      APRIL 2019                          1R014
16665050541                                          00000000011908558.00RUSIANI                                                               B      0140397    BCA               Sambas            BONUS MEMBER      APRIL 2019                          1R014
11410324047                                          00000000004697318.00RUTH HANDAYANI DARMAWAN                                               B      0140397    BCA               Nganjuk           BONUS MEMBER      APRIL 2019                          1R014
12581015901                                          00000000007368854.00SALIM                                                                 B      0140397    BCA               Diponogoro        BONUS MEMBER      APRIL 2019                          1R014
16270097543                                          00000000000441533.00SALMA LUBIS                                                           B      0140397    BCA               TEBET BARAT 2     BONUS MEMBER      APRIL 2019                          1R014
17910170583                                          00000000039938280.00SALMIA RODHIYA HUSAINY                                                B      0140397    BCA               Kendari           BONUS MEMBER      APRIL 2019                          1R014
17055001502                                          00000000000050290.00SANTY                                                                 B      0140397    BCA               makassar          BONUS MEMBER      APRIL 2019                          1R014
11950715568                                          00000000000231030.00SANTY                                                                 B      0140397    BCA               Medan             BONUS MEMBER      APRIL 2019                          1R014
10040049177                                          00000000000264442.00SARAH AYUDA                                                           B      0140397    BCA               KCP REG. TANAH ABABONUS MEMBER      APRIL 2019                          1R014
15210855604                                          00000000000053200.00SARIATI SITUMORANG                                                    B      0140397    BCA               BEKASI            BONUS MEMBER      APRIL 2019                          1R014
10613336092                                          00000000000053200.00SATUI                                                                 B      0140397    BCA               Samarinda         BONUS MEMBER      APRIL 2019                          1R014
14700218665                                          00000000000232556.00SESILIA MADE LENY YUNIARTY                                            B      0140397    BCA               WIYUNG            BONUS MEMBER      APRIL 2019                          1R014
18985132778                                          00000000000227800.00SETIYOWATI DARSONO                                                    B      0140397    BCA               cabang Puri AnjasmBONUS MEMBER      APRIL 2019                          1R014
11010200209                                          00000000007254025.00SETYOTUHU TATIK                                                       B      0140397    BCA               KCP Kapas KrampungBONUS MEMBER      APRIL 2019                          1R014
15660023307                                          00000000000168630.00SHELLY                                                                B      0140397    BCA               Panglima polim    BONUS MEMBER      APRIL 2019                          1R014
12290005101                                          00000000000304430.00SHIRLY SANTOSO                                                        B      0140397    BCA               Palmerah          BONUS MEMBER      APRIL 2019                          1R014
14681155656                                          00000000000053200.00SOEWITO ISMAWAN                                                       B      0140397    BCA               kcu indrapura sby BONUS MEMBER      APRIL 2019                          1R014
15600161611                                          00000000000106147.00SRI HARIYANI                                                          B      0140397    BCA               Margorejo         BONUS MEMBER      APRIL 2019                          1R014
13981000623                                          00000000000072600.00SRI SUBEKTI                                                           B      0140397    BCA               Jakarta           BONUS MEMBER      APRIL 2019                          1R014
10510045891                                          00000000000111400.00SRIAJU  FENTY  MARGONO                                                B      0140397    BCA               KCU Banjarmasin   BONUS MEMBER      APRIL 2019                          1R014
14361496102                                          00000000000053200.00SRIANA ANGGREINI                                                      B      0140397    BCA               TEBET BARAT       BONUS MEMBER      APRIL 2019                          1R014
16240695390                                          00000000000124980.00STACIA ANGGAPUTRI                                                     B      0140397    BCA               Permata Ujung MentBONUS MEMBER      APRIL 2019                          1R014
17920883006                                          00000000000664955.00STEFANI BEATRIX                                                       B      0140397    BCA               Palu              BONUS MEMBER      APRIL 2019                          1R014
16155040894                                          00000000000106550.00STEFANUS BUDI SETIAWAN                                                B      0140397    BCA               kcu suncity       BONUS MEMBER      APRIL 2019                          1R014
12581815303                                          00000000000053200.00STELLA MARIA                                                          B      0140397    BCA               Surabaya          BONUS MEMBER      APRIL 2019                          1R014
12533338585                                          00000000009461289.00STEVIE LENGKONG                                                       B      0140397    BCA               Green Garden      BONUS MEMBER      APRIL 2019                          1R014
11520425655                                          00000000000053200.00SUGENG HARIYANTO SE                                                   B      0140397    BCA               Surabaya          BONUS MEMBER      APRIL 2019                          1R014
13051359559                                          00000000000053200.00SUHARYATI SH                                                          B      0140397    BCA               Kcp. Pasar Cikini BONUS MEMBER      APRIL 2019                          1R014
14281731054                                          00000000000282405.00SUHENJANTI SOLAIMAN                                                   B      0140397    BCA               Sunter mall       BONUS MEMBER      APRIL 2019                          1R014
17685098881                                          00000000000476350.00SUKRAWAN                                                              B      0140397    BCA               Sungguminasa      BONUS MEMBER      APRIL 2019                          1R014
17785092066                                          00000000000072600.00SULASMI DR                                                            B      0140397    BCA               BANDA ACEH        BONUS MEMBER      APRIL 2019                          1R014
17910249091                                          00000000009763302.00SULEMAN MILE                                                          B      0140397    BCA               0000000000        BONUS MEMBER      APRIL 2019                          1R014
12861012044                                          00000000002905893.00SULHANA ARMAINI                                                       B      0140397    BCA               KEMANG TEBET      BONUS MEMBER      APRIL 2019                          1R014
10921317271                                          00000000000103277.00SUPRI YANTO                                                           B      0140397    BCA               KCU Tebet         BONUS MEMBER      APRIL 2019                          1R014
14670013958                                          00000000000053200.00SUSAN TARUNA                                                          B      0140397    BCA               Kcp mal taman anggBONUS MEMBER      APRIL 2019                          1R014
12540333371                                          00000000003046012.00SUSANTI OEY                                                           B      0140397    BCA               samarinda         BONUS MEMBER      APRIL 2019                          1R014
10291671861                                          00000000000320678.00SUSANTI SE                                                            B      0140397    BCA               RAHADI USMAN      BONUS MEMBER      APRIL 2019                          1R014
18430128044                                          00000000000111400.00SUSI BASARIA SIHOMBING                                                B      0140397    BCA               MEDAN             BONUS MEMBER      APRIL 2019                          1R014
12171014010                                          00000000000053200.00SUZANNA ARRYANI                                                       B      0140397    BCA               Kuningan          BONUS MEMBER      APRIL 2019                          1R014
11410476271                                          00000000004628183.00SUZANNA ELLY SENTOSA                                                  B      0140397    BCA               nganjuk           BONUS MEMBER      APRIL 2019                          1R014
14361242143                                          00000000000576412.00SYAFRINA                                                              B      0140397    BCA               Tebet Barat       BONUS MEMBER      APRIL 2019                          1R014
16155200786                                          00000000000143264.00SYLVIA CHRISTINA                                                      B      0140397    BCA               Sidoarjo          BONUS MEMBER      APRIL 2019                          1R014
10931330887                                          00000000000119170.00SYLVIA JOHAN                                                          B      0140397    BCA               KCP SUNTER        BONUS MEMBER      APRIL 2019                          1R014
11530064758                                          00000000000053200.00TAMIN KOSASIH                                                         B      0140397    BCA               SOLO              BONUS MEMBER      APRIL 2019                          1R014
13080072162                                          00000000005599349.00TEDDY WIJAYAPUTRA                                                     B      0140397    BCA               Duta Merlin       BONUS MEMBER      APRIL 2019                          1R014
10010455375                                          00000000000111400.00TEGUH RIYADI                                                          B      0140397    BCA               Jakarta           BONUS MEMBER      APRIL 2019                          1R014
12465106911                                          00000000000207512.00THEO ADHITYA DARMAWAN                                                 B      0140397    BCA               kcp Siliwangi     BONUS MEMBER      APRIL 2019                          1R014
12370130909                                          00000000000072600.00THERESIA INDRAWATI                                                    B      0140397    BCA               Pondok Indah      BONUS MEMBER      APRIL 2019                          1R014
10261634499                                          00000000000102428.00THREISYE VONNY SUMUAL                                                 B      0140397    BCA               manado            BONUS MEMBER      APRIL 2019                          1R014
10031705486                                          00000000000072600.00TIO TJEN AI                                                           B      0140397    BCA               Gunung Sahari     BONUS MEMBER      APRIL 2019                          1R014
10270337821                                          00000000000111400.00TJENG GIOK HOA                                                        B      0140397    BCA               SAMARINDA         BONUS MEMBER      APRIL 2019                          1R014
11830804516                                          00000000000053200.00TOMMY                                                                 B      0140397    BCA               KCU Cianjur       BONUS MEMBER      APRIL 2019                          1R014
18000515184                                          00000000006961225.00TONGAM F SILABAN                                                      B      0140397    BCA               Medan             BONUS MEMBER      APRIL 2019                          1R014
11196004352                                          00000000000100187.00TONGON SARIHON SITORUS                                                B      0140397    BCA               SIPIN - JAMBI     BONUS MEMBER      APRIL 2019                          1R014
10140269662                                          00000000000160790.00TRI JAYANI HADIWIDJAJA, SH                                            B      0140397    BCA               TUNJUNGAN         BONUS MEMBER      APRIL 2019                          1R014
11710553897                                          00000000000467136.00TRI PUJI ASTUTI                                                       B      0140397    BCA               PONTIANAK         BONUS MEMBER      APRIL 2019                          1R014
17910677921                                          00000000000053200.00TRIWULANDARI NEHRU PUTRI.SE,M.SM                                      B      0140397    BCA               KENDARI           BONUS MEMBER      APRIL 2019                          1R014
12903024461                                          00000000000099760.00UMMU CALSUM KADIR                                                     B      0140397    BCA               Somba Opu makassarBONUS MEMBER      APRIL 2019                          1R014
17910493684                                          00000000000153542.00USMAN                                                                 B      0140397    BCA               KENDARI           BONUS MEMBER      APRIL 2019                          1R014
12851193156                                          00000000000242350.00VANYA UTAMI SUMA                                                      B      0140397    BCA               285               BONUS MEMBER      APRIL 2019                          1R014
14280024983                                          00000000000072600.00VELDA DWITAMI SUMA                                                    B      0140397    BCA               KCP SUNTER MALL   BONUS MEMBER      APRIL 2019                          1R014
11900165745                                          00000000000053200.00VICKY ARMANDO AMBATE                                                  B      0140397    BCA               KREMBANGAN        BONUS MEMBER      APRIL 2019                          1R014
17835097536                                          00000000000216645.00VICTORIA NURHAYATI                                                    B      0140397    BCA               Rembang           BONUS MEMBER      APRIL 2019                          1R014
18161231835                                          00000000000053200.00VIVI ARYANTI                                                          B      0140397    BCA               Jayapura          BONUS MEMBER      APRIL 2019                          1R014
10255695245                                          00000000000106245.00WAHYU SETIAWAN                                                        B      0140397    BCA               Ahmad Yani        BONUS MEMBER      APRIL 2019                          1R014
16010017074                                          00000000000572719.00WANDA MARIA NADIYENSI                                                 B      0140397    BCA               KCP ARJUNA        BONUS MEMBER      APRIL 2019                          1R014
15085723160                                          00000000000111400.00WARAS                                                                 B      0140397    BCA               Surabaya          BONUS MEMBER      APRIL 2019                          1R014
11410592998                                          00000000000761964.00WELLY DJUNAIDI                                                        B      0140397    BCA               nganjuk           BONUS MEMBER      APRIL 2019                          1R014
12046377777                                          00000000000246230.00WEN GI WIDJAJA                                                        B      0140397    BCA               204               BONUS MEMBER      APRIL 2019                          1R014
12308811871                                          00000000000053200.00WIDA PRIMA MUSTIKA                                                    B      0140397    BCA               BcA Kali  Malang  BONUS MEMBER      APRIL 2019                          1R014
10640288931                                          00000000000050775.00WIDA SUSIANI TJAHJA HADI                                              B      0140397    BCA               Surabaya          BONUS MEMBER      APRIL 2019                          1R014
16750306002                                          00000000000367603.00WOLTER CHRISTIAN JUSHARD                                              B      0140397    BCA               RUNGKUT           BONUS MEMBER      APRIL 2019                          1R014
16240123931                                          00000000000053200.00YATI KUMALA                                                           B      0140397    BCA               permata ujung mentBONUS MEMBER      APRIL 2019                          1R014
11520368066                                          00000000002604917.00YAYUK RIWAYATI                                                        B      0140397    BCA               Kertajaya         BONUS MEMBER      APRIL 2019                          1R014
10510781431                                          00000000000070660.00YOONYS ANDRAY                                                         B      0140397    BCA               BANJARMASIN       BONUS MEMBER      APRIL 2019                          1R014
17925086223                                          00000000001664917.00YOSIANTO                                                              B      0140397    BCA               IMAM BONJOL       BONUS MEMBER      APRIL 2019                          1R014
10261879157                                          00000000000629622.00YUDIN IBRAHIM                                                         B      0140397    BCA               Manado            BONUS MEMBER      APRIL 2019                          1R014
15210665007                                          00000000000124980.00YULI ASTERINA                                                         B      0140397    BCA               KCP BULEVAR HIJAU BONUS MEMBER      APRIL 2019                          1R014
12872372513                                          00000000017367359.00YULIANTI LIAN                                                         B      0140397    BCA               00000             BONUS MEMBER      APRIL 2019                          1R014
10380106582                                          00000000000050023.00YUNIATI                                                               B      0140397    BCA               Sukabumi          BONUS MEMBER      APRIL 2019                          1R014
11890304270                                          00000000000203065.00ZALENA                                                                B      0140397    BCA               curup             BONUS MEMBER      APRIL 2019                          1R014
10280110752                                          00000000000202386.00ZIRA ENDYANA NURSYAHBANI                                              B      0140397    BCA               KCU WAHID HASYIM  BONUS MEMBER      APRIL 2019                          1R014
