RK;NPWP;NAMA;KD_JENIS_TRANSAKSI;FG_PENGGANTI;NOMOR_FAKTUR;TANGGAL_FAKTUR;NO_DOKUMEN_FAKTUR;TANGGAL_RETUR;MASA_PAJAK_RETUR;TAHUN_PAJAK_RETUR;NILAI_RETUR_DPP;NILAI_RETUR_PPN;NILAI_RETUR_PPNBM
RK;000000000000000;"Tutik Rodiah";01;0;0041957571665;24/12/2019;0002/UHNPUSAT/RET/20;04/01/2020;1;2020;8760435;876044;0
RK;000000000000000;"Yulianti Lian";01;0;0041957571630;26/12/2019;0001/UHNPUSAT/RET/20;04/01/2020;1;2020;429091;42909;0
RK;000000000000000;"Zainal Arifin.";01;0;0041957571749;27/12/2019;0003/UHNPUSAT/RET/20;04/01/2020;1;2020;214545;21455;0
RK;000000000000000;Hendri;01;0;0041957571424;18/12/2019;0004/UHNPUSAT/RET/20;22/01/2020;1;2020;214545;21455;0
