FK;KD_JENIS_TRANSAKSI;FG_PENGGANTI;NOMOR_FAKTUR;MASA_PAJAK;TAHUN_PAJAK;TANGGAL_FAKTUR;NPWP;NAMA;ALAMAT_LENGKAP;JUMLAH_DPP;JUMLAH_PPN;JUMLAH_PPNBM;ID_KETERANGAN_TAMBAHAN;FG_UANG_MUKA;UANG_MUKA_DPP;UANG_MUKA_PPN;UANG_MUKA_PPNBM;REFERENSI
LT;NPWP;NAMA;JALAN;BLOK;NOMOR;RT;RW;KECAMATAN;KELURAHAN;KABUPATEN;PROPINSI;KODE POS;NOMOR_TELEPON
OF;KODE_OBJEK;NAMA;HARGA_SATUAN;JUMLAH_BARANG;HARGA_TOTAL;DISKON;DPP;PPN;TARIF_PPNBM;PPNBM
FK;01;0;0001569777640;7;2015;14/07/2015;013032693007000;PT. ETHICA INDUSTRI FARMASI;JL. PULOGADUNG NO.6, KIP, RAWA TERATE, CAKUNG, JAKARTA TIMUR 13920;344767313;34476731;0;0;0;0;0;0;CD-2015001385
LT;013032693007000;PT. ETHICA INDUSTRI FARMASI;-;-;-;0;0;-;-;-;-;-;-
OF;;L-Treonine;568391,93;50,00;28419596,50;0,00;28419596,50;2841959,65;0;0
OF;;L-Treonine;568391,93;50,00;28419596,50;0,00;28419596,50;2841959,65;0;0
OF;;L-Lysine Monoacetat;611021,33;50,00;30551066,50;0,00;30551066,50;3055106,65;0;0
OF;;L-Lysine Monoacetat;611021,33;100,00;61102133,00;0,00;61102133,00;6110213,30;0;0
OF;;L-Histidine;937846,69;50,00;46892334,50;0,00;46892334,50;4689233,45;0;0
OF;;L-Tryptofan;1424573,92;50,00;71228696,00;0,00;71228696,00;7122869,60;0;0
OF;;L-Tyrosine;1563077,81;50,00;78153890,50;0,00;78153890,50;7815389,05;0;0
FK;01;0;0001569777633;7;2015;23/07/2015;013032693007000;PT. ETHICA INDUSTRI FARMASI;JL. PULOGADUNG NO.6, KIP, RAWA TERATE, CAKUNG, JAKARTA TIMUR 13920;164763478;16476347;0;0;0;0;0;0;CD-2015001377
LT;013032693007000;PT. ETHICA INDUSTRI FARMASI;-;-;-;0;0;-;-;-;-;-;-
OF;;AmlodipineBesylate10mgTabOGBst3/144;15653,00;10526,00;164763478,00;0,00;164763478,00;16476347,80;0;0
FK;01;0;0001569777636;7;2015;27/07/2015;013032693007000;PT. ETHICA INDUSTRI FARMASI;JL. PULOGADUNG NO.6, KIP, RAWA TERATE, CAKUNG, JAKARTA TIMUR 13920;99581840;9958184;0;0;0;0;0;0;CD-2015001380
LT;013032693007000;PT. ETHICA INDUSTRI FARMASI;-;-;-;0;0;-;-;-;-;-;-
OF;;Aminoral Capl Fct str 10 pcs /28;42520,00;1167,00;49620840,00;0,00;49620840,00;4962084,00;0;0
OF;;Aminoral Capl Fct str 10 pcs /28;42520,00;1175,00;49961000,00;0,00;49961000,00;4996100,00;0;0
FK;01;0;0001569777637;7;2015;27/07/2015;013032693007000;PT. ETHICA INDUSTRI FARMASI;JL. PULOGADUNG NO.6, KIP, RAWA TERATE, CAKUNG, JAKARTA TIMUR 13920;247211280;24721128;0;0;0;0;0;0;CD-2015001381
LT;013032693007000;PT. ETHICA INDUSTRI FARMASI;-;-;-;0;0;-;-;-;-;-;-
OF;;Aminoral CaplFct PHL str10pcs/28;42520,00;1154,00;49068080,00;0,00;49068080,00;4906808,00;0;0
OF;;Aminoral CaplFct PHL str10pcs/28;42520,00;1165,00;49535800,00;0,00;49535800,00;4953580,00;0;0
OF;;Aminoral CaplFct PHL str10pcs/28;42520,00;1170,00;49748400,00;0,00;49748400,00;4974840,00;0;0
OF;;Aminoral CaplFct PHL str10pcs/28;42520,00;1166,00;49578320,00;0,00;49578320,00;4957832,00;0;0
OF;;Aminoral CaplFct PHL str10pcs/28;42520,00;1159,00;49280680,00;0,00;49280680,00;4928068,00;0;0
FK;01;0;0001569777634;7;2015;27/07/2015;013032693007000;PT. ETHICA INDUSTRI FARMASI;JL. PULOGADUNG NO.6, KIP, RAWA TERATE, CAKUNG, JAKARTA TIMUR 13920;140508249;14050824;0;0;0;0;0;0;CD-2015001378
LT;013032693007000;PT. ETHICA INDUSTRI FARMASI;-;-;-;0;0;-;-;-;-;-;-
OF;;AmlodipineBesylate5mgTabOGBstr3/255;8949,00;15701,00;140508249,00;0,00;140508249,00;14050824,90;0;0
FK;01;0;0001569777638;7;2015;28/07/2015;013032693007000;PT. ETHICA INDUSTRI FARMASI;JL. PULOGADUNG NO.6, KIP, RAWA TERATE, CAKUNG, JAKARTA TIMUR 13920;148649920;14864992;0;0;0;0;0;0;CD-2015001383
LT;013032693007000;PT. ETHICA INDUSTRI FARMASI;-;-;-;0;0;-;-;-;-;-;-
OF;;Aminoral CaplFct PHL str10pcs/28;42520,00;1164,00;49493280,00;0,00;49493280,00;4949328,00;0;0
OF;;Aminoral CaplFct PHL str10pcs/28;42520,00;1159,00;49280680,00;0,00;49280680,00;4928068,00;0;0
OF;;Aminoral CaplFct PHL str10pcs/28;42520,00;1173,00;49875960,00;0,00;49875960,00;4987596,00;0;0
FK;01;0;0001569777635;7;2015;28/07/2015;013032693007000;PT. ETHICA INDUSTRI FARMASI;JL. PULOGADUNG NO.6, KIP, RAWA TERATE, CAKUNG, JAKARTA TIMUR 13920;61337353;6133735;0;0;0;0;0;0;CD-2015001379
LT;013032693007000;PT. ETHICA INDUSTRI FARMASI;-;-;-;0;0;-;-;-;-;-;-
OF;;Irbesartan 150mg CaplOGB Str 3 pcs/104;19429,00;3000,00;58287000,00;0,00;58287000,00;5828700,00;0;0
OF;;Irbesartan 150mg CaplOGB Str 3 pcs/104;19429,00;157,00;3050353,00;0,00;3050353,00;305035,30;0;0
FK;01;0;0001569777639;7;2015;28/07/2015;013032693007000;PT. ETHICA INDUSTRI FARMASI;JL. PULOGADUNG NO.6, KIP, RAWA TERATE, CAKUNG, JAKARTA TIMUR 13920;44414237;4441423;0;0;0;0;0;0;CD-2015001384
LT;013032693007000;PT. ETHICA INDUSTRI FARMASI;-;-;-;0;0;-;-;-;-;-;-
OF;;AzithromycinMgDrysyr OGB Btl60ml/66;15071,00;2897,00;43660687,00;0,00;43660687,00;4366068,70;0;0
OF;;AzithromycinMgDrysyr OGB Btl60ml/66;15071,00;50,00;753550,00;0,00;753550,00;75355,00;0;0
FK;01;0;0001569777650;7;2015;29/07/2015;013032693007000;PT. ETHICA INDUSTRI FARMASI;JL. PULOGADUNG NO.6, KIP, RAWA TERATE, CAKUNG, JAKARTA TIMUR 13920;44293669;4429366;0;0;0;0;0;0;CD-2015001382
LT;013032693007000;PT. ETHICA INDUSTRI FARMASI;-;-;-;0;0;-;-;-;-;-;-
OF;;AzithromycinMgDrysyr OGB Btl60ml/66;15071,00;2897,00;43660687,00;0,00;43660687,00;4366068,70;0;0
OF;;AzithromycinMgDrysyr OGB Btl60ml/66;15071,00;42,00;632982,00;0,00;632982,00;63298,20;0;0
