RK;NPWP;NAMA;KD_JENIS_TRANSAKSI;FG_PENGGANTI;NOMOR_FAKTUR;TANGGAL_FAKTUR;NO_DOKUMEN_FAKTUR;TANGGAL_RETUR;MASA_PAJAK_RETUR;TAHUN_PAJAK_RETUR;NILAI_RETUR_DPP;NILAI_RETUR_PPN;NILAI_RETUR_PPNBM
RK;000000000000000;"A Yudi Jaya Musradhy P";01;0;0001623748917;02/03/2016;0016/UHNCAB/RET/201;02/03/2016;3;2016;1800000;180000;0
RK;000000000000000;"Jehuda Mena`u";01;0;0001623748918;02/03/2016;0017/UHNCAB/RET/201;02/03/2016;3;2016;1800000;180000;0
RK;454490590116000;JOEMAKIR;01;0;0001623748922;02/03/2016;0018/UHNCAB/RET/201;02/03/2016;3;2016;1800000;180000;0
RK;000000000000000;"Theresia Irmayanti Maker";01;0;0001623748949;03/03/2016;0019/UHNCAB/RET/201;03/03/2016;3;2016;14720164;1472016;0
RK;000000000000000;"ALSENSIUS TUMELENG";01;0;0001623749036;08/03/2016;0020/UHNCAB/RET/201;08/03/2016;3;2016;25968355;2596835;0
RK;000000000000000;"Melisa Christian";01;0;0001623748948;03/03/2016;0022/UHNCAB/RET/201;19/03/2016;3;2016;1551000;155100;0
RK;000000000000000;"Melisa Christian";01;0;0001623748948;03/03/2016;0021/UHNCAB/RET/201;19/03/2016;3;2016;31250336;3125034;0
RK;000000000000000;"Maria Sri Suliyati";01;0;0001623802239;24/03/2016;0023/UHNCAB/RET/201;24/03/2016;3;2016;9369236;936924;0
RK;000000000000000;Dahlia;01;0;0001623802291;28/03/2016;0024/UHNCAB/RET/201;28/03/2016;3;2016;931455;93145;0
RK;082738550831000;"Harun D. Tumbuan";01;0;0001623802351;29/03/2016;0025/UHNCAB/RET/201;29/03/2016;3;2016;285455;28545;0
RK;061106084008000;"Mira Rebeka Sani";01;0;0001623802420;30/03/2016;0026/UHNCAB/RET/201;30/03/2016;3;2016;92291;9229;0
RK;579473596823000;"Supantia Saleh";01;0;0001623802456;31/03/2016;0027/UHNCAB/RET/201;31/03/2016;3;2016;14033345;1403335;0
RK;576716294952000;"Jolanda M.Uneputty";01;0;0001623802543;31/03/2016;0028/UHNCAB/RET/201;31/03/2016;3;2016;6189900;618990;0
