FK;KD_JENIS_TRANSAKSI;FG_PENGGANTI;NOMOR_FAKTUR;MASA_PAJAK;TAHUN_PAJAK;TANGGAL_FAKTUR;NPWP;NAMA;ALAMAT_LENGKAP;JUMLAH_DPP;JUMLAH_PPN;JUMLAH_PPNBM;ID_KETERANGAN_TAMBAHAN;FP_UANG_MUKA;UANG_MUKA_DPP;UANG_MUKA_PPN;UANG_MUKA_PPNBM;REFERENSI
LT;NPWP;NAMA;JALAN;BLOK;NOMOR;RT;RW;KECAMATAN;KELURAHAN;KABUPATEN;PROPINSI;KODE_POS;NOMOR_TELEPON
OF;KODE_OBJEK;NAMA;HARGA_SATUAN;JUMLAH_BARANG;HARGA_TOTAL;DISKON;DPP;PPN;TARIF_PPNBM;PPNBM
FK;01;0;0171735730092;7;2017;04/07/2017;061106084008000;"Mira Rebeka Sani";"Jl. Kesenian Blok O 1/12 Rt.016 Rw.009 Duren Sawit Jakarta Timur";4933546;493354;0;0;0;0;0;0;30847
LT;061106084008000;"Mira Rebeka Sani";-;-;-;0;0;-;-;-;-;-;-
OF;NT020004;Legreskin;275420;2;550840;0;500764;50076;0;0
OF;NT020006;"Echina-C Plus";154160;6;924960;0;840873;84087;0;0
OF;PP0220;"HF Salmon Oil 90s Promo (Buy 2 Get 1 Salmon 30s)";282000;2;564000;0;512727;51273;0;0
OF;PP0223;"BI Night Cream Promo (Buy 2 Get 1 BI Serum)";250510;2;501020;0;455473;45547;0;0
OF;PP0187;"Antioxidant Life Promo (Gratis Magozai 375 ml)";1378040;2;2756080;0;2505527;250553;0;0
OF;MT0144;"Catalog Vol. 3 Th 2017 (20 pcs)";130000;1;130000;0;118182;11818;0;0
FK;01;0;0171735730103;7;2017;04/07/2017;082738550831000;"Harun D. Tumbuan";"Komplek RSD Madani No.19 Kota Palu Sualwesi Tengah";1654546;165454;0;0;0;0;0;0;30856
LT;082738550831000;"Harun D. Tumbuan";-;-;-;0;0;-;-;-;-;-;-
OF;MT0146;"Catalog Vol. 3 Th 2017 (100 pcs)";590000;3;1770000;0;1609091;160909;0;0
OF;MT070022;"Flyer 100 lbr";50000;1;50000;0;45455;4545;0;0
FK;01;0;0171735730108;7;2017;04/07/2017;674087382114000;"IDA FENNY ELYSA";"JL. DEBLOD SUNDORO NO. 41 LK. II";445455;44545;0;0;0;0;0;0;30861
LT;674087382114000;"IDA FENNY ELYSA";-;-;-;0;0;-;-;-;-;-;-
OF;MT0145;"Catalog Vol. 3 Th 2017 (50 pcs)";310000;1;310000;0;281818;28182;0;0
OF;MT0144;"Catalog Vol. 3 Th 2017 (20 pcs)";130000;1;130000;0;118182;11818;0;0
OF;MT070022;"Flyer 100 lbr";50000;1;50000;0;45455;4545;0;0
FK;01;0;0171735730124;7;2017;05/07/2017;672354446619000;"Surjana Dewi Effendy";"JL. Manyar Tirtoyoso Selatan 4 no. 11 RT 007 RW 005 Manyarsabrangan Mulyorejo surabaya";1118182;111818;0;0;0;0;0;0;30872
LT;672354446619000;"Surjana Dewi Effendy";-;-;-;0;0;-;-;-;-;-;-
OF;MT0146;"Catalog Vol. 3 Th 2017 (100 pcs)";590000;2;1180000;0;1072727;107273;0;0
OF;MT070022;"Flyer 100 lbr";50000;1;50000;0;45455;4545;0;0
FK;01;0;0171735730180;7;2017;07/07/2017;082738550831000;"Harun D. Tumbuan";"Komplek RSD Madani No.19 Kota Palu Sualwesi Tengah";90000;9000;0;0;0;0;0;0;30911
LT;082738550831000;"Harun D. Tumbuan";-;-;-;0;0;-;-;-;-;-;-
OF;SK0048;"Starter Kit Juli 2017";99000;1;99000;0;90000;9000;0;0
FK;01;0;0171735730183;7;2017;07/07/2017;579473596823000;"Supantia Saleh";"Jl. Bitung Tengah RT.010 Rw.004. Bitung Tengah - Maesa Bitung";9591446;959144;0;0;0;0;0;0;30914
LT;579473596823000;"Supantia Saleh";-;-;-;0;0;-;-;-;-;-;-
OF;PP0187;"Antioxidant Life Promo (Gratis Magozai 375 ml)";1378040;3;4134120;0;3758291;375829;0;0
OF;PP0176;"Cell Protection Promo (Gratis Magozai 750 ml)";1324460;3;3973380;0;3612164;361216;0;0
OF;PP0221;"HF Glucosefit Promo (Buy 2 Get 1)";346625;2;693250;0;630227;63023;0;0
OF;PP0217;"HF Bee Propolis Liquid Promo (Buy 2 Get 1)";280120;2;560240;0;509309;50931;0;0
OF;HF060011;"HF Salmon Oil 30s";111860;1;111860;0;101691;10169;0;0
OF;MT0146;"Catalog Vol. 3 Th 2017 (100 pcs)";590000;1;590000;0;536364;53636;0;0
OF;MT070081;"Strip Asam Urat";77900;1;77900;0;70818;7082;0;0
OF;HF060006;"HF Bee Propolis 30s";204920;2;409840;0;372582;37258;0;0
FK;01;0;0171735730215;7;2017;08/07/2017;061106084008000;"Mira Rebeka Sani";"Jl. Kesenian Blok O 1/12 Rt.016 Rw.009 Duren Sawit Jakarta Timur";888300;88830;0;0;0;0;0;0;30941
LT;061106084008000;"Mira Rebeka Sani";-;-;-;0;0;-;-;-;-;-;-
OF;PP0213;"Magozai Jr. Promo (Buy 2 Get 1 Calway C Jr)";320540;2;641080;0;582800;58280;0;0
OF;PP0214;"Legalon Promo (Gratis Legres)";336050;1;336050;0;305500;30550;0;0
FK;01;0;0171735730217;7;2017;08/07/2017;061106084008000;"Mira Rebeka Sani";"Jl. Kesenian Blok O 1/12 Rt.016 Rw.009 Duren Sawit Jakarta Timur";1591000;159100;0;0;0;0;0;0;30943
LT;061106084008000;"Mira Rebeka Sani";-;-;-;0;0;-;-;-;-;-;-
OF;PP080145;"TOP UP Loyalty 4 Magozai 375ml";49000;22;1078000;0;980000;98000;0;0
OF;PP0214;"Legalon Promo (Gratis Legres)";336050;2;672100;0;611000;61100;0;0
FK;01;0;0171735730218;7;2017;08/07/2017;061106084008000;"Mira Rebeka Sani";"Jl. Kesenian Blok O 1/12 Rt.016 Rw.009 Duren Sawit Jakarta Timur";44545;4454;0;0;0;0;0;0;30944
LT;061106084008000;"Mira Rebeka Sani";-;-;-;0;0;-;-;-;-;-;-
OF;PP080145;"TOP UP Loyalty 4 Magozai 375ml";49000;1;49000;0;44545;4454;0;0
FK;01;0;0171735730221;7;2017;08/07/2017;672354446619000;"Surjana Dewi Effendy";"JL. Manyar Tirtoyoso Selatan 4 no. 11 RT 007 RW 005 Manyarsabrangan Mulyorejo surabaya";4599164;459916;0;0;0;0;0;0;30946
LT;672354446619000;"Surjana Dewi Effendy";-;-;-;0;0;-;-;-;-;-;-
OF;PP0214;"Legalon Promo (Gratis Legres)";336050;12;4032600;0;3666000;366600;0;0
OF;PP0215;"Sistocare Promo (Buy 2 Get 1)";256620;4;1026480;0;933164;93316;0;0
FK;01;0;0171735730229;7;2017;10/07/2017;061106084008000;"Mira Rebeka Sani";"Jl. Kesenian Blok O 1/12 Rt.016 Rw.009 Duren Sawit Jakarta Timur";306355;30635;0;0;0;0;0;0;30949
LT;061106084008000;"Mira Rebeka Sani";-;-;-;0;0;-;-;-;-;-;-
OF;HF060004;"HF Joint Booster 60s";336990;1;336990;0;306355;30635;0;0
FK;01;0;0171735730231;7;2017;10/07/2017;594682387037000;"Zainal Arifin.";"Jl. Thalib II No.5 Krukut - Tamansari Jakarta Barat";4358610;435860;0;0;0;0;0;0;30951
LT;594682387037000;"Zainal Arifin.";-;-;-;0;0;-;-;-;-;-;-
OF;PP0187;"Antioxidant Life Promo (Gratis Magozai 375 ml)";1378040;1;1378040;0;1252764;125276;0;0
OF;PP0176;"Cell Protection Promo (Gratis Magozai 750 ml)";1324460;2;2648920;0;2408109;240811;0;0
OF;NT020004;Legreskin;275420;2;550840;0;500764;50076;0;0
OF;NT020019;"Renewskin 30";216670;1;216670;0;196973;19697;0;0
FK;01;0;0171735730232;7;2017;10/07/2017;594682387037000;"Zainal Arifin.";"Jl. Thalib II No.5 Krukut - Tamansari Jakarta Barat";118182;11818;0;0;0;0;0;0;30952
LT;594682387037000;"Zainal Arifin.";-;-;-;0;0;-;-;-;-;-;-
OF;MT0144;"Catalog Vol. 3 Th 2017 (20 pcs)";130000;1;130000;0;118182;11818;0;0
FK;01;0;0171735730240;7;2017;10/07/2017;698090388822000;"Lutfia Y.K. Nasib Alamri, SE";"DISNAKERTRANS PROP. GORONTALO / JL AGUS SALIM RT 001 RW 001 DULALOWO KEC KOTA TENGAH KOTA GORONTALO";8561000;856099;0;0;0;0;0;0;30960
LT;698090388822000;"Lutfia Y.K. Nasib Alamri, SE";-;-;-;0;0;-;-;-;-;-;-
OF;PP0225;"Asta-Spa Set Promo Diskon 25%";441800;2;883600;0;803273;80327;0;0
OF;HF060011;"HF Salmon Oil 30s";111860;10;1118600;0;1016909;101691;0;0
OF;MT0092;"Paket Legres + Alat Cek Darah";473000;1;473000;0;430000;43000;0;0
OF;BY030005;"UC - Intense Rejuvenating Cream (Day-Night Cream)";356730;4;1426920;0;1297200;129720;0;0
OF;NT020015;Curcomplex95;540500;7;3783500;0;3439545;343954;0;0
OF;NT020018;"Renewskin 15";124080;6;744480;0;676800;67680;0;0
OF;PP0218;"Biorate Promo (Gratis Legres)";246750;4;987000;0;897273;89727;0;0
FK;01;0;0171735730241;7;2017;10/07/2017;061106084008000;"Mira Rebeka Sani";"Jl. Kesenian Blok O 1/12 Rt.016 Rw.009 Duren Sawit Jakarta Timur";305500;30550;0;0;0;0;0;0;30961
LT;061106084008000;"Mira Rebeka Sani";-;-;-;0;0;-;-;-;-;-;-
OF;PP0214;"Legalon Promo (Gratis Legres)";336050;1;336050;0;305500;30550;0;0
FK;01;0;0171735730261;7;2017;11/07/2017;698090388822000;"Lutfia Y.K. Nasib Alamri, SE";"DISNAKERTRANS PROP. GORONTALO / JL AGUS SALIM RT 001 RW 001 DULALOWO KEC KOTA TENGAH KOTA GORONTALO";536364;53636;0;0;0;0;0;0;30977
LT;698090388822000;"Lutfia Y.K. Nasib Alamri, SE";-;-;-;0;0;-;-;-;-;-;-
OF;MT0146;"Catalog Vol. 3 Th 2017 (100 pcs)";590000;1;590000;0;536364;53636;0;0
FK;01;0;0171735730289;7;2017;12/07/2017;061106084008000;"Mira Rebeka Sani";"Jl. Kesenian Blok O 1/12 Rt.016 Rw.009 Duren Sawit Jakarta Timur";1882991;188299;0;0;0;0;0;0;31000
LT;061106084008000;"Mira Rebeka Sani";-;-;-;0;0;-;-;-;-;-;-
OF;PP0187;"Antioxidant Life Promo (Gratis Magozai 375 ml)";1378040;1;1378040;0;1252764;125276;0;0
OF;PP0221;"HF Glucosefit Promo (Buy 2 Get 1)";346625;2;693250;0;630227;63023;0;0
FK;01;0;0171735730290;7;2017;12/07/2017;061106084008000;"Mira Rebeka Sani";"Jl. Kesenian Blok O 1/12 Rt.016 Rw.009 Duren Sawit Jakarta Timur";1443727;144371;0;0;0;0;0;0;31001
LT;061106084008000;"Mira Rebeka Sani";-;-;-;0;0;-;-;-;-;-;-
OF;PP0187;"Antioxidant Life Promo (Gratis Magozai 375 ml)";1378040;1;1378040;0;1252764;125276;0;0
OF;NT020006;"Echina-C Plus";154160;1;154160;0;140145;14014;0;0
OF;PP080145;"TOP UP Loyalty 4 Magozai 375ml";49000;1;49000;0;44545;4454;0;0
OF;MT0143;"Catalog Vol. 3 Th 2017";6900;1;6900;0;6273;627;0;0
FK;01;0;0171735730301;7;2017;12/07/2017;061106084008000;"Mira Rebeka Sani";"Jl. Kesenian Blok O 1/12 Rt.016 Rw.009 Duren Sawit Jakarta Timur";44545;4454;0;0;0;0;0;0;31009
LT;061106084008000;"Mira Rebeka Sani";-;-;-;0;0;-;-;-;-;-;-
OF;PP0209;"TOP UP Loyalty 4 Magozai Jr 375ml";49000;1;49000;0;44545;4454;0;0
FK;01;0;0171735730306;7;2017;12/07/2017;082738550831000;"Harun D. Tumbuan";"Komplek RSD Madani No.19 Kota Palu Sualwesi Tengah";267273;26727;0;0;0;0;0;0;31014
LT;082738550831000;"Harun D. Tumbuan";-;-;-;0;0;-;-;-;-;-;-
OF;PP080145;"TOP UP Loyalty 4 Magozai 375ml";49000;6;294000;0;267273;26727;0;0
FK;01;0;0171735730313;7;2017;12/07/2017;674087382114000;"IDA FENNY ELYSA";"JL. DEBLOD SUNDORO NO. 41 LK. II";12226018;1222601;0;0;0;0;0;0;31020
LT;674087382114000;"IDA FENNY ELYSA";-;-;-;0;0;-;-;-;-;-;-
OF;PP080145;"TOP UP Loyalty 4 Magozai 375ml";49000;16;784000;0;712727;71273;0;0
OF;NT020017;"Magozai 375ml";343100;6;2058600;0;1871455;187145;0;0
OF;NT020015;Curcomplex95;540500;2;1081000;0;982727;98273;0;0
OF;PP0219;"HF Pureway-C Promo (Buy 2 Get 1 Legres)";129250;8;1034000;0;940000;94000;0;0
OF;PP0220;"HF Salmon Oil 90s Promo (Buy 2 Get 1 Salmon 30s)";282000;6;1692000;0;1538182;153818;0;0
OF;PP0221;"HF Glucosefit Promo (Buy 2 Get 1)";346625;4;1386500;0;1260455;126045;0;0
OF;PP0216;"HF Bee Propolis 90s Promo (Buy 2 Get 1)";512300;2;1024600;0;931455;93145;0;0
OF;PP0224;"Astaderm Set Promo (Gratis Asta Spa Body Serum)";501960;1;501960;0;456327;45633;0;0
OF;HF060011;"HF Salmon Oil 30s";111860;6;671160;0;610145;61014;0;0
OF;PP0215;"Sistocare Promo (Buy 2 Get 1)";256620;8;2052960;0;1866327;186633;0;0
OF;PP0222;"Vegefrut Promo (Buy 2 Get 1 BI Facial Foam)";193640;6;1161840;0;1056218;105622;0;0
FK;01;0;0171735730322;7;2017;13/07/2017;672354446619000;"Surjana Dewi Effendy";"JL. Manyar Tirtoyoso Selatan 4 no. 11 RT 007 RW 005 Manyarsabrangan Mulyorejo surabaya";6857300;685729;0;0;0;0;0;0;31028
LT;672354446619000;"Surjana Dewi Effendy";-;-;-;0;0;-;-;-;-;-;-
OF;NT020011;Asta-Gen;253800;9;2284200;0;2076545;207654;0;0
OF;HF060008;"HF Coformula 60s";540500;1;540500;0;491364;49136;0;0
OF;PP0218;"Biorate Promo (Gratis Legres)";246750;1;246750;0;224318;22432;0;0
OF;PP0221;"HF Glucosefit Promo (Buy 2 Get 1)";346625;8;2773000;0;2520909;252091;0;0
OF;PP0214;"Legalon Promo (Gratis Legres)";336050;2;672100;0;611000;61100;0;0
OF;PP0215;"Sistocare Promo (Buy 2 Get 1)";256620;4;1026480;0;933164;93316;0;0
FK;01;0;0171735730323;7;2017;13/07/2017;145772877711000;"Yesoa Amd.Pd";"Jl. Pangkalima Kapang, Anjir Kalampan KM 1200 Rt. 002 No. 07 Kapuas Kalimantan Tengah 73552";7665772;766578;0;0;0;0;0;0;31029
LT;145772877711000;"Yesoa Amd.Pd";-;-;-;0;0;-;-;-;-;-;-
OF;PP0225;"Asta-Spa Set Promo Diskon 25%";441800;1;441800;0;401636;40164;0;0
OF;PP0217;"HF Bee Propolis Liquid Promo (Buy 2 Get 1)";280120;4;1120480;0;1018618;101862;0;0
OF;PP0187;"Antioxidant Life Promo (Gratis Magozai 375 ml)";1378040;2;2756080;0;2505527;250553;0;0
OF;PP0216;"HF Bee Propolis 90s Promo (Buy 2 Get 1)";512300;2;1024600;0;931455;93145;0;0
OF;NT020003;"Magozai 750ml";562120;1;562120;0;511018;51102;0;0
OF;NT020015;Curcomplex95;540500;1;540500;0;491364;49136;0;0
OF;PP0218;"Biorate Promo (Gratis Legres)";246750;2;493500;0;448636;44864;0;0
OF;NT020001;Legres;125020;1;125020;0;113655;11365;0;0
OF;PP0214;"Legalon Promo (Gratis Legres)";336050;1;336050;0;305500;30550;0;0
OF;NT020017;"Magozai 375ml";343100;2;686200;0;623818;62382;0;0
OF;PP080145;"TOP UP Loyalty 4 Magozai 375ml";49000;3;147000;0;133636;13364;0;0
OF;MT0144;"Catalog Vol. 3 Th 2017 (20 pcs)";130000;1;130000;0;118182;11818;0;0
OF;MT0143;"Catalog Vol. 3 Th 2017";6900;10;69000;0;62727;6273;0;0
FK;01;0;0171735730330;7;2017;13/07/2017;451202204954000;"Theresia Irmayanti Maker";"jl. PDAM Gg. 5 no 3 kelurahan karang mulia Nabire ";6364909;636491;0;0;0;0;0;0;31035
LT;451202204954000;"Theresia Irmayanti Maker";-;-;-;0;0;-;-;-;-;-;-
OF;NT020003;"Magozai 750ml";618520;10;6185200;0;5622909;562291;0;0
OF;NT020001;Legres;137240;5;686200;0;623818;62382;0;0
OF;MT0144;"Catalog Vol. 3 Th 2017 (20 pcs)";130000;1;130000;0;118182;11818;0;0
FK;01;0;0171735730342;7;2017;14/07/2017;082738550831000;"Harun D. Tumbuan";"Komplek RSD Madani No.19 Kota Palu Sualwesi Tengah";44545;4454;0;0;0;0;0;0;31045
LT;082738550831000;"Harun D. Tumbuan";-;-;-;0;0;-;-;-;-;-;-
OF;PP080145;"TOP UP Loyalty 4 Magozai 375ml";49000;1;49000;0;44545;4454;0;0
FK;01;0;0171735730346;7;2017;14/07/2017;061106084008000;"Mira Rebeka Sani";"Jl. Kesenian Blok O 1/12 Rt.016 Rw.009 Duren Sawit Jakarta Timur";2184218;218421;0;0;0;0;0;0;31048
LT;061106084008000;"Mira Rebeka Sani";-;-;-;0;0;-;-;-;-;-;-
OF;NT020006;"Echina-C Plus";154160;1;154160;0;140145;14014;0;0
OF;NT020003;"Magozai 750ml";562120;4;2248480;0;2044073;204407;0;0
FK;01;0;0171735730351;7;2017;14/07/2017;082738550831000;"Harun D. Tumbuan";"Komplek RSD Madani No.19 Kota Palu Sualwesi Tengah";1800000;180000;0;0;0;0;0;0;31053
LT;082738550831000;"Harun D. Tumbuan";-;-;-;0;0;-;-;-;-;-;-
OF;SK0048;"Starter Kit Juli 2017";99000;20;1980000;0;1800000;180000;0;0
FK;01;0;0171735730361;7;2017;14/07/2017;061106084008000;"Mira Rebeka Sani";"Jl. Kesenian Blok O 1/12 Rt.016 Rw.009 Duren Sawit Jakarta Timur";630227;63023;0;0;0;0;0;0;31060
LT;061106084008000;"Mira Rebeka Sani";-;-;-;0;0;-;-;-;-;-;-
OF;PP0221;"HF Glucosefit Promo (Buy 2 Get 1)";346625;2;693250;0;630227;63023;0;0
FK;01;0;0171735730362;7;2017;14/07/2017;061106084008000;"Mira Rebeka Sani";"Jl. Kesenian Blok O 1/12 Rt.016 Rw.009 Duren Sawit Jakarta Timur";140145;14014;0;0;0;0;0;0;31061
LT;061106084008000;"Mira Rebeka Sani";-;-;-;0;0;-;-;-;-;-;-
OF;NT020006;"Echina-C Plus";154160;1;154160;0;140145;14014;0;0
FK;01;0;0171735730366;7;2017;14/07/2017;061106084008000;"Mira Rebeka Sani";"Jl. Kesenian Blok O 1/12 Rt.016 Rw.009 Duren Sawit Jakarta Timur";361818;36182;0;0;0;0;0;0;31065
LT;061106084008000;"Mira Rebeka Sani";-;-;-;0;0;-;-;-;-;-;-
OF;PP0229;"TOP UP Unihealth Watch";199000;2;398000;0;361818;36182;0;0
FK;01;0;0171735730368;7;2017;14/07/2017;061106084008000;"Mira Rebeka Sani";"Jl. Kesenian Blok O 1/12 Rt.016 Rw.009 Duren Sawit Jakarta Timur";118182;11818;0;0;0;0;0;0;31066
LT;061106084008000;"Mira Rebeka Sani";-;-;-;0;0;-;-;-;-;-;-
OF;MT0144;"Catalog Vol. 3 Th 2017 (20 pcs)";130000;1;130000;0;118182;11818;0;0
FK;01;0;0171735730373;7;2017;15/07/2017;082738550831000;"Harun D. Tumbuan";"Komplek RSD Madani No.19 Kota Palu Sualwesi Tengah";11051409;1105140;0;0;0;0;0;0;31071
LT;082738550831000;"Harun D. Tumbuan";-;-;-;0;0;-;-;-;-;-;-
OF;PP0225;"Asta-Spa Set Promo Diskon 25%";441800;1;441800;0;401636;40164;0;0
OF;PP0221;"HF Glucosefit Promo (Buy 2 Get 1)";346625;6;2079750;0;1890682;189068;0;0
OF;NT020015;Curcomplex95;540500;4;2162000;0;1965455;196545;0;0
OF;HF060011;"HF Salmon Oil 30s";111860;6;671160;0;610145;61014;0;0
OF;HF060004;"HF Joint Booster 60s";336990;4;1347960;0;1225418;122542;0;0
OF;NT020017;"Magozai 375ml";343100;2;686200;0;623818;62382;0;0
OF;NT020006;"Echina-C Plus";154160;3;462480;0;420436;42044;0;0
OF;PP0220;"HF Salmon Oil 90s Promo (Buy 2 Get 1 Salmon 30s)";282000;4;1128000;0;1025455;102545;0;0
OF;PP0216;"HF Bee Propolis 90s Promo (Buy 2 Get 1)";512300;2;1024600;0;931455;93145;0;0
OF;PP0218;"Biorate Promo (Gratis Legres)";246750;6;1480500;0;1345909;134591;0;0
OF;PP0214;"Legalon Promo (Gratis Legres)";336050;2;672100;0;611000;61100;0;0
FK;01;0;0171735730403;7;2017;17/07/2017;672354446619000;"Surjana Dewi Effendy";"JL. Manyar Tirtoyoso Selatan 4 no. 11 RT 007 RW 005 Manyarsabrangan Mulyorejo surabaya";9597846;959782;0;0;0;0;0;0;31099
LT;672354446619000;"Surjana Dewi Effendy";-;-;-;0;0;-;-;-;-;-;-
OF;NT020011;Asta-Gen;253800;10;2538000;0;2307273;230727;0;0
OF;BY030011;"Astaderm Face Cream";227010;2;454020;0;412745;41274;0;0
OF;NT020015;Curcomplex95;540500;3;1621500;0;1474091;147409;0;0
OF;HF060004;"HF Joint Booster 60s";336990;1;336990;0;306355;30635;0;0
OF;PP0216;"HF Bee Propolis 90s Promo (Buy 2 Get 1)";512300;2;1024600;0;931455;93145;0;0
OF;PP0217;"HF Bee Propolis Liquid Promo (Buy 2 Get 1)";292040;2;584080;0;530982;53098;0;0
OF;PP0215;"Sistocare Promo (Buy 2 Get 1)";267540;2;535080;0;486436;48644;0;0
OF;PP0187;"Antioxidant Life Promo (Gratis Magozai 375 ml)";1436680;2;2873360;0;2612145;261214;0;0
OF;MT0146;"Catalog Vol. 3 Th 2017 (100 pcs)";590000;1;590000;0;536364;53636;0;0
FK;01;0;0171735730404;7;2017;17/07/2017;672354446619000;"Surjana Dewi Effendy";"JL. Manyar Tirtoyoso Selatan 4 no. 11 RT 007 RW 005 Manyarsabrangan Mulyorejo surabaya";180909;18091;0;0;0;0;0;0;31100
LT;672354446619000;"Surjana Dewi Effendy";-;-;-;0;0;-;-;-;-;-;-
OF;PP0229;"TOP UP Unihealth Watch";199000;1;199000;0;180909;18091;0;0
FK;01;0;0171735730426;7;2017;18/07/2017;061106084008000;"Mira Rebeka Sani";"Jl. Kesenian Blok O 1/12 Rt.016 Rw.009 Duren Sawit Jakarta Timur";1066581;106658;0;0;0;0;0;0;31116
LT;061106084008000;"Mira Rebeka Sani";-;-;-;0;0;-;-;-;-;-;-
OF;PP080145;"TOP UP Loyalty 4 Magozai 375ml";49000;1;49000;0;44545;4454;0;0
OF;NT020003;"Magozai 750ml";562120;2;1124240;0;1022036;102204;0;0
FK;01;0;0171735730434;7;2017;18/07/2017;594682387037000;"Zainal Arifin.";"Jl. Thalib II No.5 Krukut - Tamansari Jakarta Barat";133636;13364;0;0;0;0;0;0;31123
LT;594682387037000;"Zainal Arifin.";-;-;-;0;0;-;-;-;-;-;-
OF;PP0209;"TOP UP Loyalty 4 Magozai Jr 375ml";49000;3;147000;0;133636;13364;0;0
FK;01;0;0171735730443;7;2017;19/07/2017;061106084008000;"Mira Rebeka Sani";"Jl. Kesenian Blok O 1/12 Rt.016 Rw.009 Duren Sawit Jakarta Timur";1022036;102204;0;0;0;0;0;0;31131
LT;061106084008000;"Mira Rebeka Sani";-;-;-;0;0;-;-;-;-;-;-
OF;NT020003;"Magozai 750ml";562120;2;1124240;0;1022036;102204;0;0
FK;01;0;0171735730456;7;2017;19/07/2017;594682387037000;"Zainal Arifin.";"Jl. Thalib II No.5 Krukut - Tamansari Jakarta Barat";133636;13364;0;0;0;0;0;0;31140
LT;594682387037000;"Zainal Arifin.";-;-;-;0;0;-;-;-;-;-;-
OF;PP080145;"TOP UP Loyalty 4 Magozai 375ml";49000;3;147000;0;133636;13364;0;0
FK;01;0;0171735730461;7;2017;19/07/2017;672354446619000;"Surjana Dewi Effendy";"JL. Manyar Tirtoyoso Selatan 4 no. 11 RT 007 RW 005 Manyarsabrangan Mulyorejo surabaya";466582;46658;0;0;0;0;0;0;31145
LT;672354446619000;"Surjana Dewi Effendy";-;-;-;0;0;-;-;-;-;-;-
OF;PP0215;"Sistocare Promo (Buy 2 Get 1)";256620;2;513240;0;466582;46658;0;0
FK;01;0;0171735730482;7;2017;20/07/2017;672354446619000;"Surjana Dewi Effendy";"JL. Manyar Tirtoyoso Selatan 4 no. 11 RT 007 RW 005 Manyarsabrangan Mulyorejo surabaya";11886727;1188671;0;0;0;0;0;0;31162
LT;672354446619000;"Surjana Dewi Effendy";-;-;-;0;0;-;-;-;-;-;-
OF;NT020011;Asta-Gen;253800;10;2538000;0;2307273;230727;0;0
OF;NT020006;"Echina-C Plus";154160;1;154160;0;140145;14014;0;0
OF;HF060004;"HF Joint Booster 60s";336990;1;336990;0;306355;30635;0;0
OF;NT020018;"Renewskin 15";124080;2;248160;0;225600;22560;0;0
OF;NT020019;"Renewskin 30";216670;2;433340;0;393945;39394;0;0
OF;BY030006;"UC - Bright Intense - Facial Foam";190350;20;3807000;0;3460909;346091;0;0
OF;PP0214;"Legalon Promo (Gratis Legres)";336050;15;5040750;0;4582500;458250;0;0
OF;PP0219;"HF Pureway-C Promo (Buy 2 Get 1 Legres)";129250;4;517000;0;470000;47000;0;0
FK;01;0;0171735730490;7;2017;21/07/2017;061106084008000;"Mira Rebeka Sani";"Jl. Kesenian Blok O 1/12 Rt.016 Rw.009 Duren Sawit Jakarta Timur";1003772;100376;0;0;0;0;0;0;31167
LT;061106084008000;"Mira Rebeka Sani";-;-;-;0;0;-;-;-;-;-;-
OF;NT020006;"Echina-C Plus";154160;1;154160;0;140145;14014;0;0
OF;HF060004;"HF Joint Booster 60s";336990;1;336990;0;306355;30635;0;0
OF;PP0220;"HF Salmon Oil 90s Promo (Buy 2 Get 1 Salmon 30s)";282000;2;564000;0;512727;51273;0;0
OF;PP080145;"TOP UP Loyalty 4 Magozai 375ml";49000;1;49000;0;44545;4454;0;0
FK;01;0;0171735730544;7;2017;24/07/2017;082738550831000;"Harun D. Tumbuan";"Komplek RSD Madani No.19 Kota Palu Sualwesi Tengah";10013136;1001314;0;0;0;0;0;0;31214
LT;082738550831000;"Harun D. Tumbuan";-;-;-;0;0;-;-;-;-;-;-
OF;NT020010;Ginsana;312080;2;624160;0;567418;56742;0;0
OF;PP0216;"HF Bee Propolis 90s Promo (Buy 2 Get 1)";512300;4;2049200;0;1862909;186291;0;0
OF;PP0217;"HF Bee Propolis Liquid Promo (Buy 2 Get 1)";280120;2;560240;0;509309;50931;0;0
OF;HF060008;"HF Coformula 60s";540500;3;1621500;0;1474091;147409;0;0
OF;PP0221;"HF Glucosefit Promo (Buy 2 Get 1)";346625;2;693250;0;630227;63023;0;0
OF;HF0013;"HF Joint Booster 30s";202570;2;405140;0;368309;36831;0;0
OF;HF060004;"HF Joint Booster 60s";336990;4;1347960;0;1225418;122542;0;0
OF;PP0219;"HF Pureway-C Promo (Buy 2 Get 1 Legres)";129250;20;2585000;0;2350000;235000;0;0
OF;PP0220;"HF Salmon Oil 90s Promo (Buy 2 Get 1 Salmon 30s)";282000;4;1128000;0;1025455;102545;0;0
FK;01;0;0171735730549;7;2017;24/07/2017;082738550831000;"Harun D. Tumbuan";"Komplek RSD Madani No.19 Kota Palu Sualwesi Tengah";89091;8909;0;0;0;0;0;0;31219
LT;082738550831000;"Harun D. Tumbuan";-;-;-;0;0;-;-;-;-;-;-
OF;PP080145;"TOP UP Loyalty 4 Magozai 375ml";49000;2;98000;0;89091;8909;0;0
FK;01;0;0171735730555;7;2017;24/07/2017;594682387037000;"Zainal Arifin.";"Jl. Thalib II No.5 Krukut - Tamansari Jakarta Barat";2232073;223207;0;0;0;0;0;0;31223
LT;594682387037000;"Zainal Arifin.";-;-;-;0;0;-;-;-;-;-;-
OF;PP0187;"Antioxidant Life Promo (Gratis Magozai 375 ml)";1378040;1;1378040;0;1252764;125276;0;0
OF;PP0220;"HF Salmon Oil 90s Promo (Buy 2 Get 1 Salmon 30s)";282000;2;564000;0;512727;51273;0;0
OF;PP0215;"Sistocare Promo (Buy 2 Get 1)";256620;2;513240;0;466582;46658;0;0
FK;01;0;0171735730586;7;2017;25/07/2017;478640824626000;"Anang Purwito";"Jl.SLAMET RIYADI GANG CENTRAL KAV 7 JEMBER 68112";1751082;175108;0;0;0;0;0;0;31242
LT;478640824626000;"Anang Purwito";-;-;-;0;0;-;-;-;-;-;-
OF;NT020019;"Renewskin 30";225890;2;451780;0;410709;41071;0;0
OF;NT020013;Vegefrut;201880;1;201880;0;183527;18353;0;0
OF;NT0022;"Calcium with Vitamin D";280280;1;280280;0;254800;25480;0;0
OF;PP0218;"Biorate Promo (Gratis Legres)";257250;1;257250;0;233864;23386;0;0
OF;NT020006;"Echina-C Plus";160720;1;160720;0;146109;14611;0;0
OF;NT020004;Legreskin;287140;2;574280;0;522073;52207;0;0
FK;01;0;0171735730600;7;2017;26/07/2017;674087382114000;"IDA FENNY ELYSA";"JL. DEBLOD SUNDORO NO. 41 LK. II";8672782;867278;0;0;0;0;0;0;31254
LT;674087382114000;"IDA FENNY ELYSA";-;-;-;0;0;-;-;-;-;-;-
OF;BY0016;"Asta Spa Body Serum";202100;2;404200;0;367455;36745;0;0
OF;NT020009;Gravica;246750;5;1233750;0;1121591;112159;0;0
OF;NT020003;"Magozai 750ml";562120;6;3372720;0;3066109;306611;0;0
OF;PP0214;"Legalon Promo (Gratis Legres)";336050;3;1008150;0;916500;91650;0;0
OF;PP0218;"Biorate Promo (Gratis Legres)";246750;12;2961000;0;2691818;269182;0;0
OF;PP0217;"HF Bee Propolis Liquid Promo (Buy 2 Get 1)";280120;2;560240;0;509309;50931;0;0
FK;01;0;0171735730603;7;2017;26/07/2017;061106084008000;"Mira Rebeka Sani";"Jl. Kesenian Blok O 1/12 Rt.016 Rw.009 Duren Sawit Jakarta Timur";1204055;120405;0;0;0;0;0;0;31257
LT;061106084008000;"Mira Rebeka Sani";-;-;-;0;0;-;-;-;-;-;-
OF;PP0176;"Cell Protection Promo (Gratis Magozai 750 ml)";1324460;1;1324460;0;1204055;120405;0;0
FK;01;0;0171735730665;7;2017;28/07/2017;579473596823000;"Supantia Saleh";"Jl. Bitung Tengah RT.010 Rw.004. Bitung Tengah - Maesa Bitung";4626510;462650;0;0;0;0;0;0;31312
LT;579473596823000;"Supantia Saleh";-;-;-;0;0;-;-;-;-;-;-
OF;PP0187;"Antioxidant Life Promo (Gratis Magozai 375 ml)";1378040;1;1378040;0;1252764;125276;0;0
OF;PP0214;"Legalon Promo (Gratis Legres)";336050;2;672100;0;611000;61100;0;0
OF;PP0176;"Cell Protection Promo (Gratis Magozai 750 ml)";1324460;1;1324460;0;1204055;120405;0;0
OF;NT020015;Curcomplex95;540500;2;1081000;0;982727;98273;0;0
OF;HF060011;"HF Salmon Oil 30s";111860;2;223720;0;203382;20338;0;0
OF;HF060006;"HF Bee Propolis 30s";204920;2;409840;0;372582;37258;0;0
FK;01;0;0171735730679;7;2017;28/07/2017;061106084008000;"Mira Rebeka Sani";"Jl. Kesenian Blok O 1/12 Rt.016 Rw.009 Duren Sawit Jakarta Timur";1017445;101743;0;0;0;0;0;0;31322
LT;061106084008000;"Mira Rebeka Sani";-;-;-;0;0;-;-;-;-;-;-
OF;BY030004;"UC - Synergy Eye Treatment (UClaire Eye Gel)";181890;1;181890;0;165355;16535;0;0
OF;BY030007;"UC - Bright Intense Serum";265550;1;265550;0;241409;24141;0;0
OF;HF060011;"HF Salmon Oil 30s";111860;1;111860;0;101691;10169;0;0
OF;NT020006;"Echina-C Plus";154160;1;154160;0;140145;14014;0;0
OF;PP080145;"TOP UP Loyalty 4 Magozai 375ml";49000;1;49000;0;44545;4454;0;0
OF;BY030005;"UC - Intense Rejuvenating Cream (Day-Night Cream)";356730;1;356730;0;324300;32430;0;0
FK;01;0;0171735730696;7;2017;28/07/2017;674087382114000;"IDA FENNY ELYSA";"JL. DEBLOD SUNDORO NO. 41 LK. II";8249182;824917;0;0;0;0;0;0;31334
LT;674087382114000;"IDA FENNY ELYSA";-;-;-;0;0;-;-;-;-;-;-
OF;PP0187;"Antioxidant Life Promo (Gratis Magozai 375 ml)";1378040;1;1378040;0;1252764;125276;0;0
OF;PP0176;"Cell Protection Promo (Gratis Magozai 750 ml)";1324460;1;1324460;0;1204055;120405;0;0
OF;NT020017;"Magozai 375ml";343100;4;1372400;0;1247636;124764;0;0
OF;NT020003;"Magozai 750ml";562120;6;3372720;0;3066109;306611;0;0
OF;HF060011;"HF Salmon Oil 30s";111860;6;671160;0;610145;61014;0;0
OF;NT020006;"Echina-C Plus";154160;2;308320;0;280291;28029;0;0
OF;PP0219;"HF Pureway-C Promo (Buy 2 Get 1 Legres)";129250;4;517000;0;470000;47000;0;0
OF;MT0144;"Catalog Vol. 3 Th 2017 (20 pcs)";130000;1;130000;0;118182;11818;0;0
FK;01;0;0171735730718;7;2017;29/07/2017;061106084008000;"Mira Rebeka Sani";"Jl. Kesenian Blok O 1/12 Rt.016 Rw.009 Duren Sawit Jakarta Timur";133636;13364;0;0;0;0;0;0;31353
LT;061106084008000;"Mira Rebeka Sani";-;-;-;0;0;-;-;-;-;-;-
OF;PP080145;"TOP UP Loyalty 4 Magozai 375ml";49000;3;147000;0;133636;13364;0;0
FK;01;0;0171735730721;7;2017;29/07/2017;594682387037000;"Zainal Arifin.";"Jl. Thalib II No.5 Krukut - Tamansari Jakarta Barat";2755909;275591;0;0;0;0;0;0;31355
LT;594682387037000;"Zainal Arifin.";-;-;-;0;0;-;-;-;-;-;-
OF;PP0187;"Antioxidant Life Promo (Gratis Magozai 375 ml)";1515750;2;3031500;0;2755909;275591;0;0
FK;01;0;0171735730722;7;2017;29/07/2017;594682387037000;"Zainal Arifin.";"Jl. Thalib II No.5 Krukut - Tamansari Jakarta Barat";12058064;1205806;0;0;0;0;0;0;31356
LT;594682387037000;"Zainal Arifin.";-;-;-;0;0;-;-;-;-;-;-
OF;PP0187;"Antioxidant Life Promo (Gratis Magozai 375 ml)";1378040;6;8268240;0;7516582;751658;0;0
OF;PP0223;"BI Night Cream Promo (Buy 2 Get 1 BI Serum)";225600;2;451200;0;410182;41018;0;0
OF;PP0176;"Cell Protection Promo (Gratis Magozai 750 ml)";1324460;3;3973380;0;3612164;361216;0;0
OF;BY030006;"UC - Bright Intense - Facial Foam";190350;3;571050;0;519136;51914;0;0
FK;01;0;0171735730741;7;2017;29/07/2017;672354446619000;"Surjana Dewi Effendy";"JL. Manyar Tirtoyoso Selatan 4 no. 11 RT 007 RW 005 Manyarsabrangan Mulyorejo surabaya";5318300;531829;0;0;0;0;0;0;31374
LT;672354446619000;"Surjana Dewi Effendy";-;-;-;0;0;-;-;-;-;-;-
OF;NT0022;"Calcium with Vitamin D";268840;1;268840;0;244400;24440;0;0
OF;NT020007;Sistocare;256620;1;256620;0;233291;23329;0;0
OF;NT020001;Legres;125020;10;1250200;0;1136545;113654;0;0
OF;PP0224;"Astaderm Set Promo (Gratis Asta Spa Body Serum)";501960;3;1505880;0;1368982;136898;0;0
OF;PP0216;"HF Bee Propolis 90s Promo (Buy 2 Get 1)";512300;2;1024600;0;931455;93145;0;0
OF;PP0218;"Biorate Promo (Gratis Legres)";246750;1;246750;0;224318;22432;0;0
OF;PP0215;"Sistocare Promo (Buy 2 Get 1)";256620;2;513240;0;466582;46658;0;0
OF;PP080145;"TOP UP Loyalty 4 Magozai 375ml";49000;16;784000;0;712727;71273;0;0
FK;01;0;0171735730803;7;2017;31/07/2017;672354446619000;"Surjana Dewi Effendy";"JL. Manyar Tirtoyoso Selatan 4 no. 11 RT 007 RW 005 Manyarsabrangan Mulyorejo surabaya";270000;27000;0;0;0;0;0;0;31425
LT;672354446619000;"Surjana Dewi Effendy";-;-;-;0;0;-;-;-;-;-;-
OF;PP080145;"TOP UP Loyalty 4 Magozai 375ml";49000;2;98000;0;89091;8909;0;0
OF;PP0229;"TOP UP Unihealth Watch";199000;1;199000;0;180909;18091;0;0
FK;01;0;0171735730828;7;2017;31/07/2017;698090388822000;"Lutfia Y.K. Nasib Alamri, SE";"DISNAKERTRANS PROP. GORONTALO / JL AGUS SALIM RT 001 RW 001 DULALOWO KEC KOTA TENGAH KOTA GORONTALO";810000;81000;0;0;0;0;0;0;31447
LT;698090388822000;"Lutfia Y.K. Nasib Alamri, SE";-;-;-;0;0;-;-;-;-;-;-
OF;SK0048;"Starter Kit Juli 2017";99000;9;891000;0;810000;81000;0;0
FK;01;0;0171735730856;7;2017;31/07/2017;594682387037000;"Zainal Arifin.";"Jl. Thalib II No.5 Krukut - Tamansari Jakarta Barat";451963;45196;0;0;0;0;0;0;31473
LT;594682387037000;"Zainal Arifin.";-;-;-;0;0;-;-;-;-;-;-
OF;PP080145;"TOP UP Loyalty 4 Magozai 375ml";49000;7;343000;0;311818;31182;0;0
OF;NT020006;"Echina-C Plus";154160;1;154160;0;140145;14014;0;0
FK;01;0;0171735730859;7;2017;31/07/2017;082738550831000;"Harun D. Tumbuan";"Komplek RSD Madani No.19 Kota Palu Sualwesi Tengah";5063182;506318;0;0;0;0;0;0;31476
LT;082738550831000;"Harun D. Tumbuan";-;-;-;0;0;-;-;-;-;-;-
OF;PP0176;"Cell Protection Promo (Gratis Magozai 750 ml)";1324460;2;2648920;0;2408109;240811;0;0
OF;PP0187;"Antioxidant Life Promo (Gratis Magozai 375 ml)";1378040;1;1378040;0;1252764;125276;0;0
OF;NT020001;Legres;125020;4;500080;0;454618;45462;0;0
OF;PP0224;"Astaderm Set Promo (Gratis Asta Spa Body Serum)";501960;1;501960;0;456327;45633;0;0
OF;NT020015;Curcomplex95;540500;1;540500;0;491364;49136;0;0
FK;01;0;0171735730895;7;2017;31/07/2017;082738550831000;"Harun D. Tumbuan";"Komplek RSD Madani No.19 Kota Palu Sualwesi Tengah";352073;35207;0;0;0;0;0;0;31510
LT;082738550831000;"Harun D. Tumbuan";-;-;-;0;0;-;-;-;-;-;-
OF;PP0222;"Vegefrut Promo (Buy 2 Get 1 BI Facial Foam)";193640;2;387280;0;352073;35207;0;0
FK;01;0;0171735730913;7;2017;31/07/2017;594682387037000;"Zainal Arifin.";"Jl. Thalib II No.5 Krukut - Tamansari Jakarta Barat";233291;23329;0;0;0;0;0;0;31518
LT;594682387037000;"Zainal Arifin.";-;-;-;0;0;-;-;-;-;-;-
OF;NT020007;Sistocare;256620;1;256620;0;233291;23329;0;0
FK;01;0;0171735730923;7;2017;31/07/2017;082738550831000;"Harun D. Tumbuan";"Komplek RSD Madani No.19 Kota Palu Sualwesi Tengah";511018;51102;0;0;0;0;0;0;31527
LT;082738550831000;"Harun D. Tumbuan";-;-;-;0;0;-;-;-;-;-;-
OF;NT020003;"Magozai 750ml";562120;1;562120;0;511018;51102;0;0
FK;01;0;0171735730944;7;2017;31/07/2017;082738550831000;"Harun D. Tumbuan";"Komplek RSD Madani No.19 Kota Palu Sualwesi Tengah";8819763;881976;0;0;0;0;0;0;31547
LT;082738550831000;"Harun D. Tumbuan";-;-;-;0;0;-;-;-;-;-;-
OF;NT020015;Curcomplex95;540500;5;2702500;0;2456818;245682;0;0
OF;HF060008;"HF Coformula 60s";540500;5;2702500;0;2456818;245682;0;0
OF;NT020001;Legres;125020;10;1250200;0;1136545;113654;0;0
OF;HF060003;"HF Bee Propolis 90s";512300;2;1024600;0;931455;93145;0;0
OF;HF060004;"HF Joint Booster 60s";336990;6;2021940;0;1838127;183813;0;0
FK;01;0;0171735730947;7;2017;31/07/2017;698090388822000;"Lutfia Y.K. Nasib Alamri, SE";"DISNAKERTRANS PROP. GORONTALO / JL AGUS SALIM RT 001 RW 001 DULALOWO KEC KOTA TENGAH KOTA GORONTALO";23339589;2333961;0;0;0;0;0;0;31550
LT;698090388822000;"Lutfia Y.K. Nasib Alamri, SE";-;-;-;0;0;-;-;-;-;-;-
OF;PP0225;"Asta-Spa Set Promo Diskon 25%";441800;12;5301600;0;4819636;481964;0;0
OF;PP0221;"HF Glucosefit Promo (Buy 2 Get 1)";346625;10;3466250;0;3151136;315114;0;0
OF;PP0219;"HF Pureway-C Promo (Buy 2 Get 1 Legres)";129250;8;1034000;0;940000;94000;0;0
OF;MT0145;"Catalog Vol. 3 Th 2017 (50 pcs)";310000;1;310000;0;281818;28182;0;0
OF;PP0215;"Sistocare Promo (Buy 2 Get 1)";256620;10;2566200;0;2332909;233291;0;0
OF;PP0218;"Biorate Promo (Gratis Legres)";246750;10;2467500;0;2243182;224318;0;0
OF;NT020015;Curcomplex95;540500;10;5405000;0;4913636;491364;0;0
OF;NT020006;"Echina-C Plus";154160;5;770800;0;700727;70073;0;0
OF;HF060011;"HF Salmon Oil 30s";111860;10;1118600;0;1016909;101691;0;0
OF;HF0014;"HF Coformula 30s";323360;10;3233600;0;2939636;293964;0;0
FK;01;0;0171735730949;7;2017;31/07/2017;674087382114000;"IDA FENNY ELYSA";"JL. DEBLOD SUNDORO NO. 41 LK. II";5079418;507942;0;0;0;0;0;0;31552
LT;674087382114000;"IDA FENNY ELYSA";-;-;-;0;0;-;-;-;-;-;-
OF;PP0187;"Antioxidant Life Promo (Gratis Magozai 375 ml)";1378040;2;2756080;0;2505527;250553;0;0
OF;NT020011;Asta-Gen;253800;3;761400;0;692182;69218;0;0
OF;PP0224;"Astaderm Set Promo (Gratis Asta Spa Body Serum)";501960;3;1505880;0;1368982;136898;0;0
OF;PP0220;"HF Salmon Oil 90s Promo (Buy 2 Get 1 Salmon 30s)";282000;2;564000;0;512727;51273;0;0
FK;01;0;0171735730987;7;2017;31/07/2017;082738550831000;"Harun D. Tumbuan";"Komplek RSD Madani No.19 Kota Palu Sualwesi Tengah";1238236;123823;0;0;0;0;0;0;31590
LT;082738550831000;"Harun D. Tumbuan";-;-;-;0;0;-;-;-;-;-;-
OF;NT020001;Legres;125020;10;1250200;0;1136545;113654;0;0
OF;HF060011;"HF Salmon Oil 30s";111860;1;111860;0;101691;10169;0;0
FK;01;0;0171735730993;7;2017;31/07/2017;674087382114000;"IDA FENNY ELYSA";"JL. DEBLOD SUNDORO NO. 41 LK. II";3712573;371257;0;0;0;0;0;0;31596
LT;674087382114000;"IDA FENNY ELYSA";-;-;-;0;0;-;-;-;-;-;-
OF;PP080108;"Antioxidant Plus Pack";1249260;3;3747780;0;3407073;340707;0;0
OF;PP0214;"Legalon Promo (Gratis Legres)";336050;1;336050;0;305500;30550;0;0
FK;01;0;0171735731007;7;2017;31/07/2017;698090388822000;"Lutfia Y.K. Nasib Alamri, SE";"DISNAKERTRANS PROP. GORONTALO / JL AGUS SALIM RT 001 RW 001 DULALOWO KEC KOTA TENGAH KOTA GORONTALO";393945;39394;0;0;0;0;0;0;31607
LT;698090388822000;"Lutfia Y.K. Nasib Alamri, SE";-;-;-;0;0;-;-;-;-;-;-
OF;NT020019;"Renewskin 30";216670;2;433340;0;393945;39394;0;0
