0SP201811090033059008 00030331               00000000450669459.0000445BCA               BONUS MEMBER000000OKTOBER 2018000000                                                                             
17685051231                        00000000002449715.00A YUDI JAYA MUSRADHY P                                                                   BONUS MEMBER      OKTOBER 2018                        014
13880409866                        00000000000124401.00ACHMAD YUSUF DR SPKK                                                                     BONUS MEMBER      OKTOBER 2018                        014
17800150625                        00000000000051502.00ADELEIDA JULIA WINOWATAN                                                                 BONUS MEMBER      OKTOBER 2018                        014
18375024035                        00000000000051502.00ADI ADON SIHOMBING                                                                       BONUS MEMBER      OKTOBER 2018                        014
10431086696                        00000000000323301.00ADIJATI HASAN                                                                            BONUS MEMBER      OKTOBER 2018                        014
17910573050                        00000000000429477.00ADRYAN FRISTIOHADI MSC-A                                                                 BONUS MEMBER      OKTOBER 2018                        014
18295036172                        00000000000051779.00AGLEN RUMANGKANG                                                                         BONUS MEMBER      OKTOBER 2018                        014
12160019363                        00000000001605588.00AGNES MAGDALENA EFFENDY                                                                  BONUS MEMBER      OKTOBER 2018                        014
12018020870                        00000000000078207.00AGUS CIPTOSANTOSO N                                                                      BONUS MEMBER      OKTOBER 2018                        014
10510466951                        00000000000461129.00AGUS RIANTO                                                                              BONUS MEMBER      OKTOBER 2018                        014
17360166532                        00000000001667312.00AGUS RINI SULISTIOWATY                                                                   BONUS MEMBER      OKTOBER 2018                        014
16665052579                        00000000000069894.00AGUSTINA EKA BUDI                                                                        BONUS MEMBER      OKTOBER 2018                        014
11271177335                        00000000000062803.00AITJE                                                                                    BONUS MEMBER      OKTOBER 2018                        014
10290244889                        00000000000573770.00ALBERT THERIONO.LIM                                                                      BONUS MEMBER      OKTOBER 2018                        014
14582204377                        00000000000332344.00ALDO LAMMY                                                                               BONUS MEMBER      OKTOBER 2018                        014
12581605007                        00000000000239133.00ALFRYATI VENTHY SANDA SAU TAN                                                            BONUS MEMBER      OKTOBER 2018                        014
14130329727                        00000000000052553.00AMELIA TEDDY                                                                             BONUS MEMBER      OKTOBER 2018                        014
12851104242                        00000000000139454.00AMIN SUMA                                                                                BONUS MEMBER      OKTOBER 2018                        014
16265019343                        00000000000063851.00ANA SUSILOWATI SE                                                                        BONUS MEMBER      OKTOBER 2018                        014
13082086479                        00000000000167641.00ANDI SUBIYANTORO                                                                         BONUS MEMBER      OKTOBER 2018                        014
10270948880                        00000000000074692.00ANDRE ABENG                                                                              BONUS MEMBER      OKTOBER 2018                        014
12580696158                        00000000000343880.00ANDREAS                                                                                  BONUS MEMBER      OKTOBER 2018                        014
16120114211                        00000000000089381.00ANDREAS NATA SUPU                                                                        BONUS MEMBER      OKTOBER 2018                        014
17700042485                        00000000000070279.00ANDRINAJU TEDJO                                                                          BONUS MEMBER      OKTOBER 2018                        014
11821922238                        00000000000220800.00ANG MARINA ARYATI S                                                                      BONUS MEMBER      OKTOBER 2018                        014
18690593301                        00000000000071693.00ANITA JAMALUDIN SE                                                                       BONUS MEMBER      OKTOBER 2018                        014
12881352127                        00000000000074104.00ANNA MAGDALENA                                                                           BONUS MEMBER      OKTOBER 2018                        014
10110279906                        00000000000062803.00ANNA TANJUNG                                                                             BONUS MEMBER      OKTOBER 2018                        014
16720068379                        00000000000303062.00ANNA TRISULA AL LO TJIOE                                                                 BONUS MEMBER      OKTOBER 2018                        014
15390012979                        00000000000074104.00ANTON MULIA                                                                              BONUS MEMBER      OKTOBER 2018                        014
10320912555                        00000000000200136.00ANTONY FIRGO IR                                                                          BONUS MEMBER      OKTOBER 2018                        014
11070546821                        00000000000051502.00ANY WIDIASTUTI                                                                           BONUS MEMBER      OKTOBER 2018                        014
11970182825                        00000000000074104.00ARIANNY BUDIMAN SH                                                                       BONUS MEMBER      OKTOBER 2018                        014
16430050662                        00000000000097733.00ARIFIN CHANDRA                                                                           BONUS MEMBER      OKTOBER 2018                        014
14050227427                        00000000001974758.00ARIS YULIANTO                                                                            BONUS MEMBER      OKTOBER 2018                        014
15890016750                        00000000000051502.00ATI BINARTI                                                                              BONUS MEMBER      OKTOBER 2018                        014
13909519772                        00000000000204085.00BASRI                                                                                    BONUS MEMBER      OKTOBER 2018                        014
16720267827                        00000000001019404.00BELLA SIMONSEN                                                                           BONUS MEMBER      OKTOBER 2018                        014
15060095398                        00000000000201546.00BUDHY SUTANTO.IR                                                                         BONUS MEMBER      OKTOBER 2018                        014
14641121589                        00000000000197007.00BUDI HARTONO                                                                             BONUS MEMBER      OKTOBER 2018                        014
10103448899                        00000000000240345.00CALVIN ALEXANDER EFANS J                                                                 BONUS MEMBER      OKTOBER 2018                        014
11500535128                        00000000000082252.00CECILIA SWANDAYANI                                                                       BONUS MEMBER      OKTOBER 2018                        014
13691033021                        00000000001281716.00CHARLIE BUDIMAN SH                                                                       BONUS MEMBER      OKTOBER 2018                        014
14710032497                        00000000002269778.00CHARLOTHA PUTRI SHARON                                                                   BONUS MEMBER      OKTOBER 2018                        014
10262469075                        00000000000051502.00CHINTYA SALU                                                                             BONUS MEMBER      OKTOBER 2018                        014
12540401601                        00000000001166950.00CHRISTIANUS A.DWIDO                                                                      BONUS MEMBER      OKTOBER 2018                        014
18290353735                        00000000000069464.00CHRISTIEN GUNAWAN                                                                        BONUS MEMBER      OKTOBER 2018                        014
10650213742                        00000000000105353.00CINDINIA TANUWIDJAJA                                                                     BONUS MEMBER      OKTOBER 2018                        014
12540095739                        00000000000177242.00CORINA LUCHAS                                                                            BONUS MEMBER      OKTOBER 2018                        014
18050030734                        00000000000130606.00CORNELIA CHANDRA BSC                                                                     BONUS MEMBER      OKTOBER 2018                        014
11710941510                        00000000000178645.00CORNELLYA KANDARY                                                                        BONUS MEMBER      OKTOBER 2018                        014
10430970968                        00000000000940047.00CUT ZAKIA PUTRI FANDANI                                                                  BONUS MEMBER      OKTOBER 2018                        014
10101676888                        00000000000055819.00DAISY HAKSARINI                                                                          BONUS MEMBER      OKTOBER 2018                        014
18585131683                        00000000000934313.00DAMARIS TIKU                                                                             BONUS MEMBER      OKTOBER 2018                        014
13451721435                        00000000000055819.00DAMAYANTI                                                                                BONUS MEMBER      OKTOBER 2018                        014
11630357205                        00000000000473173.00DARMAWAN TEDJA                                                                           BONUS MEMBER      OKTOBER 2018                        014
17920315482                        00000000000413897.00DARUSMAN M LAMANGKAU SE                                                                  BONUS MEMBER      OKTOBER 2018                        014
17920847051                        00000000000157702.00DARWINI ALYAH AULIAH                                                                     BONUS MEMBER      OKTOBER 2018                        014
10530160718                        00000000002443125.00DEAN HARRIYANTO SALEH                                                                    BONUS MEMBER      OKTOBER 2018                        014
17935339907                        00000000000096845.00DEBI HOTMARIA SILALAHI                                                                   BONUS MEMBER      OKTOBER 2018                        014
17890068582                        00000000001279809.00DEDENG DESRIADI A                                                                        BONUS MEMBER      OKTOBER 2018                        014
17800063226                        00000000000051502.00DEIVY MAUKAR                                                                             BONUS MEMBER      OKTOBER 2018                        014
17870482242                        00000000004981593.00DELA MARSELA                                                                             BONUS MEMBER      OKTOBER 2018                        014
17025018966                        00000000000080147.00DELLY MULIARIADI                                                                         BONUS MEMBER      OKTOBER 2018                        014
11192097287                        00000000012027321.00DELVIRA                                                                                  BONUS MEMBER      OKTOBER 2018                        014
10031206609                        00000000000051502.00DESI NATALIA                                                                             BONUS MEMBER      OKTOBER 2018                        014
10041619898                        00000000000569968.00DESY MARIANI                                                                             BONUS MEMBER      OKTOBER 2018                        014
13140282790                        00000000000051461.00DESYE NATALIA MANAFE                                                                     BONUS MEMBER      OKTOBER 2018                        014
17880492262                        00000000000314647.00DEWI HESTYANA                                                                            BONUS MEMBER      OKTOBER 2018                        014
11302095897                        00000000000150200.00DIAN TJAHYARINA                                                                          BONUS MEMBER      OKTOBER 2018                        014
17920178531                        00000000000473922.00DIONISIUS RORI PARENGKUA                                                                 BONUS MEMBER      OKTOBER 2018                        014
16275777661                        00000000000055819.00DJAP SIAU KIAN                                                                           BONUS MEMBER      OKTOBER 2018                        014
18295144994                        00000000001046029.00DR. SYSILIA M.N. KARINDA                                                                 BONUS MEMBER      OKTOBER 2018                        014
11880344559                        00000000000052312.00DRS DIDIEK BUDIHARDJO                                                                    BONUS MEMBER      OKTOBER 2018                        014
11830773718                        00000000000179672.00DWI QHORINUR AKHIM M YAS                                                                 BONUS MEMBER      OKTOBER 2018                        014
11271076644                        00000000000120693.00EDDY WIDJAYA FIRGO                                                                       BONUS MEMBER      OKTOBER 2018                        014
10241104175                        00000000000094595.00EDELTRUDIS RAHAYU WAHYU                                                                  BONUS MEMBER      OKTOBER 2018                        014
18535226802                        00000000000179058.00EFRIDA YULITA MEO SR CLA                                                                 BONUS MEMBER      OKTOBER 2018                        014
11191809942                        00000000000506870.00EKA YULI ASTUTI                                                                          BONUS MEMBER      OKTOBER 2018                        014
17910585325                        00000000000872116.00EKAWATI K                                                                                BONUS MEMBER      OKTOBER 2018                        014
14780061591                        00000000000076401.00ELIA DHARMAWAN LOKANTARA                                                                 BONUS MEMBER      OKTOBER 2018                        014
17560011614                        00000000000117850.00ELISABETH EFENDI                                                                         BONUS MEMBER      OKTOBER 2018                        014
12331649033                        00000000000622616.00ELLYANY SUGIAMAN                                                                         BONUS MEMBER      OKTOBER 2018                        014
10021223785                        00000000000581147.00ELLYJATY SALIM                                                                           BONUS MEMBER      OKTOBER 2018                        014
16610439592                        00000000000096706.00ELYEZER SAMPE                                                                            BONUS MEMBER      OKTOBER 2018                        014
16041046721                        00000000000051502.00EMILY HAPPYWISE                                                                          BONUS MEMBER      OKTOBER 2018                        014
12581563851                        00000000006104758.00EMMY INDRIATY                                                                            BONUS MEMBER      OKTOBER 2018                        014
17830196981                        00000000000054170.00EMMYLIA SUTEDJA                                                                          BONUS MEMBER      OKTOBER 2018                        014
10030168950                        00000000000051502.00ENGGARWATI SARDJONO                                                                      BONUS MEMBER      OKTOBER 2018                        014
15065069935                        00000000002333040.00ENI SUHARTATIK                                                                           BONUS MEMBER      OKTOBER 2018                        014
16800122048                        00000000000105968.00ERNA ENDRIANA                                                                            BONUS MEMBER      OKTOBER 2018                        014
13220160423                        00000000000302280.00ERY PRIHATIN                                                                             BONUS MEMBER      OKTOBER 2018                        014
18600271122                        00000000000256449.00ESLYN R. JABAR                                                                           BONUS MEMBER      OKTOBER 2018                        014
10281796967                        00000000000358117.00ESTER JULIATI SUSANTO                                                                    BONUS MEMBER      OKTOBER 2018                        014
14650374903                        00000000000050214.00ESTER PAULINA KUSLOSARIR                                                                 BONUS MEMBER      OKTOBER 2018                        014
16155020567                        00000000000091764.00ESTER TJENDRAWATI                                                                        BONUS MEMBER      OKTOBER 2018                        014
11300173949                        00000000000111607.00FAISAL TIRTASEWANA                                                                       BONUS MEMBER      OKTOBER 2018                        014
13900223900                        00000000001252169.00FANNY KRISDIANINGSIH                                                                     BONUS MEMBER      OKTOBER 2018                        014
10020046112                        00000000000064987.00FANNY SALIM                                                                              BONUS MEMBER      OKTOBER 2018                        014
14610053063                        00000000000564546.00FELICIA MARTHA SARI                                                                      BONUS MEMBER      OKTOBER 2018                        014
10060230340                        00000000000329701.00FERDYNANDS SAMPE                                                                         BONUS MEMBER      OKTOBER 2018                        014
12020113611                        00000000000108005.00FEYLIOLIDA                                                                               BONUS MEMBER      OKTOBER 2018                        014
10292188739                        00000000000051861.00FHOBIE CLAUDIA                                                                           BONUS MEMBER      OKTOBER 2018                        014
10530021327                        00000000000059101.00FIENCE CHANDRA                                                                           BONUS MEMBER      OKTOBER 2018                        014
10533555222                        00000000000056838.00FILIE JULIET KARINDA                                                                     BONUS MEMBER      OKTOBER 2018                        014
17970003651                        00000000002249666.00FITRIYANTI RASYID                                                                        BONUS MEMBER      OKTOBER 2018                        014
11601111891                        00000000000051502.00FLORENCE VALENTIA                                                                        BONUS MEMBER      OKTOBER 2018                        014
18190156967                        00000000000051502.00FRANKY YULISTIAN                                                                         BONUS MEMBER      OKTOBER 2018                        014
10491569688                        00000000032959058.00FRANSISKUS YANNO SOERATMAN                                                               BONUS MEMBER      OKTOBER 2018                        014
12670136178                        00000000000131528.00GINO GEORGIO SOENTPIET                                                                   BONUS MEMBER      OKTOBER 2018                        014
15875108902                        00000000000062803.00GLENNIS WIDRA SHINTYALOL                                                                 BONUS MEMBER      OKTOBER 2018                        014
10870065515                        00000000000128116.00GO MEYER GAUTAMA                                                                         BONUS MEMBER      OKTOBER 2018                        014
10831144199                        00000000000070618.00GO SUZY                                                                                  BONUS MEMBER      OKTOBER 2018                        014
10108377888                        00000000000088111.00GRESCE KATALINA                                                                          BONUS MEMBER      OKTOBER 2018                        014
12580127617                        00000000000074104.00GUNADI WIBOWO TOEMALI, DRS                                                               BONUS MEMBER      OKTOBER 2018                        014
15610136615                        00000000000194786.00H SUBKHAN DRS                                                                            BONUS MEMBER      OKTOBER 2018                        014
12902982818                        00000000000052165.00H. FINNI YUDI ARSONO                                                                     BONUS MEMBER      OKTOBER 2018                        014
17260909546                        00000000001421278.00HADI SOEDJAJA PRAMONO                                                                    BONUS MEMBER      OKTOBER 2018                        014
17670410468                        00000000000161080.00HALARI INSAN IHSANI                                                                      BONUS MEMBER      OKTOBER 2018                        014
13830622330                        00000000000104950.00HAMDA,SH                                                                                 BONUS MEMBER      OKTOBER 2018                        014
13900389212                        00000000000516336.00HAMSIAH SANGKALA                                                                         BONUS MEMBER      OKTOBER 2018                        014
15370095665                        00000000000074104.00HANDONO RISETO                                                                           BONUS MEMBER      OKTOBER 2018                        014
17920451742                        00000000000909763.00HANIFA                                                                                   BONUS MEMBER      OKTOBER 2018                        014
17570037697                        00000000000175155.00HANNA KUSNADI                                                                            BONUS MEMBER      OKTOBER 2018                        014
10262244251                        00000000003230751.00HANNA SILVANNA MANONGKO                                                                  BONUS MEMBER      OKTOBER 2018                        014
11451329036                        00000000000051502.00HAPPY SIRINGORINGO                                                                       BONUS MEMBER      OKTOBER 2018                        014
10291799719                        00000000000295382.00HARI LIEWARNATA IR MM                                                                    BONUS MEMBER      OKTOBER 2018                        014
15120243278                        00000000000168848.00HARIYANTO SUSILO                                                                         BONUS MEMBER      OKTOBER 2018                        014
11611191079                        00000000000051502.00HARTATI BUDIMAN                                                                          BONUS MEMBER      OKTOBER 2018                        014
17795019669                        00000000003205454.00HARUN D. TUMBUAN                                                                         BONUS MEMBER      OKTOBER 2018                        014
15930411967                        00000000000682973.00HASAN                                                                                    BONUS MEMBER      OKTOBER 2018                        014
17870016845                        00000000000919070.00HASNAH                                                                                   BONUS MEMBER      OKTOBER 2018                        014
17685089955                        00000000001396867.00HASNIH S                                                                                 BONUS MEMBER      OKTOBER 2018                        014
10840582256                        00000000000055819.00HELEN WIDJAJA                                                                            BONUS MEMBER      OKTOBER 2018                        014
10210293884                        00000000000422052.00HENDARTO SANTOSO                                                                         BONUS MEMBER      OKTOBER 2018                        014
10410873621                        00000000000053686.00HENDRI                                                                                   BONUS MEMBER      OKTOBER 2018                        014
11271073378                        00000000000120620.00HENNY ISKANDAR                                                                           BONUS MEMBER      OKTOBER 2018                        014
16140200440                        00000000000102476.00HENNY PUSPAWATI SE                                                                       BONUS MEMBER      OKTOBER 2018                        014
17925295591                        00000000000155050.00HENNY SUSANTI                                                                            BONUS MEMBER      OKTOBER 2018                        014
17890145552                        00000000000220773.00HENNY TOLOKENDE DRA                                                                      BONUS MEMBER      OKTOBER 2018                        014
18585064722                        00000000000051502.00HERIYANE YANCAR ARUS                                                                     BONUS MEMBER      OKTOBER 2018                        014
10880652192                        00000000000600070.00HERLIN YUNARA                                                                            BONUS MEMBER      OKTOBER 2018                        014
13650261258                        00000000000285877.00HERLINA H.                                                                               BONUS MEMBER      OKTOBER 2018                        014
12731206963                        00000000000059253.00HERMALINDA R PANJAITAN A                                                                 BONUS MEMBER      OKTOBER 2018                        014
12903845619                        00000000000165714.00HERMAN AMIL S HUT                                                                        BONUS MEMBER      OKTOBER 2018                        014
13891003810                        00000000000060701.00HERMAN SUSANTO                                                                           BONUS MEMBER      OKTOBER 2018                        014
17920181222                        00000000000102796.00HESTY YULIANA                                                                            BONUS MEMBER      OKTOBER 2018                        014
12531229535                        00000000000054422.00HIDAJAT  TJAHJADI                                                                        BONUS MEMBER      OKTOBER 2018                        014
10271975031                        00000000000104529.00HJ CORNELIA                                                                              BONUS MEMBER      OKTOBER 2018                        014
17920383445                        00000000000103325.00HJ. MAYA MALANIA NOOR-IR-MTP                                                             BONUS MEMBER      OKTOBER 2018                        014
17160038327                        00000000001268789.00HJ. NETTY NASIR                                                                          BONUS MEMBER      OKTOBER 2018                        014
10210694960                        00000000000307631.00HUDIJAH                                                                                  BONUS MEMBER      OKTOBER 2018                        014
11191707121                        00000000000386564.00HUSAIRI NATILA                                                                           BONUS MEMBER      OKTOBER 2018                        014
10291362418                        00000000002309793.00IMACULATA KORNIA                                                                         BONUS MEMBER      OKTOBER 2018                        014
11981615498                        00000000000619767.00IMANUEL ADAM                                                                             BONUS MEMBER      OKTOBER 2018                        014
11440327261                        00000000000055819.00IMELDA ESTER MARLINDA S                                                                  BONUS MEMBER      OKTOBER 2018                        014
11990862482                        00000000000102161.00IMELDA LILYANA LOLON                                                                     BONUS MEMBER      OKTOBER 2018                        014
12460330001                        00000000009400187.00INAVIANTI WINARTO                                                                        BONUS MEMBER      OKTOBER 2018                        014
12560098696                        00000000001168030.00INDAH CITRA DEWI SUCITRO                                                                 BONUS MEMBER      OKTOBER 2018                        014
12151750500                        00000000000498145.00INDRAJATI SRIRAHAJU                                                                      BONUS MEMBER      OKTOBER 2018                        014
15880209959                        00000000016210794.00INDRIYATI SALIM                                                                          BONUS MEMBER      OKTOBER 2018                        014
14260366811                        00000000000277303.00INGE H S / THEO A D                                                                      BONUS MEMBER      OKTOBER 2018                        014
10884771397                        00000000000109949.00INGGRIATI DJOJOSEPUTRO D                                                                 BONUS MEMBER      OKTOBER 2018                        014
17970025752                        00000000000052553.00IR M SYARIF SAREBONG                                                                     BONUS MEMBER      OKTOBER 2018                        014
11340719227                        00000000000083949.00IRAWAN                                                                                   BONUS MEMBER      OKTOBER 2018                        014
13650265482                        00000000000109274.00IRAWATI                                                                                  BONUS MEMBER      OKTOBER 2018                        014
15270747762                        00000000000156942.00IRENE KARYADI                                                                            BONUS MEMBER      OKTOBER 2018                        014
14731036971                        00000000000104852.00IRSI HAMYUSERUNI HAMID                                                                   BONUS MEMBER      OKTOBER 2018                        014
14643157040                        00000000000126218.00IRUM SPRM DR                                                                             BONUS MEMBER      OKTOBER 2018                        014
16465093840                        00000000000115920.00IRWAN HARIYADI                                                                           BONUS MEMBER      OKTOBER 2018                        014
10411222038                        00000000000386492.00ITA PRITASARI                                                                            BONUS MEMBER      OKTOBER 2018                        014
14260283699                        00000000000063191.00IVAN HUBAYA                                                                              BONUS MEMBER      OKTOBER 2018                        014
15750330861                        00000000000072940.00IVONNE                                                                                   BONUS MEMBER      OKTOBER 2018                        014
15190075771                        00000000000062803.00JAHJA SUTRISNO                                                                           BONUS MEMBER      OKTOBER 2018                        014
17360297734                        00000000000203988.00JAMALLUDIN                                                                               BONUS MEMBER      OKTOBER 2018                        014
16795003766                        00000000000051502.00JANE SUSAN GANSALANGI                                                                    BONUS MEMBER      OKTOBER 2018                        014
17800358706                        00000000000050234.00JANS DEBORA RITA TOMPODUNG                                                               BONUS MEMBER      OKTOBER 2018                        014
10030200101                        00000000000495259.00JANTI W                                                                                  BONUS MEMBER      OKTOBER 2018                        014
11020458883                        00000000000056546.00JENNIANA SINDUNATA                                                                       BONUS MEMBER      OKTOBER 2018                        014
18290401764                        00000000000849233.00JISRIEL YABES SAMENE                                                                     BONUS MEMBER      OKTOBER 2018                        014
13570208569                        00000000000105628.00JOENG CHINTYA DEWI                                                                       BONUS MEMBER      OKTOBER 2018                        014
10181090234                        00000000001147588.00JOHANNES PUTRA MAYNINEDO                                                                 BONUS MEMBER      OKTOBER 2018                        014
18235066633                        00000000000074104.00JOLIANA                                                                                  BONUS MEMBER      OKTOBER 2018                        014
12481565989                        00000000000108005.00JOSEPHA HADIPRANOTO                                                                      BONUS MEMBER      OKTOBER 2018                        014
11781176392                        00000000000153291.00JOUSJE ADAM                                                                              BONUS MEMBER      OKTOBER 2018                        014
11681694248                        00000000000746831.00JUANITA ICHSANI                                                                          BONUS MEMBER      OKTOBER 2018                        014
12910359331                        00000000000074104.00JULIANA KULLIT                                                                           BONUS MEMBER      OKTOBER 2018                        014
10016099168                        00000000000051502.00JULIANA TJONDRO                                                                          BONUS MEMBER      OKTOBER 2018                        014
10261551984                        00000000000061678.00JULIETTA I L L GERUNG DR                                                                 BONUS MEMBER      OKTOBER 2018                        014
13631454559                        00000000000051502.00JUNAIDI ANDIKA                                                                           BONUS MEMBER      OKTOBER 2018                        014
10870842562                        00000000000108538.00JUNI PANTJAWATI SUTANTO                                                                  BONUS MEMBER      OKTOBER 2018                        014
13140404143                        00000000001164864.00JUNIANA NALLEY KALEBU                                                                    BONUS MEMBER      OKTOBER 2018                        014
10885727030                        00000000001042186.00KALEB YEREMIA YUNIOR KOR                                                                 BONUS MEMBER      OKTOBER 2018                        014
10420075537                        00000000000052351.00KASIM ISHAK                                                                              BONUS MEMBER      OKTOBER 2018                        014
10710040915                        00000000000129436.00KENNETH RAY VICI LENGKON                                                                 BONUS MEMBER      OKTOBER 2018                        014
12530000616                        00000000000051502.00KHAIRIAH NUROCTAVIANI                                                                    BONUS MEMBER      OKTOBER 2018                        014
12620007202                        00000000000390518.00KIKIE HARDI                                                                              BONUS MEMBER      OKTOBER 2018                        014
16395132800                        00000000000051502.00KITHARA PURNAMAWATY N                                                                    BONUS MEMBER      OKTOBER 2018                        014
12211227763                        00000000000108005.00KONNI M TAMBUNAN                                                                         BONUS MEMBER      OKTOBER 2018                        014
12700086081                        00000000000051502.00KRISTIANI UTOMO                                                                          BONUS MEMBER      OKTOBER 2018                        014
13351008073                        00000000000074104.00KRISTINA                                                                                 BONUS MEMBER      OKTOBER 2018                        014
18615019433                        00000000000243611.00KUMALA DEWI                                                                              BONUS MEMBER      OKTOBER 2018                        014
10051005120                        00000000000147484.00LANIANA WULANDARI GUNAWAN                                                                BONUS MEMBER      OKTOBER 2018                        014
17880132037                        00000000000347202.00LANY MANDANG                                                                             BONUS MEMBER      OKTOBER 2018                        014
10410949768                        00000000000515492.00LELI MARULISARI                                                                          BONUS MEMBER      OKTOBER 2018                        014
17245104081                        00000000002188910.00LENY UMAR                                                                                BONUS MEMBER      OKTOBER 2018                        014
17920015993                        00000000000057452.00LESLY WISYE                                                                              BONUS MEMBER      OKTOBER 2018                        014
13971165357                        00000000000197069.00LIAN BIE HUI                                                                             BONUS MEMBER      OKTOBER 2018                        014
12871470865                        00000000000070233.00LIAN BIE KIEM                                                                            BONUS MEMBER      OKTOBER 2018                        014
11710704364                        00000000000051502.00LIBERTUS PERONAL H                                                                       BONUS MEMBER      OKTOBER 2018                        014
15060026981                        00000000001112138.00LIE AY HWA                                                                               BONUS MEMBER      OKTOBER 2018                        014
10090888919                        00000000000108102.00LIEM ENG MEI                                                                             BONUS MEMBER      OKTOBER 2018                        014
10880370006                        00000000000128802.00LIEM LINDAWATI MASAJU                                                                    BONUS MEMBER      OKTOBER 2018                        014
15780511526                        00000000000070243.00LILI YANA                                                                                BONUS MEMBER      OKTOBER 2018                        014
17540460269                        00000000000622325.00LILIANY WIJAYA                                                                           BONUS MEMBER      OKTOBER 2018                        014
12520230231                        00000000000238034.00LILIK SUSIANI SUTEDJO                                                                    BONUS MEMBER      OKTOBER 2018                        014
11710479824                        00000000000187033.00LILIK YUNIATI                                                                            BONUS MEMBER      OKTOBER 2018                        014
16240522720                        00000000000093727.00LILY CHRISTINA                                                                           BONUS MEMBER      OKTOBER 2018                        014
12762222222                        00000000009197971.00LILY NGADIMAN                                                                            BONUS MEMBER      OKTOBER 2018                        014
17795143955                        00000000004331190.00LINDA                                                                                    BONUS MEMBER      OKTOBER 2018                        014
10490010009                        00000000000070233.00LINDA PUSPA DEWI                                                                         BONUS MEMBER      OKTOBER 2018                        014
10272058839                        00000000000161733.00LINDA WATI TAMBERIN                                                                      BONUS MEMBER      OKTOBER 2018                        014
13891007173                        00000000000051502.00LO FANNY LISTIAWATY                                                                      BONUS MEMBER      OKTOBER 2018                        014
10281828478                        00000000000091612.00LOLITA PATRICIA CHANDRA                                                                  BONUS MEMBER      OKTOBER 2018                        014
17570069858                        00000000000140966.00LOUISA SUSIANA HAKIM                                                                     BONUS MEMBER      OKTOBER 2018                        014
10094680090                        00000000000066295.00LUCIA LANDRIATI                                                                          BONUS MEMBER      OKTOBER 2018                        014
10270423981                        00000000000071478.00LUSIANI RATNA MINAYARTI                                                                  BONUS MEMBER      OKTOBER 2018                        014
16600191614                        00000000000053787.00LUSY HERLISYE HAHIYARI                                                                   BONUS MEMBER      OKTOBER 2018                        014
13091167300                        00000000000051502.00LUSY SETIAWAN                                                                            BONUS MEMBER      OKTOBER 2018                        014
17975271188                        00000000001125160.00LUTFIA Y. K. NASIB ALAMR                                                                 BONUS MEMBER      OKTOBER 2018                        014
18620235661                        00000000001639315.00LYDIANA DEWI EFFENDY                                                                     BONUS MEMBER      OKTOBER 2018                        014
18160408007                        00000000000108863.00MAGDALANI SANTOSO                                                                        BONUS MEMBER      OKTOBER 2018                        014
14281621569                        00000000000246866.00MAGDALENA KUSNADI                                                                        BONUS MEMBER      OKTOBER 2018                        014
11410251236                        00000000000117123.00MAGDALENA NANIK S                                                                        BONUS MEMBER      OKTOBER 2018                        014
17895042617                        00000000000074737.00MAHMUDAH MAHMUD                                                                          BONUS MEMBER      OKTOBER 2018                        014
16460077212                        00000000000210083.00MAN LING HIDAYAT                                                                         BONUS MEMBER      OKTOBER 2018                        014
18190339344                        00000000000300877.00MANUELLA ARTAWATY PURBA                                                                  BONUS MEMBER      OKTOBER 2018                        014
11630440757                        00000000000051502.00MARCELINUS                                                                               BONUS MEMBER      OKTOBER 2018                        014
12851153031                        00000000000626471.00MARGARETH STEFANNY WINATA                                                                BONUS MEMBER      OKTOBER 2018                        014
10260829971                        00000000006848794.00MARIA BEATRIX LUNTUNGAN                                                                  BONUS MEMBER      OKTOBER 2018                        014
10251360129                        00000000000080147.00MARIA ROSALINA TANNUS                                                                    BONUS MEMBER      OKTOBER 2018                        014
11981075418                        00000000000292373.00MARINA JUWITA HARDIMAN                                                                   BONUS MEMBER      OKTOBER 2018                        014
10031555999                        00000000000341552.00MARIO RENDY NGADIMAN                                                                     BONUS MEMBER      OKTOBER 2018                        014
10292155075                        00000000002015707.00MARISA CAROLINA TEDJA                                                                    BONUS MEMBER      OKTOBER 2018                        014
17870508527                        00000000008751048.00MARLENGGA                                                                                BONUS MEMBER      OKTOBER 2018                        014
14650268356                        00000000007107432.00MARSUDI                                                                                  BONUS MEMBER      OKTOBER 2018                        014
11850513828                        00000000000176181.00MARTA CHENDRA                                                                            BONUS MEMBER      OKTOBER 2018                        014
11520325049                        00000000000344327.00MARTHEN CAREL KORWA                                                                      BONUS MEMBER      OKTOBER 2018                        014
16705015990                        00000000000122965.00MARTINA                                                                                  BONUS MEMBER      OKTOBER 2018                        014
16610493350                        00000000000228527.00MARTINUS B. PALAMBA                                                                      BONUS MEMBER      OKTOBER 2018                        014
13991504689                        00000000000115765.00MARTONO CHONDRODIHARDJO                                                                  BONUS MEMBER      OKTOBER 2018                        014
17795044337                        00000000000743273.00MARWAN AMIR                                                                              BONUS MEMBER      OKTOBER 2018                        014
14870038254                        00000000000062803.00MARYANA                                                                                  BONUS MEMBER      OKTOBER 2018                        014
10640167297                        00000000000856218.00MEDYAWATI LIMANTARA DRG                                                                  BONUS MEMBER      OKTOBER 2018                        014
11190435969                        00000000000104569.00MEGAWATI EMERENTIANA OH                                                                  BONUS MEMBER      OKTOBER 2018                        014
16225011140                        00000000000096243.00MEIDARI UTAMI                                                                            BONUS MEMBER      OKTOBER 2018                        014
17160069281                        00000000002620953.00MELAWATY ABYANI                                                                          BONUS MEMBER      OKTOBER 2018                        014
10883225888                        00000000000101535.00MELI WIDJAJA                                                                             BONUS MEMBER      OKTOBER 2018                        014
17830404788                        00000000000051502.00MELIA FRIDA SANTOSO                                                                      BONUS MEMBER      OKTOBER 2018                        014
10884820207                        00000000000185815.00MELYSA YULIANA                                                                           BONUS MEMBER      OKTOBER 2018                        014
14411287399                        00000000000111627.00MERIAM SELONITA SAMBO                                                                    BONUS MEMBER      OKTOBER 2018                        014
11510310442                        00000000000084628.00MERIYANTI                                                                                BONUS MEMBER      OKTOBER 2018                        014
13140045488                        00000000002320155.00MERRY SIANTO                                                                             BONUS MEMBER      OKTOBER 2018                        014
11710716788                        00000000001709253.00MERVYN                                                                                   BONUS MEMBER      OKTOBER 2018                        014
10210293175                        00000000000371725.00METRY WIDJAJA KOHAR                                                                      BONUS MEMBER      OKTOBER 2018                        014
13053007500                        00000000008448389.00MEYLIA                                                                                   BONUS MEMBER      OKTOBER 2018                        014
13091237642                        00000000000075510.00MIKHAEL YONAS                                                                            BONUS MEMBER      OKTOBER 2018                        014
16720254865                        00000000000050856.00MIMIEN SUTASMINI PRAHASTYAS                                                              BONUS MEMBER      OKTOBER 2018                        014
12752058912                        00000000000179064.00MINARNI KOMALA SARI                                                                      BONUS MEMBER      OKTOBER 2018                        014
13841386858                        00000000000132413.00MINARTI                                                                                  BONUS MEMBER      OKTOBER 2018                        014
12741034559                        00000000002741435.00MIRA REBEKA SANI                                                                         BONUS MEMBER      OKTOBER 2018                        014
12308061090                        00000000000939821.00MIRNA SAMPE                                                                              BONUS MEMBER      OKTOBER 2018                        014
14010273841                        00000000000074492.00MODESTA SANTI DEVIYANTI                                                                  BONUS MEMBER      OKTOBER 2018                        014
11102142734                        00000000000051502.00MOEH DAVID ARITANTO                                                                      BONUS MEMBER      OKTOBER 2018                        014
17970228947                        00000000000235400.00MUFTIHATURRAHMAH BURHAMZ                                                                 BONUS MEMBER      OKTOBER 2018                        014
10255703604                        00000000000050694.00MUH SUDITYO ASRI                                                                         BONUS MEMBER      OKTOBER 2018                        014
10255460574                        00000000000913280.00MUH. KADIR                                                                               BONUS MEMBER      OKTOBER 2018                        014
17920781742                        00000000000288697.00MUHAMMAD HILMI MARWAN                                                                    BONUS MEMBER      OKTOBER 2018                        014
13900237382                        00000000000450711.00MUHAMMAD NAIM ZAIN                                                                       BONUS MEMBER      OKTOBER 2018                        014
12356734685                        00000000000154108.00MUHAMMAD NURAGUNG AULANI AZHARI                                                          BONUS MEMBER      OKTOBER 2018                        014
10331953694                        00000000000052788.00MUHIMMAH                                                                                 BONUS MEMBER      OKTOBER 2018                        014
13860011858                        00000000000074104.00MULIANA                                                                                  BONUS MEMBER      OKTOBER 2018                        014
10771035891                        00000000000070301.00NANIEK BUDHI DARMAWATI                                                                   BONUS MEMBER      OKTOBER 2018                        014
15210746023                        00000000000236400.00NATALIA DEASY ARYANTI UT                                                                 BONUS MEMBER      OKTOBER 2018                        014
18295145141                        00000000000051502.00NELLY RORI                                                                               BONUS MEMBER      OKTOBER 2018                        014
10653453890                        00000000000147537.00NILAWATI"BDN RATU PRATIW                                                                 BONUS MEMBER      OKTOBER 2018                        014
18290171513                        00000000001042132.00NINIK ELSAWATIE                                                                          BONUS MEMBER      OKTOBER 2018                        014
12140629262                        00000000000243527.00NIO MARIA LUISA                                                                          BONUS MEMBER      OKTOBER 2018                        014
10262097011                        00000000000994593.00NONTJE TANGAHU                                                                           BONUS MEMBER      OKTOBER 2018                        014
17920447494                        00000000000113946.00NORMIN KAOSE SE                                                                          BONUS MEMBER      OKTOBER 2018                        014
15210742605                        00000000000420535.00NOVI HANDAYANI                                                                           BONUS MEMBER      OKTOBER 2018                        014
10291480798                        00000000000090238.00NOVIYANTI                                                                                BONUS MEMBER      OKTOBER 2018                        014
12861069356                        00000000000239032.00NUR UTAMI                                                                                BONUS MEMBER      OKTOBER 2018                        014
10221603116                        00000000002095273.00NURFAMI PUTRISARI                                                                        BONUS MEMBER      OKTOBER 2018                        014
11199004598                        00000000000573866.00NURHASANAH HS                                                                            BONUS MEMBER      OKTOBER 2018                        014
10255830223                        00000000000075235.00NURJAYA SH                                                                               BONUS MEMBER      OKTOBER 2018                        014
11941370727                        00000000000166350.00NURLAELA JUMIATI                                                                         BONUS MEMBER      OKTOBER 2018                        014
17640857212                        00000000000945055.00NURUL AZIZAH                                                                             BONUS MEMBER      OKTOBER 2018                        014
15740065124                        00000000000074104.00NY THERESIANA SANTI                                                                      BONUS MEMBER      OKTOBER 2018                        014
11781051361                        00000000000090390.00NY.DARMAJANTI/CHRISTANTO                                                                 BONUS MEMBER      OKTOBER 2018                        014
17920439246                        00000000000088830.00OCTAVIA NOVA DALY                                                                        BONUS MEMBER      OKTOBER 2018                        014
12853001911                        00000000000739476.00OEI IRENE ANGELINE WIJAY                                                                 BONUS MEMBER      OKTOBER 2018                        014
10353041450                        00000000000067983.00OSBORN BUDIMAN                                                                           BONUS MEMBER      OKTOBER 2018                        014
14681270978                        00000000000070550.00PRASTI ADHI DHARMASANTI DR                                                               BONUS MEMBER      OKTOBER 2018                        014
17800213392                        00000000003319589.00PREISY ANGEL M GOLIOTH S                                                                 BONUS MEMBER      OKTOBER 2018                        014
10479371051                        00000000000237419.00PURNAMASARI SETIAWAN                                                                     BONUS MEMBER      OKTOBER 2018                        014
18220269192                        00000000000063336.00PUSPA INDRAWATI TANG                                                                     BONUS MEMBER      OKTOBER 2018                        014
17435005497                        00000000000050778.00RAHMAT                                                                                   BONUS MEMBER      OKTOBER 2018                        014
17970160625                        00000000003092012.00RAHMITA BURHAMZAH                                                                        BONUS MEMBER      OKTOBER 2018                        014
15271611014                        00000000000060693.00RAIRINNE GRACIA TIWOW                                                                    BONUS MEMBER      OKTOBER 2018                        014
18585016191                        00000000000150187.00RAMAYDA                                                                                  BONUS MEMBER      OKTOBER 2018                        014
10181365764                        00000000000337415.00RATIH PUSPITA SARI                                                                       BONUS MEMBER      OKTOBER 2018                        014
18585004134                        00000000000156171.00RATNA RAHAYUNI                                                                           BONUS MEMBER      OKTOBER 2018                        014
12741009970                        00000000000251694.00RAY LAMMY                                                                                BONUS MEMBER      OKTOBER 2018                        014
15200229527                        00000000000051502.00RAYMOND GIENARDY                                                                         BONUS MEMBER      OKTOBER 2018                        014
11191896063                        00000000000156036.00RETNO ENDAH SUSANTI                                                                      BONUS MEMBER      OKTOBER 2018                        014
17910371635                        00000000000167039.00REZKY ULFA RAHMADANI-R                                                                   BONUS MEMBER      OKTOBER 2018                        014
11391712064                        00000000000160062.00RIA SUHARTI                                                                              BONUS MEMBER      OKTOBER 2018                        014
12020090190                        00000000000051502.00RIADY                                                                                    BONUS MEMBER      OKTOBER 2018                        014
14130158221                        00000000000051502.00RICO RANGEL                                                                              BONUS MEMBER      OKTOBER 2018                        014
17975271081                        00000000000309521.00RIECKY REINALD SOENGE. SP                                                                BONUS MEMBER      OKTOBER 2018                        014
10430953800                        00000000000062803.00RIMALA SHINTA                                                                            BONUS MEMBER      OKTOBER 2018                        014
17910036585                        00000000000144500.00RINA ARIYANIE TAHIR-ST                                                                   BONUS MEMBER      OKTOBER 2018                        014
17880088143                        00000000000249199.00RIRIN RACHMAWATI                                                                         BONUS MEMBER      OKTOBER 2018                        014
14761261686                        00000000000116240.00RIRIS TRIASIH                                                                            BONUS MEMBER      OKTOBER 2018                        014
17920717351                        00000000001847795.00RISDIYANTO                                                                               BONUS MEMBER      OKTOBER 2018                        014
17890885971                        00000000000052458.00RIZAL RAHMAN                                                                             BONUS MEMBER      OKTOBER 2018                        014
17920441119                        00000000006919141.00ROBERTH PARENGKUAN                                                                       BONUS MEMBER      OKTOBER 2018                        014
16110362984                        00000000000065582.00ROEDI WIDYOWANTI                                                                         BONUS MEMBER      OKTOBER 2018                        014
16500322266                        00000000000051502.00ROOSJANY WIDJAJA                                                                         BONUS MEMBER      OKTOBER 2018                        014
15540261549                        00000000000054089.00RR LAKSMI NURHIYANI S                                                                    BONUS MEMBER      OKTOBER 2018                        014
14970287464                        00000000000053003.00RR WIDIASRI PUJI APHINI                                                                  BONUS MEMBER      OKTOBER 2018                        014
12881095361                        00000000000051745.00RULLY ARISCHANDRA                                                                        BONUS MEMBER      OKTOBER 2018                        014
16665050541                        00000000014796170.00RUSIANI                                                                                  BONUS MEMBER      OKTOBER 2018                        014
11410324047                        00000000003223762.00RUTH HANDAYANI DARMAWAN                                                                  BONUS MEMBER      OKTOBER 2018                        014
12581015901                        00000000003065634.00SALIM                                                                                    BONUS MEMBER      OKTOBER 2018                        014
16270097543                        00000000000300908.00SALMA LUBIS                                                                              BONUS MEMBER      OKTOBER 2018                        014
17910170583                        00000000063163373.00SALMIA RODHIYA HUSAINY                                                                   BONUS MEMBER      OKTOBER 2018                        014
10710032971                        00000000000118500.00SAMUEL RAY RICHIE LENGKO                                                                 BONUS MEMBER      OKTOBER 2018                        014
16170407057                        00000000000051502.00SANTOSO                                                                                  BONUS MEMBER      OKTOBER 2018                        014
10291941949                        00000000000103284.00SATYA PUTRI FITRILIA                                                                     BONUS MEMBER      OKTOBER 2018                        014
18985132778                        00000000000051502.00SETIYOWATI DARSONO                                                                       BONUS MEMBER      OKTOBER 2018                        014
11010200209                        00000000002558755.00SETYOTUHU TATIK                                                                          BONUS MEMBER      OKTOBER 2018                        014
16710055155                        00000000000122788.00SHELVY TIRAYO                                                                            BONUS MEMBER      OKTOBER 2018                        014
15550112738                        00000000000228737.00SHERLY EKAWATI                                                                           BONUS MEMBER      OKTOBER 2018                        014
10886017451                        00000000000068839.00SIANNY JANUARWATI BUDIONO                                                                BONUS MEMBER      OKTOBER 2018                        014
10091189304                        00000000000051502.00SISWANTO                                                                                 BONUS MEMBER      OKTOBER 2018                        014
10350602739                        00000000000112569.00SITI MARIYAM                                                                             BONUS MEMBER      OKTOBER 2018                        014
10261390859                        00000000000106113.00SOEN NIO                                                                                 BONUS MEMBER      OKTOBER 2018                        014
16540016265                        00000000000062803.00SONNY CHANDRA                                                                            BONUS MEMBER      OKTOBER 2018                        014
11630316266                        00000000000074110.00SONYA SJOFIAN                                                                            BONUS MEMBER      OKTOBER 2018                        014
10131785762                        00000000000105240.00SRI HENDRADI DANAR WAHYUNINGSIH                                                          BONUS MEMBER      OKTOBER 2018                        014
13221004319                        00000000000050314.00SRI MUNTAMAH                                                                             BONUS MEMBER      OKTOBER 2018                        014
13981000623                        00000000000074104.00SRI SUBEKTI                                                                              BONUS MEMBER      OKTOBER 2018                        014
18020384591                        00000000004132884.00ST BALQIS NURCAHYANI AM                                                                  BONUS MEMBER      OKTOBER 2018                        014
10948187151                        00000000000101798.00STANISLAUS DIDIMUS SILVESTER                                                             BONUS MEMBER      OKTOBER 2018                        014
18295083863                        00000000000201160.00STANLEY ALEXANDER DORING                                                                 BONUS MEMBER      OKTOBER 2018                        014
17920883006                        00000000000611721.00STEFANI BEATRIX                                                                          BONUS MEMBER      OKTOBER 2018                        014
17820054088                        00000000000147726.00STEVEN SETIAWAN                                                                          BONUS MEMBER      OKTOBER 2018                        014
12531230843                        00000000010305654.00STEVIE LENGKONG                                                                          BONUS MEMBER      OKTOBER 2018                        014
18290341583                        00000000000907077.00STEVY                                                                                    BONUS MEMBER      OKTOBER 2018                        014
11191845639                        00000000000060760.00SUGIH SUHARTINI                                                                          BONUS MEMBER      OKTOBER 2018                        014
11010613635                        00000000000119306.00SUHARTI                                                                                  BONUS MEMBER      OKTOBER 2018                        014
17530076380                        00000000000051502.00SUHENDRA SIDHARTA                                                                        BONUS MEMBER      OKTOBER 2018                        014
14281731054                        00000000000077941.00SUHENJANTI SOLAIMAN                                                                      BONUS MEMBER      OKTOBER 2018                        014
10081835956                        00000000000096691.00SUJOKO AH.T                                                                              BONUS MEMBER      OKTOBER 2018                        014
17910249091                        00000000021924626.00SULEMAN MILE                                                                             BONUS MEMBER      OKTOBER 2018                        014
12861012044                        00000000000659484.00SULHANA ARMAINI                                                                          BONUS MEMBER      OKTOBER 2018                        014
11280189983                        00000000000108005.00SUNDARI                                                                                  BONUS MEMBER      OKTOBER 2018                        014
10192243131                        00000000000296127.00SUPRIJANTO                                                                               BONUS MEMBER      OKTOBER 2018                        014
10291726045                        00000000000059660.00SURIANA                                                                                  BONUS MEMBER      OKTOBER 2018                        014
17155008806                        00000000000595178.00SURIANTO                                                                                 BONUS MEMBER      OKTOBER 2018                        014
15700022767                        00000000000083629.00SUSANA                                                                                   BONUS MEMBER      OKTOBER 2018                        014
12540333371                        00000000005206416.00SUSANTI OEY                                                                              BONUS MEMBER      OKTOBER 2018                        014
10291671861                        00000000000559700.00SUSANTI SE                                                                               BONUS MEMBER      OKTOBER 2018                        014
10290977771                        00000000000505060.00SUSANTO                                                                                  BONUS MEMBER      OKTOBER 2018                        014
11410476271                        00000000004797833.00SUZANNA ELLY SENTOSA                                                                     BONUS MEMBER      OKTOBER 2018                        014
10341981041                        00000000000062803.00SYAFRIDA HANUM                                                                           BONUS MEMBER      OKTOBER 2018                        014
14361242143                        00000000000130606.00SYAFRINA                                                                                 BONUS MEMBER      OKTOBER 2018                        014
16465006980                        00000000000051502.00SYARIFAH ELVIA                                                                           BONUS MEMBER      OKTOBER 2018                        014
12581372771                        00000000000160272.00SYLVIE SULISTYOWATI                                                                      BONUS MEMBER      OKTOBER 2018                        014
11530064758                        00000000000051502.00TAMIN KOSASIH                                                                            BONUS MEMBER      OKTOBER 2018                        014
13890236625                        00000000000062415.00TAN SIENG MEY                                                                            BONUS MEMBER      OKTOBER 2018                        014
11881052224                        00000000000186421.00TANG HONG TJIEH                                                                          BONUS MEMBER      OKTOBER 2018                        014
12821503568                        00000000000642598.00TANYA EDWINA BELATUR                                                                     BONUS MEMBER      OKTOBER 2018                        014
18735133019                        00000000000102396.00TAPPE                                                                                    BONUS MEMBER      OKTOBER 2018                        014
13000440701                        00000000000061445.00TAQIYYAH                                                                                 BONUS MEMBER      OKTOBER 2018                        014
13080072162                        00000000006628506.00TEDDY WIJAYAPUTRA                                                                        BONUS MEMBER      OKTOBER 2018                        014
10010455375                        00000000000186138.00TEGUH RIYADI                                                                             BONUS MEMBER      OKTOBER 2018                        014
12465106911                        00000000000062172.00THEO ADHITYA DARMAWAN                                                                    BONUS MEMBER      OKTOBER 2018                        014
12370130909                        00000000000074104.00THERESIA INDRAWATI                                                                       BONUS MEMBER      OKTOBER 2018                        014
10841132423                        00000000000070810.00THERESIA LIANTO                                                                          BONUS MEMBER      OKTOBER 2018                        014
16250247000                        00000000000075510.00THUNG LAN NIE                                                                            BONUS MEMBER      OKTOBER 2018                        014
11030264726                        00000000000165041.00TIEN RATNAWATI                                                                           BONUS MEMBER      OKTOBER 2018                        014
10031705486                        00000000000074104.00TIO TJEN AI                                                                              BONUS MEMBER      OKTOBER 2018                        014
14641386515                        00000000001021301.00TIRZA FINANSIH K.D                                                                       BONUS MEMBER      OKTOBER 2018                        014
18895132221                        00000000000102912.00TJE KIAN                                                                                 BONUS MEMBER      OKTOBER 2018                        014
10272133555                        00000000000072033.00TJHAI JUT SAM                                                                            BONUS MEMBER      OKTOBER 2018                        014
14670079398                        00000000000154711.00TJHIA, SUSAN (CUI CUI)                                                                   BONUS MEMBER      OKTOBER 2018                        014
17540888889                        00000000000055819.00TJHIEN FIE WOEN                                                                          BONUS MEMBER      OKTOBER 2018                        014
17050073038                        00000000000064117.00TJIANG TJI PENG                                                                          BONUS MEMBER      OKTOBER 2018                        014
15650009853                        00000000001289320.00TJOA MIN NIO                                                                             BONUS MEMBER      OKTOBER 2018                        014
18720287243                        00000000000087462.00TJONG A HOK                                                                              BONUS MEMBER      OKTOBER 2018                        014
17980107048                        00000000000066908.00TJONG SWEE FU                                                                            BONUS MEMBER      OKTOBER 2018                        014
12580951891                        00000000000174223.00TOENDJOENG SARIWATI                                                                      BONUS MEMBER      OKTOBER 2018                        014
11830804516                        00000000000196275.00TOMMY                                                                                    BONUS MEMBER      OKTOBER 2018                        014
18000515184                        00000000002352873.00TONGAM F SILABAN                                                                         BONUS MEMBER      OKTOBER 2018                        014
11196004352                        00000000000077159.00TONGON SARIHON SITORUS                                                                   BONUS MEMBER      OKTOBER 2018                        014
10270723845                        00000000000527178.00TONNY EFFENDI                                                                            BONUS MEMBER      OKTOBER 2018                        014
11710553897                        00000000000115154.00TRI PUJI ASTUTI                                                                          BONUS MEMBER      OKTOBER 2018                        014
15060080005                        00000000000145043.00TRISNORINI                                                                               BONUS MEMBER      OKTOBER 2018                        014
10262507686                        00000000000106452.00TRIYANTI ABDULLAH                                                                        BONUS MEMBER      OKTOBER 2018                        014
16070096151                        00000000000144535.00UTING ROCHIMA                                                                            BONUS MEMBER      OKTOBER 2018                        014
15140366538                        00000000000051502.00VINCE SUKMAWATI                                                                          BONUS MEMBER      OKTOBER 2018                        014
17920788712                        00000000000295070.00WAFIQAH AMIRAH MARWAN                                                                    BONUS MEMBER      OKTOBER 2018                        014
10255695245                        00000000000474739.00WAHYU SETIAWAN                                                                           BONUS MEMBER      OKTOBER 2018                        014
15085723160                        00000000000063628.00WARAS                                                                                    BONUS MEMBER      OKTOBER 2018                        014
11410592998                        00000000000519028.00WELLY DJUNAIDI                                                                           BONUS MEMBER      OKTOBER 2018                        014
10120213237                        00000000000368240.00WINARTI                                                                                  BONUS MEMBER      OKTOBER 2018                        014
17640293611                        00000000000130606.00WIWIK BENIRAWATI                                                                         BONUS MEMBER      OKTOBER 2018                        014
17975056121                        00000000000094735.00WIWIN PAKAYA                                                                             BONUS MEMBER      OKTOBER 2018                        014
16750306002                        00000000000084030.00WOLTER CHRISTIAN JUSHARD                                                                 BONUS MEMBER      OKTOBER 2018                        014
11140296411                        00000000000051502.00YANTO SUPRIANTO                                                                          BONUS MEMBER      OKTOBER 2018                        014
16240123931                        00000000000119306.00YATI KUMALA                                                                              BONUS MEMBER      OKTOBER 2018                        014
11520368066                        00000000011673782.00YAYUK RIWAYATI                                                                           BONUS MEMBER      OKTOBER 2018                        014
17800309250                        00000000000051502.00YAYUSRI MANGGAL UPANG                                                                    BONUS MEMBER      OKTOBER 2018                        014
17825052992                        00000000000143221.00YELLIA FALENTINA                                                                         BONUS MEMBER      OKTOBER 2018                        014
10331390401                        00000000000504793.00YENNY MARIA                                                                              BONUS MEMBER      OKTOBER 2018                        014
16750538990                        00000000000052472.00YEREMIA BAGUS PRATAMA                                                                    BONUS MEMBER      OKTOBER 2018                        014
10100631903                        00000000000056352.00YESAYA MARIO BENUS.KOM.MM                                                                BONUS MEMBER      OKTOBER 2018                        014
11710703767                        00000000000052812.00YOHANES RAMO                                                                             BONUS MEMBER      OKTOBER 2018                        014
17990807682                        00000000000082132.00YOHANNES BARA\`PADANG                                                                    BONUS MEMBER      OKTOBER 2018                        014
10510781431                        00000000000195819.00YOONYS ANDRAY                                                                            BONUS MEMBER      OKTOBER 2018                        014
17925086223                        00000000000062803.00YOSIANTO                                                                                 BONUS MEMBER      OKTOBER 2018                        014
14290532944                        00000000000370686.00YOYOK DWI HIMALAYA                                                                       BONUS MEMBER      OKTOBER 2018                        014
10261879157                        00000000000705875.00YUDIN IBRAHIM                                                                            BONUS MEMBER      OKTOBER 2018                        014
15085257878                        00000000000091224.00YULI SULISTYORINI                                                                        BONUS MEMBER      OKTOBER 2018                        014
16550288671                        00000000000056062.00YULIANA RISNA MAENGKOM                                                                   BONUS MEMBER      OKTOBER 2018                        014
17910017777                        00000000000155826.00YULIANTI KADIR PAGALA                                                                    BONUS MEMBER      OKTOBER 2018                        014
12872372513                        00000000017916616.00YULIANTI LIAN                                                                            BONUS MEMBER      OKTOBER 2018                        014
17700211783                        00000000000394756.00YULITA YOHANA TUNGA                                                                      BONUS MEMBER      OKTOBER 2018                        014
13140707871                        00000000000226302.00YUNUS RATU LADO                                                                          BONUS MEMBER      OKTOBER 2018                        014
13140387419                        00000000000215659.00YUSAK VICTOR BENU                                                                        BONUS MEMBER      OKTOBER 2018                        014
11890304270                        00000000000122659.00ZALENA                                                                                   BONUS MEMBER      OKTOBER 2018                        014
12160619026                        00000000000162810.00ZUMMATUL ATIKA                                                                           BONUS MEMBER      OKTOBER 2018                        014
