RK;NPWP;NAMA;KD_JENIS_TRANSAKSI;FG_PENGGANTI;NOMOR_FAKTUR;TANGGAL_FAKTUR;NO_DOKUMEN_FAKTUR;TANGGAL_RETUR;MASA_PAJAK_RETUR;TAHUN_PAJAK_RETUR;NILAI_RETUR_DPP;NILAI_RETUR_PPN;NILAI_RETUR_PPNBM
RK;000000000000000;"Abdul Wahid Sulaiman";01;0;0031972506238;25/06/2019;0049/UHNPUSAT/RET/20;06/07/2019;7;2019;367455;36745;0
RK;000000000000000;"Sherry Adelia";01;0;0031972506799;06/07/2019;0048/UHNPUSAT/RET/20;06/07/2019;7;2019;752600;75260;0
RK;000000000000000;"Eslyn R. Jabar";01;0;0031972505321;23/05/2019;0050/UHNPUSAT/RET/20;15/07/2019;7;2019;190564;19056;0
RK;000000000000000;"Eslyn R. Jabar";01;0;0031972505321;23/05/2019;0051/UHNPUSAT/RET/20;15/07/2019;7;2019;381127;38113;0
RK;000000000000000;"Nurfami putrisari";01;0;0041807548322;12/11/2018;0052/UHNPUSAT/RET/20;17/07/2019;7;2019;9953745;995375;0
RK;000000000000000;"Nurfami putrisari";01;0;0041807548442;16/11/2018;0053/UHNPUSAT/RET/20;17/07/2019;7;2019;18609436;1860944;0
RK;000000000000000;"muhammad dian";01;0;0011000000001;;0054/UHNPUSAT/RET/20;22/07/2019;7;2019;900000;90000;0
RK;000000000000000;"Syahwal SP";01;0;0031972507416;27/07/2019;0055/UHNPUSAT/RET/20;27/07/2019;7;2019;268182;26818;0
RK;000000000000000;"A. Aisyah Tenriawaru Bunyamin";01;0;0031972507506;27/07/2019;0056/UHNPUSAT/RET/20;31/07/2019;7;2019;427273;42727;0
