0SP202007090033059008 00030331               00000000451012109.0000345BCA               BONUS MEMBER      JUNI 2020                                                                                                                                             
17685051231                                          00000000007184234.00A YUDI JAYA MUSRADHY P                                                B      0140397    BCA               Sungguminasa      BONUS MEMBER      JUNI 2020                           1R014
17920665068                                          00000000000393912.00ABDUL FARIS                                                           B      0140397    BCA               Palu              BONUS MEMBER      JUNI 2020                           1R014
13880409866                                          00000000000155050.00ACHMAD YUSUF DR SPKK                                                  B      0140397    BCA               Dharmahusada SurabBONUS MEMBER      JUNI 2020                           1R014
17910573050                                          00000000001489212.00ADRYAN FRISTIOHADI MSC-A                                              B      0140397    BCA               Kendari           BONUS MEMBER      JUNI 2020                           1R014
10321137252                                          00000000000060475.00AGNES SADIKIN                                                         B      0140397    BCA               0000000000        BONUS MEMBER      JUNI 2020                           1R014
17360166532                                          00000000000424758.00AGUS RINI SULISTIOWATY                                                B      0140397    BCA               tajur             BONUS MEMBER      JUNI 2020                           1R014
17400957996                                          00000000000116735.00AGUSNA                                                                B      0140397    BCA               CIBUBUR           BONUS MEMBER      JUNI 2020                           1R014
18600554868                                          00000000000053200.00AHMAD RACHYUDI PUTRA                                                  B      0140397    BCA               Palangka Raya     BONUS MEMBER      JUNI 2020                           1R014
12881347859                                          00000000001881262.00AHMAD ROZALI Z                                                        B      0140397    BCA               KCU PURI INDAH    BONUS MEMBER      JUNI 2020                           1R014
16300076741                                          00000000000166399.00ALBERT MARTINUS                                                       B      0140397    BCA               KELAPA GADING     BONUS MEMBER      JUNI 2020                           1R014
14582204377                                          00000000000820858.00ALDO LAMMY                                                            B      0140397    BCA               Jakarta           BONUS MEMBER      JUNI 2020                           1R014
12581605007                                          00000000000209370.00ALFRYATI VENTHY SANDA SAU TAN                                         B      0140397    BCA               Surabaya          BONUS MEMBER      JUNI 2020                           1R014
10120423045                                          00000000002960009.00ALIYA NAINAWA ZAINAL ARIFIN                                           B      0140397    BCA               Gajah Mada        BONUS MEMBER      JUNI 2020                           1R014
14130329727                                          00000000000160822.00AMELIA TEDDY                                                          B      0140397    BCA               Kelapa Gading VillBONUS MEMBER      JUNI 2020                           1R014
17890103213                                          00000000000101796.00ANDI SUGIRATU LA TINRO                                                B      0140397    BCA               Makassar          BONUS MEMBER      JUNI 2020                           1R014
17910710600                                          00000000000154953.00ANGELA WILDA GEODELITA Z                                              B      0140397    BCA               Kendari           BONUS MEMBER      JUNI 2020                           1R014
13850715555                                          00000000000067750.00ANIS IRBARWATI                                                        B      0140397    BCA               malang            BONUS MEMBER      JUNI 2020                           1R014
18690593301                                          00000000000210340.00ANITA JAMALUDIN SE                                                    B      0140397    BCA               Depok             BONUS MEMBER      JUNI 2020                           1R014
18640136279                                          00000000003646202.00ANITA RACHMAWATIS. FARM, APT, M.KES                                   B      0140397    BCA               BOJONEGROO        BONUS MEMBER      JUNI 2020                           1R014
16871281201                                          00000000000111109.00ANITA TRIHARTATIK                                                     B      0140397    BCA               Pondok Gede       BONUS MEMBER      JUNI 2020                           1R014
15165009492                                          00000000000062900.00ANJELICA PUTRI NUR PRISTA                                             B      0140397    BCA               Sei jawi          BONUS MEMBER      JUNI 2020                           1R014
16720068379                                          00000000000190794.00ANNA TRISULA AL LO TJIOE                                              B      0140397    BCA               taman pondok indahBONUS MEMBER      JUNI 2020                           1R014
10255775125                                          00000000000551974.00APRIYANTO LIFANDY                                                     B      0140397    BCA               Makassar          BONUS MEMBER      JUNI 2020                           1R014
17990732200                                          00000000000261798.00ARDHITA DWIYANA                                                       B      0140397    BCA               KCP KW.Industri   BONUS MEMBER      JUNI 2020                           1R014
12311913354                                          00000000000053054.00ARI KAMARUDIN                                                         B      0140397    BCA               Purwakarta        BONUS MEMBER      JUNI 2020                           1R014
11970182825                                          00000000000101796.00ARIANNY BUDIMAN SH                                                    B      0140397    BCA               Cipanas           BONUS MEMBER      JUNI 2020                           1R014
14690111948                                          00000000001623431.00ARIE YUNITAWATI SUHARSON                                              B      0140397    BCA               Surabaya          BONUS MEMBER      JUNI 2020                           1R014
14050227427                                          00000000003044834.00ARIS YULIANTO                                                         B      0140397    BCA               Makassar          BONUS MEMBER      JUNI 2020                           1R014
16495090608                                          00000000000103883.00ARMAN                                                                 B      0140397    BCA               Baubau            BONUS MEMBER      JUNI 2020                           1R014
18600218272                                          00000000002205504.00ARUM TRININGSIH                                                       B      0140397    BCA               palangkaraya      BONUS MEMBER      JUNI 2020                           1R014
18200607211                                          00000000000300210.00ASIHAR TALLULEMBANG SE                                                B      0140397    BCA               PEMATANG SIANTAR  BONUS MEMBER      JUNI 2020                           1R014
10431223430                                          00000000000100027.00ASNAWI                                                                B      0140397    BCA               Banda Aceh        BONUS MEMBER      JUNI 2020                           1R014
10662180457                                          00000000000226394.00BETTY BUDIMAN                                                         B      0140397    BCA               bca juanda        BONUS MEMBER      JUNI 2020                           1R014
16840377260                                          00000000000340466.00BRYAN CHRISTIANUS HANDOYO                                             B      0140397    BCA               Kemayoran         BONUS MEMBER      JUNI 2020                           1R014
14212295292                                          00000000000075025.00BUDI RAHARDJO                                                         B      0140397    BCA               Margonda Depok    BONUS MEMBER      JUNI 2020                           1R014
15210146387                                          00000000004093017.00BUNNAWATI                                                             B      0140397    BCA               bulever hijau     BONUS MEMBER      JUNI 2020                           1R014
10103448899                                          00000000000319950.00CALVIN ALEXANDER EFANS J                                              B      0140397    BCA               Veteran           BONUS MEMBER      JUNI 2020                           1R014
10657787888                                          00000000000316992.00CASANDRA MARTA                                                        B      0140397    BCA               KCU Kelapa Gading BONUS MEMBER      JUNI 2020                           1R014
13691033021                                          00000000002203244.00CHARLIE BUDIMAN SH                                                    B      0140397    BCA               Tanah Abang       BONUS MEMBER      JUNI 2020                           1R014
14710032497                                          00000000003060782.00CHARLOTHA PUTRI SHARON                                                B      0140397    BCA               Surabaya          BONUS MEMBER      JUNI 2020                           1R014
10255687382                                          00000000000281247.00CHATERINE LIFANDY                                                     B      0140397    BCA               KCU MAKASSAR      BONUS MEMBER      JUNI 2020                           1R014
11700200953                                          00000000000052909.00CHRISTIE MONINGKEY                                                    B      0140397    BCA               Tomohon           BONUS MEMBER      JUNI 2020                           1R014
11681159849                                          00000000000100342.00CIANTO YAPAR                                                          B      0140397    BCA               Jembatan Dua      BONUS MEMBER      JUNI 2020                           1R014
11192151575                                          00000000000119596.00CINDRA WATI JAP                                                       B      0140397    BCA               KCU JAMBI         BONUS MEMBER      JUNI 2020                           1R014
17401321784                                          00000000000050775.00CINDY APRILIA                                                         B      0140397    BCA               CIBUBUR           BONUS MEMBER      JUNI 2020                           1R014
16165019885                                          00000000000052472.00CINDY IRWAN ARMAN                                                     B      0140397    BCA               Padang            BONUS MEMBER      JUNI 2020                           1R014
10430970968                                          00000000000441830.00CUT ZAKIA PUTRI FANDANI                                               B      0140397    BCA               BANDA ACEH        BONUS MEMBER      JUNI 2020                           1R014
11630357205                                          00000000000581668.00DARMAWAN TEDJA                                                        B      0140397    BCA               Padang            BONUS MEMBER      JUNI 2020                           1R014
17920315482                                          00000000001099151.00DARUSMAN M LAMANGKAU SE                                               B      0140397    BCA               Palu              BONUS MEMBER      JUNI 2020                           1R014
17880500583                                          00000000000953360.00DEASY BUNGA MAYASASARI                                                B      0140397    BCA               kcu galaxy        BONUS MEMBER      JUNI 2020                           1R014
17910638208                                          00000000002278762.00DEDENG DESRIADI AMIRUDDIN ST. MM                                      B      0140397    BCA               Kendari           BONUS MEMBER      JUNI 2020                           1R014
11192097287                                          00000000012838812.00DELVIRA                                                               B      0140397    BCA               Jambi             BONUS MEMBER      JUNI 2020                           1R014
18780045141                                          00000000000083949.00DESSY ARISTIA                                                         B      0140397    BCA               KCP SENTRAL CIKINIBONUS MEMBER      JUNI 2020                           1R014
16070317069                                          00000000000153692.00DESSY NATALIA MANOPPO                                                 B      0140397    BCA               Bina Mulia        BONUS MEMBER      JUNI 2020                           1R014
17880492262                                          00000000000155146.00DEWI HESTYANA                                                         B      0140397    BCA               Surabaya          BONUS MEMBER      JUNI 2020                           1R014
11102225508                                          00000000000101652.00DINA GUNAWAN                                                          B      0140397    BCA               VETERAN MAKASSAR  BONUS MEMBER      JUNI 2020                           1R014
17920178531                                          00000000001608207.00DIONISIUS RORI PARENGKUA                                              B      0140397    BCA               palu              BONUS MEMBER      JUNI 2020                           1R014
14730197280                                          00000000000050387.00DJOHAN BUNAWAN GANI                                                   B      0140397    BCA               Pamulang          BONUS MEMBER      JUNI 2020                           1R014
12531232382                                          00000000000675455.00DJUDJU SALIM                                                          B      0140397    BCA               Green Garden      BONUS MEMBER      JUNI 2020                           1R014
12150181073                                          00000000000129345.00DR JOHAN PRASETYO, SP KFR                                             B      0140397    BCA               Surabaya          BONUS MEMBER      JUNI 2020                           1R014
17910882281                                          00000000000119402.00DR. CHINDY PERMATASARI, S.KED                                         B      0140397    BCA               Kendari           BONUS MEMBER      JUNI 2020                           1R014
15770842753                                          00000000000054849.00DRA LAURENTIA MARIA SD                                                B      0140397    BCA               Pekayon Bekasi    BONUS MEMBER      JUNI 2020                           1R014
17910311306                                          00000000000536308.00DRS. ADNAN HUSAINY                                                    B      0140397    BCA               Kendari           BONUS MEMBER      JUNI 2020                           1R014
10321165566                                          00000000000107084.00DWIKORNIDA                                                            B      0140397    BCA               PEMUDA            BONUS MEMBER      JUNI 2020                           1R014
11271076644                                          00000000000103834.00EDDY WIDJAYA FIRGO                                                    B      0140397    BCA               Kepa Duri         BONUS MEMBER      JUNI 2020                           1R014
11191809942                                          00000000000154177.00EKA YULI ASTUTI                                                       B      0140397    BCA               JAMBI             BONUS MEMBER      JUNI 2020                           1R014
12040293712                                          00000000000191425.00EKALIA IRANTI                                                         B      0140397    BCA               FATMAWATI         BONUS MEMBER      JUNI 2020                           1R014
12881041172                                          00000000000119596.00ELEAZAR SIMON                                                         B      0140397    BCA               KCU PURI INDAH    BONUS MEMBER      JUNI 2020                           1R014
14780061591                                          00000000000714008.00ELIA DHARMAWAN LOKANTARA                                              B      0140397    BCA               KCP WAHID HASYIM  BONUS MEMBER      JUNI 2020                           1R014
18140022188                                          00000000000108248.00ELISA ARYANTI                                                         B      0140397    BCA               Jakarta           BONUS MEMBER      JUNI 2020                           1R014
10262183856                                          00000000000053588.00ELISABETH MAKPAL                                                      B      0140397    BCA               Luwuk             BONUS MEMBER      JUNI 2020                           1R014
16331117711                                          00000000000137299.00ELIZABETH ENDANG JATININGSIH                                          B      0140397    BCA               KCP Buaran JakartaBONUS MEMBER      JUNI 2020                           1R014
10021223785                                          00000000000224066.00ELLYJATY SALIM                                                        B      0140397    BCA               00000000000000000 BONUS MEMBER      JUNI 2020                           1R014
18295006559                                          00000000000050920.00ELVINA OLIVIA MANOPO                                                  B      0140397    BCA               Palu              BONUS MEMBER      JUNI 2020                           1R014
10700175308                                          00000000000214656.00ELWIN SALUGARA PURBODINI                                              B      0140397    BCA               PEKANBARU         BONUS MEMBER      JUNI 2020                           1R014
16610439592                                          00000000000101118.00ELYEZER SAMPE                                                         B      0140397    BCA               Proklamasi Depok  BONUS MEMBER      JUNI 2020                           1R014
18140021777                                          00000000000050290.00EMILIA ARYANTI                                                        B      0140397    BCA               Jakarta Barat     BONUS MEMBER      JUNI 2020                           1R014
12581563851                                          00000000007137984.00EMMY INDRIATY                                                         B      0140397    BCA               Diponegoro        BONUS MEMBER      JUNI 2020                           1R014
15415035435                                          00000000001023928.00ENDY MUHARDIN MOEGNI DR                                               B      0140397    BCA               KCP MALL GRAND INDBONUS MEMBER      JUNI 2020                           1R014
10292356691                                          00000000000060475.00ENI ASTUTI                                                            B      0140397    BCA               PONTIANAK         BONUS MEMBER      JUNI 2020                           1R014
15270654161                                          00000000000106404.00ERIC MASWANTO                                                         B      0140397    BCA               Bina Nusantara    BONUS MEMBER      JUNI 2020                           1R014
10183675131                                          00000000000066198.00ERVINA SUHENDRO                                                       B      0140397    BCA               Sidoarjo          BONUS MEMBER      JUNI 2020                           1R014
11084639977                                          00000000004447378.00ERWAN HERLAMBANG                                                      B      0140397    BCA               TANGERANG CITY MALBONUS MEMBER      JUNI 2020                           1R014
10281796967                                          00000000000170134.00ESTER JULIATI SUSANTO                                                 B      0140397    BCA               Jakarta           BONUS MEMBER      JUNI 2020                           1R014
12881053146                                          00000000000119596.00ESTER JUNINGSIH SUDIONO                                               B      0140397    BCA               Jakarta           BONUS MEMBER      JUNI 2020                           1R014
16155020567                                          00000000000137396.00ESTER TJENDRAWATI                                                     B      0140397    BCA               Sidoarjo          BONUS MEMBER      JUNI 2020                           1R014
13900312937                                          00000000000314614.00EVALIN PANGGALO                                                       B      0140397    BCA               Pettarani         BONUS MEMBER      JUNI 2020                           1R014
17010860312                                          00000000000103980.00EVERLYN MAGALINE                                                      B      0140397    BCA               Metro Permata     BONUS MEMBER      JUNI 2020                           1R014
14290661442                                          00000000000375560.00FABRIANA MARIANE JANETE                                               B      0140397    BCA               kcp ahmad yani    BONUS MEMBER      JUNI 2020                           1R014
10989877601                                          00000000000050387.00FADHILAH AZ ZAHRO                                                     B      0140397    BCA               Medan Timur       BONUS MEMBER      JUNI 2020                           1R014
17970231026                                          00000000000109945.00FAHIDAH FAISAL                                                        B      0140397    BCA               Makassar          BONUS MEMBER      JUNI 2020                           1R014
15095097437                                          00000000000050290.00FANNIE SCHELAG IMELDA                                                 B      0140397    BCA               Papua             BONUS MEMBER      JUNI 2020                           1R014
14940019112                                          00000000000093940.00FATINI KUSNO                                                          B      0140397    BCA               KCP ALAYDRUS      BONUS MEMBER      JUNI 2020                           1R014
10060230340                                          00000000000366009.00FERDYNANDS SAMPE                                                      B      0140397    BCA               GKBI Sudirman     BONUS MEMBER      JUNI 2020                           1R014
17920546000                                          00000000000101796.00FIFI YULIANTI SALIM                                                   B      0140397    BCA               Palu              BONUS MEMBER      JUNI 2020                           1R014
10354330802                                          00000000003170916.00FIKRI FAUZI                                                           B      0140397    BCA               jakarta           BONUS MEMBER      JUNI 2020                           1R014
17970003651                                          00000000004029424.00FITRIYANTI RASYID                                                     B      0140397    BCA               Makassar          BONUS MEMBER      JUNI 2020                           1R014
10491569688                                          00000000009672463.00FRANSISKUS YANNO SOERATMAN                                            B      0140397    BCA               maluku            BONUS MEMBER      JUNI 2020                           1R014
15210393350                                          00000000000111109.00GABRIELA FANNY                                                        B      0140397    BCA               bulevar hijau - haBONUS MEMBER      JUNI 2020                           1R014
14641238826                                          00000000000101797.00GUANA TANJUNG                                                         B      0140397    BCA               Surabaya          BONUS MEMBER      JUNI 2020                           1R014
15610136615                                          00000000000102670.00H SUBKHAN DRS                                                         B      0140397    BCA               kcu gresik        BONUS MEMBER      JUNI 2020                           1R014
18275088711                                          00000000000114795.00H. MURJANI ABDY                                                       B      0140397    BCA               A. Yani II        BONUS MEMBER      JUNI 2020                           1R014
17260909546                                          00000000000809460.00HADI SOEDJAJA PRAMONO                                                 B      0140397    BCA               DPS Surabaya      BONUS MEMBER      JUNI 2020                           1R014
17670410468                                          00000000000389208.00HALARI INSAN IHSANI                                                   B      0140397    BCA               Sesetan           BONUS MEMBER      JUNI 2020                           1R014
11900156002                                          00000000000051600.00HALIMAH                                                               B      0140397    BCA               KCP KERTOPATEN    BONUS MEMBER      JUNI 2020                           1R014
13900389212                                          00000000000951274.00HAMSIAH SANGKALA                                                      B      0140397    BCA               Makassar          BONUS MEMBER      JUNI 2020                           1R014
11540006268                                          00000000000105822.00HARI PURNOMO                                                          B      0140397    BCA               temanggung        BONUS MEMBER      JUNI 2020                           1R014
17795019669                                          00000000011297076.00HARUN DALING TUMBUAN                                                  B      0140397    BCA               Palu              BONUS MEMBER      JUNI 2020                           1R014
17920475943                                          00000000000102476.00HASNIAH SYAH,DR                                                       B      0140397    BCA               Palu              BONUS MEMBER      JUNI 2020                           1R014
17685089955                                          00000000001505560.00HASNIH S                                                              B      0140397    BCA               sungguminasa      BONUS MEMBER      JUNI 2020                           1R014
16280369169                                          00000000000744180.00HENNY AQUARITA K DR                                                   B      0140397    BCA               Cibubur           BONUS MEMBER      JUNI 2020                           1R014
10880652192                                          00000000000750145.00HERLIN YUNARA                                                         B      0140397    BCA               Sby Darmo Raya    BONUS MEMBER      JUNI 2020                           1R014
11340999572                                          00000000000107084.00HERTANTI ONO KARDIMAN MARS                                            B      0140397    BCA               Cirbeon           BONUS MEMBER      JUNI 2020                           1R014
15035136859                                          00000000000103592.00HIRONIMUS WAHYU NUGROHO                                               B      0140397    BCA               JAKARTA           BONUS MEMBER      JUNI 2020                           1R014
10940750938                                          00000000000452500.00HJ LILY IRIANA                                                        B      0140397    BCA               0                 BONUS MEMBER      JUNI 2020                           1R014
17160038327                                          00000000003217573.00HJ. NETTY NASIR                                                       B      0140397    BCA               MT Haryono        BONUS MEMBER      JUNI 2020                           1R014
16805111503                                          00000000000137396.00HJALMAR SIHOMBING DRS                                                 B      0140397    BCA               KCP MENARA THAMRINBONUS MEMBER      JUNI 2020                           1R014
10661064721                                          00000000001611262.00IGNATIUS BAMBANG BROTOSA                                              B      0140397    BCA               bsd               BONUS MEMBER      JUNI 2020                           1R014
17140165349                                          00000000000582384.00IKRAM DAKHI                                                           B      0140397    BCA               jaksel            BONUS MEMBER      JUNI 2020                           1R014
17140313005                                          00000000000101797.00ILHAM DACHI SH                                                        B      0140397    BCA                                 BONUS MEMBER      JUNI 2020                           1R014
10291362418                                          00000000008391226.00IMACULATA KORNIA                                                      B      0140397    BCA               BCA RAHADI USMAN  BONUS MEMBER      JUNI 2020                           1R014
11981615498                                          00000000000492658.00IMANUEL ADAM                                                          B      0140397    BCA               Taman Ratu        BONUS MEMBER      JUNI 2020                           1R014
11440327261                                          00000000000066198.00IMELDA ESTER MARLINDA S                                               B      0140397    BCA               KCP JUANDA        BONUS MEMBER      JUNI 2020                           1R014
12460330001                                          00000000000754752.00INAVIANTI WINARTO                                                     B      0140397    BCA               Semarang          BONUS MEMBER      JUNI 2020                           1R014
12151750500                                          00000000000208594.00INDRAJATI SRIRAHAJU                                                   B      0140397    BCA               Surabaya jl. UndaaBONUS MEMBER      JUNI 2020                           1R014
15880209959                                          00000000016328019.00INDRIYATI SALIM                                                       B      0140397    BCA               Jakarta           BONUS MEMBER      JUNI 2020                           1R014
14260366811                                          00000000000326012.00INGE H S / THEO A D                                                   B      0140397    BCA               kcp tolegerejo    BONUS MEMBER      JUNI 2020                           1R014
10094821505                                          00000000000107617.00INNEKE CHRISTIANA                                                     B      0140397    BCA               Semarang,Pemuda   BONUS MEMBER      JUNI 2020                           1R014
16380003447                                          00000000000063870.00IR. SOEBIJANTO TRIWIBOWO                                              B      0140397    BCA               Jakarta           BONUS MEMBER      JUNI 2020                           1R014
11340719227                                          00000000000066198.00IRAWAN                                                                B      0140397    BCA               Cirebon           BONUS MEMBER      JUNI 2020                           1R014
13650265482                                          00000000000129005.00IRAWATI                                                               B      0140397    BCA               RSA Jaury Jusuf PuBONUS MEMBER      JUNI 2020                           1R014
17890669560                                          00000000000155050.00IRMAWATI                                                              B      0140397    BCA               Makassar          BONUS MEMBER      JUNI 2020                           1R014
17920504196                                          00000000000326012.00IRMAYANTI                                                             B      0140397    BCA               7920504196        BONUS MEMBER      JUNI 2020                           1R014
14643157040                                          00000000000181143.00IRUM SPRM DR                                                          B      0140397    BCA               surabaya          BONUS MEMBER      JUNI 2020                           1R014
13140202303                                          00000000000106598.00IRWANTO CAHYADI                                                       B      0140397    BCA               Kupang            BONUS MEMBER      JUNI 2020                           1R014
17685039869                                          00000000000103543.00ISAEL PAULL HARYONO                                                   B      0140397    BCA               sungguminasa      BONUS MEMBER      JUNI 2020                           1R014
17920183845                                          00000000000050775.00ISWANTO                                                               B      0140397    BCA               Palu              BONUS MEMBER      JUNI 2020                           1R014
17891116687                                          00000000000103398.00JEFFRY LIFANDY                                                        B      0140397    BCA               MAKASSAR          BONUS MEMBER      JUNI 2020                           1R014
11520657777                                          00000000001006710.00JEFFRY TANUGRAHA                                                      B      0140397    BCA               Kusumabangsa      BONUS MEMBER      JUNI 2020                           1R014
10181090234                                          00000000000788489.00JOHANES PUTRA MAYNINEDO                                               B      0140397    BCA               Sidoarjo          BONUS MEMBER      JUNI 2020                           1R014
18235066633                                          00000000000052084.00JOLIANA                                                               B      0140397    BCA               RANTAU PRAPAT     BONUS MEMBER      JUNI 2020                           1R014
18200392966                                          00000000000210340.00JON PROTES H J MANULLANG                                              B      0140397    BCA               BCA JALAN MERDEKA BONUS MEMBER      JUNI 2020                           1R014
11781176392                                          00000000001279144.00JOUSJE ADAM                                                           B      0140397    BCA               Permata Hijau     BONUS MEMBER      JUNI 2020                           1R014
11681694248                                          00000000000794668.00JUANITA ICHSANI                                                       B      0140397    BCA               Pluit             BONUS MEMBER      JUNI 2020                           1R014
18170830904                                          00000000000067750.00JUHARDI                                                               B      0140397    BCA               SINGKAWANG        BONUS MEMBER      JUNI 2020                           1R014
12910359331                                          00000000000101796.00JULIANA KULLIT                                                        B      0140397    BCA               Jakarta           BONUS MEMBER      JUNI 2020                           1R014
17920829036                                          00000000000468166.00JULIANA ROSA WIDJAJANTI                                               B      0140397    BCA               palu              BONUS MEMBER      JUNI 2020                           1R014
17140313005                                          00000000000101797.00JUNI RAHMAYANTI AFIF PUTRI SE                                         B      0140397    BCA                                 BONUS MEMBER      JUNI 2020                           1R014
16165011604                                          00000000000050290.00JUSIANTI                                                              B      0140397    BCA               Kcp Pondok        BONUS MEMBER      JUNI 2020                           1R014
10885727030                                          00000000000487130.00KALEB YEREMIA YUNIOR KOR                                              B      0140397    BCA               Surabaya          BONUS MEMBER      JUNI 2020                           1R014
17920725931                                          00000000000104885.00KALSUM                                                                B      0140397    BCA               Palu              BONUS MEMBER      JUNI 2020                           1R014
12900146208                                          00000000000101797.00KARMILA MUSIDAR                                                       B      0140397    BCA               Makassar          BONUS MEMBER      JUNI 2020                           1R014
10051024086                                          00000000000101796.00KARWITA NURLAELASARI                                                  B      0140397    BCA               WISMA MILENIA     BONUS MEMBER      JUNI 2020                           1R014
16871020245                                          00000000000278725.00KELI SUPRIYANTO                                                       B      0140397    BCA               Pondok Gede       BONUS MEMBER      JUNI 2020                           1R014
15221447906                                          00000000000105774.00KHODIJAH                                                              B      0140397    BCA               Cikarang          BONUS MEMBER      JUNI 2020                           1R014
12620007202                                          00000000000261847.00KIKIE HARDI                                                           B      0140397    BCA               HASYIM ASHARI     BONUS MEMBER      JUNI 2020                           1R014
13911108222                                          00000000000178960.00KIM YAN                                                               B      0140397    BCA               gunsa             BONUS MEMBER      JUNI 2020                           1R014
12850039910                                          00000000000100826.00KOE HOENG WHENG                                                       B      0140397    BCA               taman sari        BONUS MEMBER      JUNI 2020                           1R014
12211227763                                          00000000000384067.00KONNI M TAMBUNAN                                                      B      0140397    BCA               MENARA IMPERIUM   BONUS MEMBER      JUNI 2020                           1R014
18600573692                                          00000000000158978.00LAILA MAJENUN                                                         B      0140397    BCA               Palangka Raya     BONUS MEMBER      JUNI 2020                           1R014
14131012939                                          00000000000050678.00LANNY SANTOSO                                                         B      0140397    BCA               413               BONUS MEMBER      JUNI 2020                           1R014
11051407763                                          00000000000340514.00LANNY SULAIMAN                                                        B      0140397    BCA               jembatan lima     BONUS MEMBER      JUNI 2020                           1R014
11521037909                                          00000000000101796.00LAURENSIA SUSAN                                                       B      0140397    BCA               Surabaya          BONUS MEMBER      JUNI 2020                           1R014
10410949768                                          00000000000188418.00LELI MARULISARI                                                       B      0140397    BCA               PANGKAL PINANG    BONUS MEMBER      JUNI 2020                           1R014
18140000168                                          00000000000332220.00LENNY SETYAWATI LIEM                                                  B      0140397    BCA               Jayapura          BONUS MEMBER      JUNI 2020                           1R014
10291515818                                          00000000000102476.00LIAINI HALIM                                                          B      0140397    BCA               KCU Pontianak     BONUS MEMBER      JUNI 2020                           1R014
13971165357                                          00000000000101797.00LIAN BIE HUI                                                          B      0140397    BCA               Jakarta           BONUS MEMBER      JUNI 2020                           1R014
17920702494                                          00000000000104707.00LIDYA ARMA                                                            B      0140397    BCA               Palu              BONUS MEMBER      JUNI 2020                           1R014
15060026981                                          00000000000210194.00LIE AY HWA                                                            B      0140397    BCA               Surabaya          BONUS MEMBER      JUNI 2020                           1R014
10090888919                                          00000000000165817.00LIEM ENG MEI                                                          B      0140397    BCA               Semarang          BONUS MEMBER      JUNI 2020                           1R014
10880370006                                          00000000000053200.00LIEM LINDAWATI MASAJU                                                 B      0140397    BCA               Surabaya          BONUS MEMBER      JUNI 2020                           1R014
12762222222                                          00000000000123040.00LILY NGADIMAN                                                         B      0140397    BCA               sunter            BONUS MEMBER      JUNI 2020                           1R014
12211076871                                          00000000000129102.00LINA HALIM THE                                                        B      0140397    BCA               Menara Imperium   BONUS MEMBER      JUNI 2020                           1R014
17795143955                                          00000000004364256.00LINDA                                                                 B      0140397    BCA               Cabang Palu       BONUS MEMBER      JUNI 2020                           1R014
17955171314                                          00000000000593975.00LISDA TUNILAN                                                         B      0140397    BCA               Abepura           BONUS MEMBER      JUNI 2020                           1R014
16750173762                                          00000000000066198.00LUSI SUSILO                                                           B      0140397    BCA               Rungkut           BONUS MEMBER      JUNI 2020                           1R014
10255823286                                          00000000000050048.00LUSIA LAI DEO                                                         B      0140397    BCA               MAKASSAR          BONUS MEMBER      JUNI 2020                           1R014
18642060000                                          00000000000328001.00LUTFI FIRMANSYAH                                                      B      0140397    BCA               Bojonegoro        BONUS MEMBER      JUNI 2020                           1R014
17975271188                                          00000000002165310.00LUTFIA Y K NASIB ALAMRI . SE                                          B      0140397    BCA               Gorontalo         BONUS MEMBER      JUNI 2020                           1R014
18620235661                                          00000000000622736.00LYDIANA DEWI EFFENDY                                                  B      0140397    BCA               Citraland         BONUS MEMBER      JUNI 2020                           1R014
15271679743                                          00000000000105483.00M. BAGUS AL RAFI                                                      B      0140397    BCA               JAKARTA           BONUS MEMBER      JUNI 2020                           1R014
14361422788                                          00000000001214280.00MAILINDA                                                              B      0140397    BCA               KCP Tebet barat   BONUS MEMBER      JUNI 2020                           1R014
18190339344                                          00000000000764646.00MANUELLA ARTAWATY PURBA                                               B      0140397    BCA               KCP JELUTUNG      BONUS MEMBER      JUNI 2020                           1R014
10260829971                                          00000000003064676.00MARIA BEATRIX LUNTUNGAN                                               B      0140397    BCA               Manado            BONUS MEMBER      JUNI 2020                           1R014
16840153876                                          00000000001209944.00MARIANCE                                                              B      0140397    BCA               Kcp KEM Tower     BONUS MEMBER      JUNI 2020                           1R014
10292155075                                          00000000000991748.00MARISA CAROLINA TEDJA                                                 B      0140397    BCA               Pontianak         BONUS MEMBER      JUNI 2020                           1R014
14650268356                                          00000000009527596.00MARSUDI                                                               B      0140397    BCA               Makro Pepelegi SidBONUS MEMBER      JUNI 2020                           1R014
11520325049                                          00000000000311608.00MARTHEN CAREL KORWA                                                   B      0140397    BCA               Kertajaya         BONUS MEMBER      JUNI 2020                           1R014
16610493350                                          00000000000153530.00MARTINUS B. PALAMBA                                                   B      0140397    BCA               Depok             BONUS MEMBER      JUNI 2020                           1R014
14870038254                                          00000000000154856.00MARYANA                                                               B      0140397    BCA               487               BONUS MEMBER      JUNI 2020                           1R014
10640167297                                          00000000000805968.00MEDYAWATI LIMANTARA DRG                                               B      0140397    BCA               Pucang Anom SurabaBONUS MEMBER      JUNI 2020                           1R014
11190435969                                          00000000000100924.00MEGAWATI EMERENTIANA OH                                               B      0140397    BCA               JAMBI             BONUS MEMBER      JUNI 2020                           1R014
17160069281                                          00000000006028288.00MELAWATY ABYANI                                                       B      0140397    BCA               MT Haryono JakartaBONUS MEMBER      JUNI 2020                           1R014
10883225888                                          00000000000050290.00MELI WIDJAJA                                                          B      0140397    BCA               Surabaya          BONUS MEMBER      JUNI 2020                           1R014
10884820207                                          00000000000996962.00MELYSA YULIANA                                                        B      0140397    BCA               Darmo             BONUS MEMBER      JUNI 2020                           1R014
14411287399                                          00000000000100714.00MERIAM SELONITA SAMBO                                                 B      0140397    BCA               Plaza Sentral     BONUS MEMBER      JUNI 2020                           1R014
18600187148                                          00000000000155050.00MERRY LUKAS TUNJANG                                                   B      0140397    BCA               Palangka Raya     BONUS MEMBER      JUNI 2020                           1R014
13053007500                                          00000000002904666.00MEYLIA                                                                B      0140397    BCA               PS Cikini         BONUS MEMBER      JUNI 2020                           1R014
11100221515                                          00000000000102718.00MILDA PRATIWI MUSIDAR                                                 B      0140397    BCA               Makassar          BONUS MEMBER      JUNI 2020                           1R014
12741034559                                          00000000005021561.00MIRA REBEKA SANI                                                      B      0140397    BCA               00000             BONUS MEMBER      JUNI 2020                           1R014
12308061090                                          00000000001273430.00MIRNA SAMPE                                                           B      0140397    BCA               Kalimalang        BONUS MEMBER      JUNI 2020                           1R014
13900371216                                          00000000000227921.00MUH ALI HUSAIN TJ                                                     B      0140397    BCA               panakukang MakassaBONUS MEMBER      JUNI 2020                           1R014
10255460574                                          00000000000989384.00MUH. KADIR                                                            B      0140397    BCA               Sungguminasa      BONUS MEMBER      JUNI 2020                           1R014
13900341708                                          00000000000101821.00MUH. NUR ALIM                                                         B      0140397    BCA               Pettarani MakassarBONUS MEMBER      JUNI 2020                           1R014
14520053889                                          00000000000050290.00MUHAMAD TAUFIK                                                        B      0140397    BCA               KEBAYORAN         BONUS MEMBER      JUNI 2020                           1R014
14930145900                                          00000000000053054.00MUHAMMAD HARUN AL RASYID                                              B      0140397    BCA               pondok gede       BONUS MEMBER      JUNI 2020                           1R014
17920781742                                          00000000000521909.00MUHAMMAD HILMI MARWAN                                                 B      0140397    BCA               Palu              BONUS MEMBER      JUNI 2020                           1R014
12940047318                                          00000000000208594.00MUKLAM                                                                B      0140397    BCA               PANGERAN ANTASARI BONUS MEMBER      JUNI 2020                           1R014
18190006337                                          00000000000060475.00MULYONO                                                               B      0140397    BCA               Jambi             BONUS MEMBER      JUNI 2020                           1R014
18170504292                                          00000000000051260.00MYSON                                                                 B      0140397    BCA               SINGKAWANG        BONUS MEMBER      JUNI 2020                           1R014
18600232798                                          00000000000372378.00NANA                                                                  B      0140397    BCA               Palangka Raya     BONUS MEMBER      JUNI 2020                           1R014
15280182526                                          00000000000102670.00NANSI ARJANI HALIM                                                    B      0140397    BCA               Jelambar Baru RayaBONUS MEMBER      JUNI 2020                           1R014
14300399105                                          00000000001054386.00NATASIA SE                                                            B      0140397    BCA               KCP Teluk Betung  BONUS MEMBER      JUNI 2020                           1R014
10561465591                                          00000000000128424.00NI KETUT MEGAWATI                                                     B      0140397    BCA               MATARAM           BONUS MEMBER      JUNI 2020                           1R014
10560789939                                          00000000000181774.00NI NYOMAN NGURAH ASTUTI                                               B      0140397    BCA               CAKRANEGARA       BONUS MEMBER      JUNI 2020                           1R014
10653453890                                          00000000000225763.00NILAWATI"BDN RATU PRATIW                                              B      0140397    BCA               Kelapa Gading     BONUS MEMBER      JUNI 2020                           1R014
18290171513                                          00000000000457787.00NINIK ELSAWATIE                                                       B      0140397    BCA               Surabaya          BONUS MEMBER      JUNI 2020                           1R014
10067888883                                          00000000000119596.00NITRA TIARA                                                           B      0140397    BCA               EQUITY TOWER SCBD BONUS MEMBER      JUNI 2020                           1R014
18680552801                                          00000000003171575.00NONSI MARIANA                                                         B      0140397    BCA               kcp cikokol       BONUS MEMBER      JUNI 2020                           1R014
10882097321                                          00000000000051600.00NORA AMALIA LUMON                                                     B      0140397    BCA               Gayungan          BONUS MEMBER      JUNI 2020                           1R014
15210742605                                          00000000001994248.00NOVI HANDAYANI                                                        B      0140397    BCA               KCP BULEVAR HIJAU BONUS MEMBER      JUNI 2020                           1R014
17122678417                                          00000000008849452.00NOVI ROSMITA                                                          B      0140397    BCA               Tapak tuan        BONUS MEMBER      JUNI 2020                           1R014
18140393399                                          00000000000589368.00NOVIKA LOUDERS ROSELLINI                                              B      0140397    BCA               Abepura           BONUS MEMBER      JUNI 2020                           1R014
10511559323                                          00000000000101215.00NOVITA MURSALIM                                                       B      0140397    BCA               Banjarmasin       BONUS MEMBER      JUNI 2020                           1R014
13900376251                                          00000000000208594.00NUR NIKMA ANUGRAWATI                                                  B      0140397    BCA               Makassar          BONUS MEMBER      JUNI 2020                           1R014
12861069356                                          00000000000101118.00NUR UTAMI                                                             B      0140397    BCA               .                 BONUS MEMBER      JUNI 2020                           1R014
14060449321                                          00000000000106550.00NURDIANA                                                              B      0140397    BCA               Cileungsi         BONUS MEMBER      JUNI 2020                           1R014
10255830223                                          00000000000268686.00NURJAYA SH                                                            B      0140397    BCA               MAKASSAR          BONUS MEMBER      JUNI 2020                           1R014
17910592526                                          00000000000050290.00NURNIKMAT                                                             B      0140397    BCA               Kcu Kendari       BONUS MEMBER      JUNI 2020                           1R014
17640857212                                          00000000000622639.00NURUL AZIZAH                                                          B      0140397    BCA               CITRA RAYA        BONUS MEMBER      JUNI 2020                           1R014
13751308106                                          00000000000101602.00NY MARGARETHA I NGANTUNG                                              B      0140397    BCA               Graha Inti        BONUS MEMBER      JUNI 2020                           1R014
15740065124                                          00000000000101796.00NY THERESIANA SANTI                                                   B      0140397    BCA               PASAR JATINEGARA  BONUS MEMBER      JUNI 2020                           1R014
17911052273                                          00000000000175372.00OKKY ASTRIA HUSAINY, SH,MH                                            B      0140397    BCA               Kendari           BONUS MEMBER      JUNI 2020                           1R014
16042488581                                          00000000001101140.00OLIVIA HANDOYO                                                        B      0140397    BCA               jakpus            BONUS MEMBER      JUNI 2020                           1R014
18640256738                                          00000000000109266.00PARAMITA HAPSARI                                                      B      0140397    BCA               BOJONEGORO        BONUS MEMBER      JUNI 2020                           1R014
17155072989                                          00000000000156554.00PATRISIA SUPARTINA                                                    B      0140397    BCA               PONTIANAK         BONUS MEMBER      JUNI 2020                           1R014
11691938561                                          00000000001251654.00PONCO HANDAYAWATI                                                     B      0140397    BCA               Kcp Ahmad Dahlan  BONUS MEMBER      JUNI 2020                           1R014
14681270978                                          00000000000101700.00PRASTI ADHI DHARMASANTI DR                                            B      0140397    BCA               Indrapura SurabayaBONUS MEMBER      JUNI 2020                           1R014
17800213392                                          00000000000123156.00PREISY ANGEL MARIA GOLIO                                              B      0140397    BCA               Ranotana          BONUS MEMBER      JUNI 2020                           1R014
17870667081                                          00000000000317574.00PRIMA YULIANTY                                                        B      0140397    BCA               Jambi             BONUS MEMBER      JUNI 2020                           1R014
17890006471                                          00000000000159318.00RATNA WIJAYA                                                          B      0140397    BCA               sungguminasa      BONUS MEMBER      JUNI 2020                           1R014
12741009970                                          00000000000691460.00RAY LAMMY                                                             B      0140397    BCA               Pondok Bambu      BONUS MEMBER      JUNI 2020                           1R014
16665115058                                          00000000002888874.00RENO PRASETYO ANGGRIAWAN                                              B      0140397    BCA               Sambas            BONUS MEMBER      JUNI 2020                           1R014
16795040068                                          00000000000103882.00RENSLY SAADJAD                                                        B      0140397    BCA               Luwuk             BONUS MEMBER      JUNI 2020                           1R014
14363407474                                          00000000000216160.00RETNO DWISETYOWATI                                                    B      0140397    BCA               TEBET JAKARTA SELABONUS MEMBER      JUNI 2020                           1R014
17772106852                                          00000000000052084.00REZKY FITRIANI                                                        B      0140397    BCA               KC MAKASSAR       BONUS MEMBER      JUNI 2020                           1R014
10255755531                                          00000000000498576.00RICHARD LIFANDY                                                       B      0140397    BCA               AHMAD YANI        BONUS MEMBER      JUNI 2020                           1R014
17910036585                                          00000000000441200.00RINA ARIYANIE TAHIR                                                   B      0140397    BCA               kendari           BONUS MEMBER      JUNI 2020                           1R014
12900228387                                          00000000000103470.00RINGGO WIRAWAN                                                        B      0140397    BCA               Makassar          BONUS MEMBER      JUNI 2020                           1R014
17920717351                                          00000000003312158.00RISDIYANTO                                                            B      0140397    BCA               palu              BONUS MEMBER      JUNI 2020                           1R014
14052203388                                          00000000000159464.00RISKA                                                                 B      0140397    BCA               kcp sulawesi      BONUS MEMBER      JUNI 2020                           1R014
14260130698                                          00000000000101796.00RIZA POERWANI POERBOWO                                                B      0140397    BCA               Semarang          BONUS MEMBER      JUNI 2020                           1R014
17060323326                                          00000000000137784.00ROBBY MARDINATA                                                       B      0140397    BCA               CEMPAKA PUTIH     BONUS MEMBER      JUNI 2020                           1R014
17060095269                                          00000000001389375.00ROBERT DEDE BANGUN                                                    B      0140397    BCA               Cempaka Putih     BONUS MEMBER      JUNI 2020                           1R014
17920441119                                          00000000007161150.00ROBERTH PARENGKUAN                                                    B      0140397    BCA               Palu              BONUS MEMBER      JUNI 2020                           1R014
17910323681                                          00000000000102718.00ROSYE LANDIMURU PANGA                                                 B      0140397    BCA               mandonga          BONUS MEMBER      JUNI 2020                           1R014
11410467735                                          00000000000155899.00RR ARI ROCHTITI,SPD                                                   B      0140397    BCA               Nganjuk           BONUS MEMBER      JUNI 2020                           1R014
16665050541                                          00000000022861181.00RUSIANI                                                               B      0140397    BCA               Sambas            BONUS MEMBER      JUNI 2020                           1R014
11410324047                                          00000000007345927.00RUTH HANDAYANI DARMAWAN                                               B      0140397    BCA               Nganjuk           BONUS MEMBER      JUNI 2020                           1R014
17920779136                                          00000000000751115.00SAHRAN                                                                B      0140397    BCA               Palu              BONUS MEMBER      JUNI 2020                           1R014
16280547202                                          00000000000258404.00SAHRONI                                                               B      0140397    BCA               ahmad yani palangkBONUS MEMBER      JUNI 2020                           1R014
12581015901                                          00000000001944652.00SALIM                                                                 B      0140397    BCA               Diponogoro        BONUS MEMBER      JUNI 2020                           1R014
16270097543                                          00000000000524766.00SALMA LUBIS                                                           B      0140397    BCA               TEBET BARAT 2     BONUS MEMBER      JUNI 2020                           1R014
17910170583                                          00000000044462456.00SALMIA RODHIYA HUSAINY                                                B      0140397    BCA               Kendari           BONUS MEMBER      JUNI 2020                           1R014
18375052136                                          00000000000832862.00SARAH ATTHAHIRAH                                                      B      0140397    BCA               KCP Rahmadsyah    BONUS MEMBER      JUNI 2020                           1R014
10040049177                                          00000000000137348.00SARAH AYUDA                                                           B      0140397    BCA               KCP REG. TANAH ABABONUS MEMBER      JUNI 2020                           1R014
18200654570                                          00000000001953575.00SARMED IDA RISAN NABABAN                                              B      0140397    BCA               pematangsiantar   BONUS MEMBER      JUNI 2020                           1R014
16370116677                                          00000000000075025.00SATIADI SUTISNA                                                       B      0140397    BCA               KCP Muara Karang 2BONUS MEMBER      JUNI 2020                           1R014
15270449991                                          00000000000050290.00SETIAWAN LUDI                                                         B      0140397    BCA               bina nusantara    BONUS MEMBER      JUNI 2020                           1R014
18985132778                                          00000000000101748.00SETIYOWATI DARSONO                                                    B      0140397    BCA               cabang Puri AnjasmBONUS MEMBER      JUNI 2020                           1R014
11010200209                                          00000000001476888.00SETYOTUHU TATIK                                                       B      0140397    BCA               KCP Kapas KrampungBONUS MEMBER      JUNI 2020                           1R014
10342366200                                          00000000000051454.00SHELFIA ANGELA                                                        B      0140397    BCA               Pekanbaru         BONUS MEMBER      JUNI 2020                           1R014
12150046681                                          00000000000066198.00SIERAH LANDAYANI SOETEMO                                              B      0140397    BCA               00000000000       BONUS MEMBER      JUNI 2020                           1R014
15530170456                                          00000000000374706.00SITI FATONAH                                                          B      0140397    BCA               OTISTA            BONUS MEMBER      JUNI 2020                           1R014
16870659367                                          00000000000105532.00SITI HARTANINGRUM                                                     B      0140397    BCA               PONDOK GEDE BEKASIBONUS MEMBER      JUNI 2020                           1R014
16110470086                                          00000000000320120.00SITI MURTI UTAMI                                                      B      0140397    BCA               GRAND SUDIRMAN    BONUS MEMBER      JUNI 2020                           1R014
13981030522                                          00000000000119596.00SOFI                                                                  B      0140397    BCA               Jakarta           BONUS MEMBER      JUNI 2020                           1R014
12701017392                                          00000000000101602.00SONYA KUSNANDAR                                                       B      0140397    BCA               TANGERANG         BONUS MEMBER      JUNI 2020                           1R014
17955222211                                          00000000000589368.00SRI MULIADEWI GUNARTO                                                 B      0140397    BCA               Abepura           BONUS MEMBER      JUNI 2020                           1R014
14520006091                                          00000000000279889.00SRI REJEKI                                                            B      0140397    BCA               jakarta           BONUS MEMBER      JUNI 2020                           1R014
14361496102                                          00000000000102864.00SRIANA ANGGREINI                                                      B      0140397    BCA               TEBET BARAT       BONUS MEMBER      JUNI 2020                           1R014
18020384591                                          00000000004296222.00ST BALQIS NURCAHYANI AM                                               B      0140397    BCA               invalid account   BONUS MEMBER      JUNI 2020                           1R014
17920883006                                          00000000000107690.00STEFANI BEATRIX                                                       B      0140397    BCA               Palu              BONUS MEMBER      JUNI 2020                           1R014
14640076335                                          00000000000051260.00STEPHANIE GABRIELA AIMEE                                              B      0140397    BCA               Surabaya          BONUS MEMBER      JUNI 2020                           1R014
12533338585                                          00000000028104905.00STEVIE LENGKONG                                                       B      0140397    BCA               Green Garden      BONUS MEMBER      JUNI 2020                           1R014
13530096458                                          00000000000101748.00SUBIANTO HARSOJO                                                      B      0140397    BCA               kcp industri      BONUS MEMBER      JUNI 2020                           1R014
17401245719                                          00000000002212485.00SUCIPTO                                                               B      0140397    BCA               KCU CIBUBUR       BONUS MEMBER      JUNI 2020                           1R014
12750167091                                          00000000004436543.00SUDI WARSITO                                                          B      0140397    BCA               Jakarta           BONUS MEMBER      JUNI 2020                           1R014
17910249091                                          00000000011740271.00SULEMAN MILE                                                          B      0140397    BCA               0000000000        BONUS MEMBER      JUNI 2020                           1R014
12861012044                                          00000000001991903.00SULHANA ARMAINI                                                       B      0140397    BCA               KEMANG TEBET      BONUS MEMBER      JUNI 2020                           1R014
11791564838                                          00000000000257385.00SULIANTO BONG                                                         B      0140397    BCA               JEMBATAN LIMA     BONUS MEMBER      JUNI 2020                           1R014
10851157564                                          00000000000119596.00SUNMEIRIA                                                             B      0140397    BCA               Sudirman Bandung  BONUS MEMBER      JUNI 2020                           1R014
18190166873                                          00000000000102184.00SUPRANATA S                                                           B      0140397    BCA               Jelutung-Jambi    BONUS MEMBER      JUNI 2020                           1R014
10021709335                                          00000000000100148.00SUSANA.F.WAWORGA                                                      B      0140397    BCA               JAMBI             BONUS MEMBER      JUNI 2020                           1R014
10291671861                                          00000000000144089.00SUSANTI SE                                                            B      0140397    BCA               RAHADI USMAN      BONUS MEMBER      JUNI 2020                           1R014
12171014010                                          00000000000067750.00SUZANNA ARRYANI                                                       B      0140397    BCA               Kuningan          BONUS MEMBER      JUNI 2020                           1R014
11410476271                                          00000000007413596.00SUZANNA ELLY SENTOSA                                                  B      0140397    BCA               nganjuk           BONUS MEMBER      JUNI 2020                           1R014
10613350559                                          00000000000855342.00SYAHRIZAL                                                             B      0140397    BCA               MEDAN             BONUS MEMBER      JUNI 2020                           1R014
13080072162                                          00000000008025480.00TEDDY WIJAYAPUTRA                                                     B      0140397    BCA               Duta Merlin       BONUS MEMBER      JUNI 2020                           1R014
10010455375                                          00000000000105774.00TEGUH RIYADI                                                          B      0140397    BCA               Jakarta           BONUS MEMBER      JUNI 2020                           1R014
17920906880                                          00000000000082446.00THANIAH FAUZIYYAH GRISEL                                              B      0140397    BCA               Palu              BONUS MEMBER      JUNI 2020                           1R014
11520385858                                          00000000001191980.00THE THETY MEYCIYANA SUEL                                              B      0140397    BCA               kcp kertajaya     BONUS MEMBER      JUNI 2020                           1R014
11520389608                                          00000000000526560.00THE TJIOE LAN                                                         B      0140397    BCA               Kertajaya         BONUS MEMBER      JUNI 2020                           1R014
16870376357                                          00000000000103397.00THOMAS ARINANTO                                                       B      0140397    BCA               Jatiwaringin      BONUS MEMBER      JUNI 2020                           1R014
10031705486                                          00000000000119596.00TIO TJEN AI                                                           B      0140397    BCA               Gunung Sahari     BONUS MEMBER      JUNI 2020                           1R014
11196004352                                          00000000000051018.00TONGON SARIHON SITORUS                                                B      0140397    BCA               SIPIN - JAMBI     BONUS MEMBER      JUNI 2020                           1R014
11710553897                                          00000000000231486.00TRI PUJI ASTUTI                                                       B      0140397    BCA               PONTIANAK         BONUS MEMBER      JUNI 2020                           1R014
17910942497                                          00000000000188466.00UCA SARI PUSPITA DEWI, SE                                             B      0140397    BCA               KCU KENDARI       BONUS MEMBER      JUNI 2020                           1R014
12903024461                                          00000000000121148.00UMMU CALSUM KADIR                                                     B      0140397    BCA               Somba Opu makassarBONUS MEMBER      JUNI 2020                           1R014
12310329714                                          00000000000057274.00URIPAH                                                                B      0140397    BCA               Purwakarta        BONUS MEMBER      JUNI 2020                           1R014
16070096151                                          00000000000101797.00UTING ROCHIMA                                                         B      0140397    BCA               kcp cyber II      BONUS MEMBER      JUNI 2020                           1R014
17795023381                                          00000000000067750.00VERDIANA TARUNTUNG                                                    B      0140397    BCA               Palu              BONUS MEMBER      JUNI 2020                           1R014
18161231835                                          00000000000050775.00VIVI ARYANTI                                                          B      0140397    BCA               Jayapura          BONUS MEMBER      JUNI 2020                           1R014
17920844159                                          00000000000120227.00VONNY HASNAH                                                          B      0140397    BCA               Palu              BONUS MEMBER      JUNI 2020                           1R014
17920788712                                          00000000000680990.00WAFIQAH AMIRAH MARWAN                                                 B      0140397    BCA               Palu              BONUS MEMBER      JUNI 2020                           1R014
16010017074                                          00000000000480194.00WANDA MARIA NADIYENSI                                                 B      0140397    BCA               KCP ARJUNA        BONUS MEMBER      JUNI 2020                           1R014
15085723160                                          00000000000119596.00WARAS                                                                 B      0140397    BCA               Surabaya          BONUS MEMBER      JUNI 2020                           1R014
13191467131                                          00000000000066198.00WELLA SOLIHIN                                                         B      0140397    BCA               Kebon Jeruk       BONUS MEMBER      JUNI 2020                           1R014
11410592998                                          00000000001016652.00WELLY JUNAIDI LEE                                                     B      0140397    BCA               nganjuk           BONUS MEMBER      JUNI 2020                           1R014
15220606866                                          00000000000106550.00WILFRED RONALDO SIAHAAN                                               B      0140397    BCA               Lippo Cikarang    BONUS MEMBER      JUNI 2020                           1R014
17920333456                                          00000000000102233.00WILLYANTO GOSAL                                                       B      0140397    BCA               PALU              BONUS MEMBER      JUNI 2020                           1R014
14010427113                                          00000000000628701.00WINARTI                                                               B      0140397    BCA               KCP Ketapanh      BONUS MEMBER      JUNI 2020                           1R014
11410658999                                          00000000000333676.00XANDRAMELA LIMALA ALICYA                                              B      0140397    BCA               nganjuk           BONUS MEMBER      JUNI 2020                           1R014
13880501223                                          00000000000421800.00YAP TIN TJOE                                                          B      0140397    BCA               Dharmahusada      BONUS MEMBER      JUNI 2020                           1R014
10940610656                                          00000000000066198.00YAYAN SAPTAWAN                                                        B      0140397    BCA               Rawamangun        BONUS MEMBER      JUNI 2020                           1R014
11520368066                                          00000000002034886.00YAYUK RIWAYATI                                                        B      0140397    BCA               Kertajaya         BONUS MEMBER      JUNI 2020                           1R014
17401476940                                          00000000000122216.00YEHEZKIEL ANTONIUS                                                    B      0140397    BCA               JAKARTA           BONUS MEMBER      JUNI 2020                           1R014
11630205677                                          00000000000118384.00YENNY                                                                 B      0140397    BCA               Kcp pemuda padang BONUS MEMBER      JUNI 2020                           1R014
17890999195                                          00000000000103591.00YENNY NIOS                                                            B      0140397    BCA               Makassar          BONUS MEMBER      JUNI 2020                           1R014
10321109364                                          00000000000257458.00YENYTA FIRGO                                                          B      0140397    BCA               Padang            BONUS MEMBER      JUNI 2020                           1R014
10631205487                                          00000000000060475.00YOHANES GUNAWAN SAPUTRA. S.PD                                         B      0140397    BCA               Suniarja          BONUS MEMBER      JUNI 2020                           1R014
17990807692                                          00000000000154614.00YOHANIS BARA PADANG                                                   B      0140397    BCA               KCP Kawasan IndustBONUS MEMBER      JUNI 2020                           1R014
14820216780                                          00000000000446584.00YONA                                                                  B      0140397    BCA               untar             BONUS MEMBER      JUNI 2020                           1R014
18630018928                                          00000000000150414.00YUANITA ADITYA DEWI                                                   B      0140397    BCA               surabaya          BONUS MEMBER      JUNI 2020                           1R014
10010017912                                          00000000000053054.00YULI LINAWATI                                                         B      0140397    BCA               Jakarta           BONUS MEMBER      JUNI 2020                           1R014
18600218230                                          00000000003384083.00YULIAN WINDRI                                                         B      0140397    BCA               Ahmad Yani PalangkBONUS MEMBER      JUNI 2020                           1R014
12872372513                                          00000000032617003.00YULIANTI LIAN                                                         B      0140397    BCA               00000             BONUS MEMBER      JUNI 2020                           1R014
10255823073                                          00000000000368014.00YULITA PANGGALO                                                       B      0140397    BCA               makassar          BONUS MEMBER      JUNI 2020                           1R014
17140313003                                          00000000000368790.00YUSNIDAR                                                              B      0140397    BCA                                 BONUS MEMBER      JUNI 2020                           1R014
10341708396                                          00000000000268006.00ZAIDAR YANTI PURBODINING                                              B      0140397    BCA               PEKAN BARU        BONUS MEMBER      JUNI 2020                           1R014
17921011869                                          00000000000271498.00ZAINAB                                                                B      0140397    BCA               Palu              BONUS MEMBER      JUNI 2020                           1R014
10120280899                                          00000000005656382.00ZAINAL ARIFIN                                                         B      0140397    BCA               Gajah Mada        BONUS MEMBER      JUNI 2020                           1R014
11580044421                                          00000000000052230.00ZAINAL GOSAL                                                          B      0140397    BCA               Makassar          BONUS MEMBER      JUNI 2020                           1R014
10280110752                                          00000000000066198.00ZIRA ENDYANA NURSYAHBANI                                              B      0140397    BCA               KCU WAHID HASYIM  BONUS MEMBER      JUNI 2020                           1R014
18115145807                                          00000000000067750.00ZULKARNAIN NASUTION                                                   B      0140397    BCA               H.M.Yamin         BONUS MEMBER      JUNI 2020                           1R014
