0SP201906100033059008 00030331               00000000300124560.0000323BCA               BONUS MEMBER000000MEI 20190000000000                                                                             
17685051231                        00000000004283797.00A YUDI JAYA MUSRADHY P                                                                   BONUS MEMBER      MEI 2019                            014
14501001575                        00000000000114019.00A.NUNIK PRABOWO                                                                          BONUS MEMBER      MEI 2019                            014
13880409866                        00000000000103567.00ACHMAD YUSUF DR SPKK                                                                     BONUS MEMBER      MEI 2019                            014
17910573050                        00000000000968874.00ADRYAN FRISTIOHADI MSC-A                                                                 BONUS MEMBER      MEI 2019                            014
18220829988                        00000000000050290.00AFFANDI GUNAWAN                                                                          BONUS MEMBER      MEI 2019                            014
17360166532                        00000000000770772.00AGUS RINI SULISTIOWATY                                                                   BONUS MEMBER      MEI 2019                            014
18195213158                        00000000000256560.00AGUS WONGSO                                                                              BONUS MEMBER      MEI 2019                            014
10540962600                        00000000000226034.00ALAN DWILANGGA                                                                           BONUS MEMBER      MEI 2019                            014
11410618008                        00000000000169600.00ALBERT FLORENTINO                                                                        BONUS MEMBER      MEI 2019                            014
14582204377                        00000000000864791.00ALDO LAMMY                                                                               BONUS MEMBER      MEI 2019                            014
10253800205                        00000000000106550.00ALEX HARDJONO TJAHAYA                                                                    BONUS MEMBER      MEI 2019                            014
12581605007                        00000000000155947.00ALFRYATI VENTHY SANDA SAU TAN                                                            BONUS MEMBER      MEI 2019                            014
16220245762                        00000000000053200.00ALWIN JABARTI KIEMAS                                                                     BONUS MEMBER      MEI 2019                            014
12200053624                        00000000000053200.00AMAN YULIUS                                                                              BONUS MEMBER      MEI 2019                            014
12851104242                        00000000000193704.00AMIN SUMA                                                                                BONUS MEMBER      MEI 2019                            014
16265019343                        00000000000158833.00ANA SUSILOWATI SE                                                                        BONUS MEMBER      MEI 2019                            014
17890745534                        00000000000207184.00ANDI FAUZIAH                                                                             BONUS MEMBER      MEI 2019                            014
10270948880                        00000000000104707.00ANDRE ABENG                                                                              BONUS MEMBER      MEI 2019                            014
16120114211                        00000000000277270.00ANDREAS NATA SUPU                                                                        BONUS MEMBER      MEI 2019                            014
12180175680                        00000000000102296.00ANDREW MUGABE                                                                            BONUS MEMBER      MEI 2019                            014
17910710600                        00000000000053200.00ANGELA WILDA GEODELITA ZALUCHU                                                           BONUS MEMBER      MEI 2019                            014
18690593301                        00000000000099760.00ANITA JAMALUDIN SE                                                                       BONUS MEMBER      MEI 2019                            014
18585002018                        00000000000348274.00ANTON KUSUMA HADI WILOPO                                                                 BONUS MEMBER      MEI 2019                            014
18315061893                        00000000000067750.00APRIANTI BAWENTI                                                                         BONUS MEMBER      MEI 2019                            014
11970182825                        00000000000053200.00ARIANNY BUDIMAN SH                                                                       BONUS MEMBER      MEI 2019                            014
16430050662                        00000000000096229.00ARIFIN CHANDRA                                                                           BONUS MEMBER      MEI 2019                            014
14050227427                        00000000002775736.00ARIS YULIANTO                                                                            BONUS MEMBER      MEI 2019                            014
11191565792                        00000000000102239.00ASRIL                                                                                    BONUS MEMBER      MEI 2019                            014
11773086592                        00000000000153536.00BABANG SOETRISNO                                                                         BONUS MEMBER      MEI 2019                            014
13909519772                        00000000000290650.00BASRI                                                                                    BONUS MEMBER      MEI 2019                            014
12533226078                        00000000000053200.00BENYAMIN RAHAYU                                                                          BONUS MEMBER      MEI 2019                            014
15660270860                        00000000000057565.00BERNADETHA MARIES PRANAN                                                                 BONUS MEMBER      MEI 2019                            014
10292392931                        00000000000331458.00BOYDO IMMANUEL SARAGIH                                                                   BONUS MEMBER      MEI 2019                            014
14212295292                        00000000000256900.00BUDI RAHARDJO                                                                            BONUS MEMBER      MEI 2019                            014
10103448899                        00000000000050920.00CALVIN ALEXANDER EFANS J                                                                 BONUS MEMBER      MEI 2019                            014
13691033021                        00000000002139723.00CHARLIE BUDIMAN SH                                                                       BONUS MEMBER      MEI 2019                            014
14710032497                        00000000002587244.00CHARLOTHA PUTRI SHARON                                                                   BONUS MEMBER      MEI 2019                            014
17920438878                        00000000000138625.00CHRISTINE                                                                                BONUS MEMBER      MEI 2019                            014
11192151575                        00000000000053200.00CINDRA WATI JAP                                                                          BONUS MEMBER      MEI 2019                            014
12211205123                        00000000000083335.00CITRA HALIM                                                                              BONUS MEMBER      MEI 2019                            014
18050030734                        00000000000103640.00CORNELIA CHANDRA BSC                                                                     BONUS MEMBER      MEI 2019                            014
11710941510                        00000000000287896.00CORNELLYA KANDARY                                                                        BONUS MEMBER      MEI 2019                            014
10430970968                        00000000001988141.00CUT ZAKIA PUTRI FANDANI                                                                  BONUS MEMBER      MEI 2019                            014
18585131683                        00000000000053200.00DAMARIS TIKU                                                                             BONUS MEMBER      MEI 2019                            014
13451721435                        00000000000053200.00DAMAYANTI                                                                                BONUS MEMBER      MEI 2019                            014
11630357205                        00000000000105822.00DARMAWAN TEDJA                                                                           BONUS MEMBER      MEI 2019                            014
17920315482                        00000000000566703.00DARUSMAN M LAMANGKAU SE                                                                  BONUS MEMBER      MEI 2019                            014
17935339907                        00000000000061845.00DEBI HOTMARIA SILALAHI                                                                   BONUS MEMBER      MEI 2019                            014
17910669383                        00000000001030136.00DEDENG DESRIADI AMIRUDDIN ,ST,MM                                                         BONUS MEMBER      MEI 2019                            014
11192097287                        00000000013359627.00DELVIRA                                                                                  BONUS MEMBER      MEI 2019                            014
18205033315                        00000000010333893.00DERMAWATI TURNIP                                                                         BONUS MEMBER      MEI 2019                            014
10031206609                        00000000000053200.00DESI NATALIA                                                                             BONUS MEMBER      MEI 2019                            014
15280198139                        00000000000344200.00DESRIYANNI SUMARDI OR LI                                                                 BONUS MEMBER      MEI 2019                            014
18780045141                        00000000000066538.00DESSY ARISTIA                                                                            BONUS MEMBER      MEI 2019                            014
10041619898                        00000000000053200.00DESY MARIANI                                                                             BONUS MEMBER      MEI 2019                            014
11285783614                        00000000000143505.00DHARMA SALIM                                                                             BONUS MEMBER      MEI 2019                            014
18235006479                        00000000000474713.00DIAN DOMINIKA BR GINTING                                                                 BONUS MEMBER      MEI 2019                            014
11302095897                        00000000000332560.00DIAN TJAHYARINA                                                                          BONUS MEMBER      MEI 2019                            014
15220020616                        00000000000072600.00DINA KRISTOMULJONO                                                                       BONUS MEMBER      MEI 2019                            014
17920178531                        00000000000100730.00DIONISIUS RORI PARENGKUA                                                                 BONUS MEMBER      MEI 2019                            014
10948083054                        00000000000162810.00DRA. MUSPIDAH                                                                            BONUS MEMBER      MEI 2019                            014
18535226802                        00000000000053200.00EFRIDA YULITA MEO SR CLA                                                                 BONUS MEMBER      MEI 2019                            014
11191809942                        00000000000101700.00EKA YULI ASTUTI                                                                          BONUS MEMBER      MEI 2019                            014
12331649033                        00000000000552022.00ELLYANY SUGIAMAN                                                                         BONUS MEMBER      MEI 2019                            014
10021223785                        00000000000340223.00ELLYJATY SALIM                                                                           BONUS MEMBER      MEI 2019                            014
18295006559                        00000000000101640.00ELVINA OLIVIA MANOPO                                                                     BONUS MEMBER      MEI 2019                            014
16610439592                        00000000000101458.00ELYEZER SAMPE                                                                            BONUS MEMBER      MEI 2019                            014
16041046721                        00000000000053200.00EMILY HAPPYWISE                                                                          BONUS MEMBER      MEI 2019                            014
12581563851                        00000000003957736.00EMMY INDRIATY                                                                            BONUS MEMBER      MEI 2019                            014
15415035435                        00000000000857593.00ENDY MUHARDIN MOEGNI DR                                                                  BONUS MEMBER      MEI 2019                            014
15065069935                        00000000002936605.00ENI SUHARTATIK                                                                           BONUS MEMBER      MEI 2019                            014
16130003135                        00000000000121386.00EPLIN MANGEMBULUDE                                                                       BONUS MEMBER      MEI 2019                            014
18780162610                        00000000000050177.00ERAWITA ENDY M DR                                                                        BONUS MEMBER      MEI 2019                            014
18605088577                        00000000000101700.00ERICH SIAHAAN                                                                            BONUS MEMBER      MEI 2019                            014
18205012345                        00000000000102278.00ERINA NAINGGOLAN                                                                         BONUS MEMBER      MEI 2019                            014
12410029416                        00000000000107762.00ERNI ANGGRAENI                                                                           BONUS MEMBER      MEI 2019                            014
18600271122                        00000000000224308.00ESLYN R. JABAR                                                                           BONUS MEMBER      MEI 2019                            014
10281796967                        00000000000222950.00ESTER JULIATI SUSANTO                                                                    BONUS MEMBER      MEI 2019                            014
12881053146                        00000000000053200.00ESTER JUNINGSIH SUDIONO                                                                  BONUS MEMBER      MEI 2019                            014
14650374903                        00000000000067750.00ESTER PAULINA KUSLOSARIR                                                                 BONUS MEMBER      MEI 2019                            014
16155020567                        00000000000443528.00ESTER TJENDRAWATI                                                                        BONUS MEMBER      MEI 2019                            014
10292280911                        00000000000105483.00EVA MAYADARI                                                                             BONUS MEMBER      MEI 2019                            014
12581684861                        00000000000216160.00EVIE MARIA                                                                               BONUS MEMBER      MEI 2019                            014
10181267126                        00000000000108878.00FENSI SAFAN S. TP                                                                        BONUS MEMBER      MEI 2019                            014
14501126122                        00000000000053200.00FENTY                                                                                    BONUS MEMBER      MEI 2019                            014
10060230340                        00000000000420986.00FERDYNANDS SAMPE                                                                         BONUS MEMBER      MEI 2019                            014
13422364673                        00000000000050177.00FERNANDI DR                                                                              BONUS MEMBER      MEI 2019                            014
17970003651                        00000000004124204.00FITRIYANTI RASYID                                                                        BONUS MEMBER      MEI 2019                            014
18205032316                        00000000001616856.00FRANSISKUS FEDRIKSEN S                                                                   BONUS MEMBER      MEI 2019                            014
10491569688                        00000000005348104.00FRANSISKUS YANNO SOERATMAN                                                               BONUS MEMBER      MEI 2019                            014
17835032337                        00000000000268540.00GANTIARTO STEPHANUS                                                                      BONUS MEMBER      MEI 2019                            014
10870065515                        00000000000053200.00GO MEYER GAUTAMA                                                                         BONUS MEMBER      MEI 2019                            014
11710933029                        00000000000053200.00GOLDINA PRITI PINTARTI C                                                                 BONUS MEMBER      MEI 2019                            014
10108377888                        00000000000106558.00GRESCE KATALINA                                                                          BONUS MEMBER      MEI 2019                            014
17245011369                        00000000000103252.00GUSTI SETIAWAN HAFID                                                                     BONUS MEMBER      MEI 2019                            014
15610136615                        00000000000178815.00H SUBKHAN DRS                                                                            BONUS MEMBER      MEI 2019                            014
13900389212                        00000000000528500.00HAMSIAH SANGKALA                                                                         BONUS MEMBER      MEI 2019                            014
10871046688                        00000000000054534.00HANDAJANI ENDRO, SH                                                                      BONUS MEMBER      MEI 2019                            014
17920451742                        00000000000214770.00HANIFA                                                                                   BONUS MEMBER      MEI 2019                            014
17570037697                        00000000000308164.00HANNA KUSNADI                                                                            BONUS MEMBER      MEI 2019                            014
10262244251                        00000000003211681.00HANNA SILVANNA MANONGKO                                                                  BONUS MEMBER      MEI 2019                            014
10312348720                        00000000000053200.00HANS HANANTO ANDREAS                                                                     BONUS MEMBER      MEI 2019                            014
11451329036                        00000000000072600.00HAPPY SIRINGORINGO                                                                       BONUS MEMBER      MEI 2019                            014
10291944751                        00000000000099760.00HARDINAYATI                                                                              BONUS MEMBER      MEI 2019                            014
17955187806                        00000000000102185.00HARDIYANTI MANOPPO                                                                       BONUS MEMBER      MEI 2019                            014
17920237333                        00000000000101055.00HARDY GONDOKUSUMO                                                                        BONUS MEMBER      MEI 2019                            014
18221041275                        00000000000052230.00HARI PRASETYO                                                                            BONUS MEMBER      MEI 2019                            014
17795019669                        00000000005590450.00HARUN D. TUMBUAN                                                                         BONUS MEMBER      MEI 2019                            014
10221692241                        00000000000051018.00HASAN                                                                                    BONUS MEMBER      MEI 2019                            014
15930411967                        00000000000169600.00HASAN                                                                                    BONUS MEMBER      MEI 2019                            014
17870016845                        00000000000542514.00HASNAH                                                                                   BONUS MEMBER      MEI 2019                            014
17685089955                        00000000000867676.00HASNIH S                                                                                 BONUS MEMBER      MEI 2019                            014
18320091552                        00000000000108522.00HELEN ALPRIDA LIMBONG                                                                    BONUS MEMBER      MEI 2019                            014
10281733167                        00000000000169600.00HELENA WIDJAJA                                                                           BONUS MEMBER      MEI 2019                            014
10210293884                        00000000000263690.00HENDARTO SANTOSO                                                                         BONUS MEMBER      MEI 2019                            014
15110144468                        00000000001219607.00HENNY JUARIA                                                                             BONUS MEMBER      MEI 2019                            014
16140200440                        00000000000053200.00HENNY PUSPAWATI SE                                                                       BONUS MEMBER      MEI 2019                            014
18585064722                        00000000000633212.00HERIYANE YANCAR ARUS                                                                     BONUS MEMBER      MEI 2019                            014
10880652192                        00000000001015447.00HERLIN YUNARA                                                                            BONUS MEMBER      MEI 2019                            014
13650261258                        00000000000053200.00HERLINA H.                                                                               BONUS MEMBER      MEI 2019                            014
14020181490                        00000000000080942.00HERMA DAMAYANTI                                                                          BONUS MEMBER      MEI 2019                            014
12903845619                        00000000000100730.00HERMAN AMIL S HUT                                                                        BONUS MEMBER      MEI 2019                            014
18275076119                        00000000000052475.00HERMANUS JOHN                                                                            BONUS MEMBER      MEI 2019                            014
10650239687                        00000000000053200.00HERU SARWONO                                                                             BONUS MEMBER      MEI 2019                            014
12531229535                        00000000000053200.00HIDAJAT  TJAHJADI                                                                        BONUS MEMBER      MEI 2019                            014
10921366671                        00000000000119980.00HIDAYAT                                                                                  BONUS MEMBER      MEI 2019                            014
17160038327                        00000000000593102.00HJ. NETTY NASIR                                                                          BONUS MEMBER      MEI 2019                            014
17245057709                        00000000000050290.00IDAR BARIBI SKM                                                                          BONUS MEMBER      MEI 2019                            014
10291362418                        00000000002964030.00IMACULATA KORNIA                                                                         BONUS MEMBER      MEI 2019                            014
11981615498                        00000000000600490.00IMANUEL ADAM                                                                             BONUS MEMBER      MEI 2019                            014
10870989547                        00000000000945988.00IMRAN                                                                                    BONUS MEMBER      MEI 2019                            014
12460330001                        00000000000903996.00INAVIANTI WINARTO                                                                        BONUS MEMBER      MEI 2019                            014
11010134272                        00000000000050290.00INDAH SUSIANI                                                                            BONUS MEMBER      MEI 2019                            014
14540284551                        00000000000119160.00INDANIARTI                                                                               BONUS MEMBER      MEI 2019                            014
15880209959                        00000000018140678.00INDRIYATI SALIM                                                                          BONUS MEMBER      MEI 2019                            014
14260366811                        00000000000332603.00INGE H S / THEO A D                                                                      BONUS MEMBER      MEI 2019                            014
16380003447                        00000000000053200.00IR. SOEBIJANTO TRIWIBOWO                                                                 BONUS MEMBER      MEI 2019                            014
11340719227                        00000000000100682.00IRAWAN                                                                                   BONUS MEMBER      MEI 2019                            014
16465093840                        00000000000103738.00IRWAN HARIYADI                                                                           BONUS MEMBER      MEI 2019                            014
18585147032                        00000000000050290.00IWAN SETYO LESMANA                                                                       BONUS MEMBER      MEI 2019                            014
10030200101                        00000000000282023.00JANTI W                                                                                  BONUS MEMBER      MEI 2019                            014
10052249200                        00000000000103640.00JEKLYN RUVINA A BEE                                                                      BONUS MEMBER      MEI 2019                            014
10181090234                        00000000001681588.00JOHANES PUTRA MAYNINEDO                                                                  BONUS MEMBER      MEI 2019                            014
13900496663                        00000000000053200.00JOSE JULIANO BERNITO KUNCONO                                                             BONUS MEMBER      MEI 2019                            014
12481565989                        00000000000135509.00JOSEPHA HADIPRANOTO                                                                      BONUS MEMBER      MEI 2019                            014
11781176392                        00000000000102270.00JOUSJE ADAM                                                                              BONUS MEMBER      MEI 2019                            014
11681694248                        00000000000856619.00JUANITA ICHSANI                                                                          BONUS MEMBER      MEI 2019                            014
12910359331                        00000000000053200.00JULIANA KULLIT                                                                           BONUS MEMBER      MEI 2019                            014
10530077110                        00000000003144124.00JULIUS BERNHARD WARELLA                                                                  BONUS MEMBER      MEI 2019                            014
10885727030                        00000000000160870.00KALEB YEREMIA YUNIOR KOR                                                                 BONUS MEMBER      MEI 2019                            014
10710040915                        00000000000547264.00KENNETH RAY VICI LENGKON                                                                 BONUS MEMBER      MEI 2019                            014
18375032844                        00000000000055188.00KHAIRINA                                                                                 BONUS MEMBER      MEI 2019                            014
14970573513                        00000000000205183.00KIEMI MANALU                                                                             BONUS MEMBER      MEI 2019                            014
12620007202                        00000000000324800.00KIKIE HARDI                                                                              BONUS MEMBER      MEI 2019                            014
11941370727                        00000000000192540.00KOE HOENG WHENG                                                                          BONUS MEMBER      MEI 2019                            014
12211227763                        00000000000208400.00KONNI M TAMBUNAN                                                                         BONUS MEMBER      MEI 2019                            014
12700086081                        00000000000134680.00KRISTIANI UTOMO                                                                          BONUS MEMBER      MEI 2019                            014
17855044188                        00000000000152140.00KRISTIN SUSILOWATI IKWAN                                                                 BONUS MEMBER      MEI 2019                            014
10331040303                        00000000000288506.00LANNY SANJAYA                                                                            BONUS MEMBER      MEI 2019                            014
17920002140                        00000000000103074.00LAUW SIE LING                                                                            BONUS MEMBER      MEI 2019                            014
14411013850                        00000000000054817.00LENNI TJAHJADI                                                                           BONUS MEMBER      MEI 2019                            014
17540409956                        00000000000053200.00LEONY JOSNITA HANDJAJA                                                                   BONUS MEMBER      MEI 2019                            014
18803839233                        00000000000067600.00LIANITA TANUWIJAYA                                                                       BONUS MEMBER      MEI 2019                            014
15060026981                        00000000000327310.00LIE AY HWA                                                                               BONUS MEMBER      MEI 2019                            014
14300240203                        00000000000053200.00LIE FIE TJEN                                                                             BONUS MEMBER      MEI 2019                            014
10090888919                        00000000000150200.00LIEM ENG MEI                                                                             BONUS MEMBER      MEI 2019                            014
17540460269                        00000000000499400.00LILIANY WIJAYA                                                                           BONUS MEMBER      MEI 2019                            014
11710479824                        00000000000152033.00LILIK YUNIATI                                                                            BONUS MEMBER      MEI 2019                            014
12762222222                        00000000009861335.00LILY NGADIMAN                                                                            BONUS MEMBER      MEI 2019                            014
17820060894                        00000000000055334.00LINAWATI SH                                                                              BONUS MEMBER      MEI 2019                            014
17795143955                        00000000004007203.00LINDA                                                                                    BONUS MEMBER      MEI 2019                            014
17830557878                        00000000000051988.00LIONG SIOE GIE                                                                           BONUS MEMBER      MEI 2019                            014
15940197891                        00000000000053200.00LISTRI NURHASISA                                                                         BONUS MEMBER      MEI 2019                            014
10281828478                        00000000000056612.00LOLITA PATRICIA CHANDRA                                                                  BONUS MEMBER      MEI 2019                            014
17570069858                        00000000000053200.00LOUISA SUSIANA HAKIM                                                                     BONUS MEMBER      MEI 2019                            014
12302337960                        00000000000081902.00LUCY VANYA LOING                                                                         BONUS MEMBER      MEI 2019                            014
16280639999                        00000000000053200.00LUSIA RUDIHASWORO                                                                        BONUS MEMBER      MEI 2019                            014
18620235661                        00000000000700602.00LYDIANA DEWI EFFENDY                                                                     BONUS MEMBER      MEI 2019                            014
10183855112                        00000000000053200.00M BELLA ROSARIA                                                                          BONUS MEMBER      MEI 2019                            014
16252763836                        00000000000201936.00M JABIDI YUSUF                                                                           BONUS MEMBER      MEI 2019                            014
18160408007                        00000000000393284.00MAGDALANI SANTOSO                                                                        BONUS MEMBER      MEI 2019                            014
14281621569                        00000000000365394.00MAGDALENA KUSNADI                                                                        BONUS MEMBER      MEI 2019                            014
18190339344                        00000000000701870.00MANUELLA ARTAWATY PURBA                                                                  BONUS MEMBER      MEI 2019                            014
12851153031                        00000000000111400.00MARGARETH STEFANNY WINAT                                                                 BONUS MEMBER      MEI 2019                            014
10260829971                        00000000000461180.00MARIA BEATRIX LUNTUNGAN                                                                  BONUS MEMBER      MEI 2019                            014
16840153876                        00000000000221247.00MARIANCE                                                                                 BONUS MEMBER      MEI 2019                            014
10031555999                        00000000000355016.00MARIO RENDY NGADIMAN                                                                     BONUS MEMBER      MEI 2019                            014
10292155075                        00000000000463349.00MARISA CAROLINA TEDJA                                                                    BONUS MEMBER      MEI 2019                            014
14650268356                        00000000023414418.00MARSUDI                                                                                  BONUS MEMBER      MEI 2019                            014
11520325049                        00000000000338914.00MARTHEN CAREL KORWA                                                                      BONUS MEMBER      MEI 2019                            014
16610493350                        00000000000261550.00MARTINUS B. PALAMBA                                                                      BONUS MEMBER      MEI 2019                            014
17910353122                        00000000000050290.00MARWAN                                                                                   BONUS MEMBER      MEI 2019                            014
17795044337                        00000000000161408.00MARWAN AMIR                                                                              BONUS MEMBER      MEI 2019                            014
11700260441                        00000000000365049.00MARYJANE LUMANAUW                                                                        BONUS MEMBER      MEI 2019                            014
10640167297                        00000000000957247.00MEDYAWATI LIMANTARA DRG                                                                  BONUS MEMBER      MEI 2019                            014
17019193739                        00000000000291270.00MEGAWATY KAMIR SE                                                                        BONUS MEMBER      MEI 2019                            014
16225011140                        00000000000286525.00MEIDARI UTAMI                                                                            BONUS MEMBER      MEI 2019                            014
17160069281                        00000000001123446.00MELAWATY ABYANI                                                                          BONUS MEMBER      MEI 2019                            014
10884820207                        00000000001181068.00MELYSA YULIANA                                                                           BONUS MEMBER      MEI 2019                            014
14411287399                        00000000000102185.00MERIAM SELONITA SAMBO                                                                    BONUS MEMBER      MEI 2019                            014
11710716788                        00000000002073306.00MERVYN                                                                                   BONUS MEMBER      MEI 2019                            014
10210293175                        00000000000205490.00METRY WIDJAJA KOHAR                                                                      BONUS MEMBER      MEI 2019                            014
13053007500                        00000000003364492.00MEYLIA                                                                                   BONUS MEMBER      MEI 2019                            014
17880158575                        00000000000159221.00MIMIK DIAH LESTARI                                                                       BONUS MEMBER      MEI 2019                            014
12752058912                        00000000000248655.00MINARNI KOMALA SARI                                                                      BONUS MEMBER      MEI 2019                            014
12741034559                        00000000004979231.00MIRA REBEKA SANI                                                                         BONUS MEMBER      MEI 2019                            014
12308061090                        00000000001553601.00MIRNA SAMPE                                                                              BONUS MEMBER      MEI 2019                            014
17920345365                        00000000000072088.00MOH YAKUB KARAENG MATASA                                                                 BONUS MEMBER      MEI 2019                            014
17970228947                        00000000000475783.00MUFTIHATURRAHMAH BURHAMZ                                                                 BONUS MEMBER      MEI 2019                            014
10255460574                        00000000000590694.00MUH. KADIR                                                                               BONUS MEMBER      MEI 2019                            014
17910839548                        00000000000105774.00MUHAMMAD JUSRAN AZIS LUMELE                                                              BONUS MEMBER      MEI 2019                            014
12940047318                        00000000000227800.00MUKLAM                                                                                   BONUS MEMBER      MEI 2019                            014
13860011858                        00000000000092630.00MULIANA                                                                                  BONUS MEMBER      MEI 2019                            014
10250248121                        00000000000155050.00MULIAWATI MUHIDDIN                                                                       BONUS MEMBER      MEI 2019                            014
18460218447                        00000000000098450.00MUSLIHUL HANAS                                                                           BONUS MEMBER      MEI 2019                            014
15280182526                        00000000000271450.00NANSI ARJANI HALIM                                                                       BONUS MEMBER      MEI 2019                            014
10183203204                        00000000000174450.00NG FOK DJIN                                                                              BONUS MEMBER      MEI 2019                            014
14100024883                        00000000000058050.00NG UTOMO SANJAYA                                                                         BONUS MEMBER      MEI 2019                            014
18290171513                        00000000000644827.00NINIK ELSAWATIE                                                                          BONUS MEMBER      MEI 2019                            014
18140091414                        00000000000111400.00NONTJE CH LUMINGKEWAS                                                                    BONUS MEMBER      MEI 2019                            014
18585146125                        00000000000225836.00NOOR LAILY                                                                               BONUS MEMBER      MEI 2019                            014
15210742605                        00000000000210825.00NOVI HANDAYANI                                                                           BONUS MEMBER      MEI 2019                            014
11199004598                        00000000000411558.00NURHASANAH HS                                                                            BONUS MEMBER      MEI 2019                            014
10255830223                        00000000000476832.00NURJAYA SH                                                                               BONUS MEMBER      MEI 2019                            014
17640857212                        00000000000372282.00NURUL AZIZAH                                                                             BONUS MEMBER      MEI 2019                            014
15740065124                        00000000000053200.00NY THERESIANA SANTI                                                                      BONUS MEMBER      MEI 2019                            014
12853001911                        00000000000227800.00OEI IRENE ANGELINE WIJAY                                                                 BONUS MEMBER      MEI 2019                            014
10353041450                        00000000000189000.00OSBORN BUDIMAN                                                                           BONUS MEMBER      MEI 2019                            014
17155072989                        00000000000162107.00PATRISIA SUPARTINA                                                                       BONUS MEMBER      MEI 2019                            014
18265787777                        00000000000111400.00PETER LIESTYANTO                                                                         BONUS MEMBER      MEI 2019                            014
17800213392                        00000000003991553.00PREISY ANGEL M GOLIOTH S                                                                 BONUS MEMBER      MEI 2019                            014
17895117285                        00000000000053200.00PRISCILLA KANOH SH                                                                       BONUS MEMBER      MEI 2019                            014
11700273845                        00000000000184271.00PRISCILLA VIRGINIA LUMANAUW                                                              BONUS MEMBER      MEI 2019                            014
15000500463                        00000000000053200.00QUEENY LIU                                                                               BONUS MEMBER      MEI 2019                            014
12300840631                        00000000000111400.00RAHAYU GUNAWAN                                                                           BONUS MEMBER      MEI 2019                            014
18711007202                        00000000000053200.00RAHMAH AFRIANI                                                                           BONUS MEMBER      MEI 2019                            014
17970160625                        00000000000532556.00RAHMITA BURHAMZAH                                                                        BONUS MEMBER      MEI 2019                            014
18585016191                        00000000000400436.00RAMAYDA                                                                                  BONUS MEMBER      MEI 2019                            014
10181365764                        00000000000476556.00RATIH PUSPITA SARI                                                                       BONUS MEMBER      MEI 2019                            014
15290114006                        00000000000074441.00RATIH SARI JUSMAN                                                                        BONUS MEMBER      MEI 2019                            014
11821231235                        00000000000124053.00RATNA DEWI                                                                               BONUS MEMBER      MEI 2019                            014
12741009970                        00000000000695017.00RAY LAMMY                                                                                BONUS MEMBER      MEI 2019                            014
18275283882                        00000000000085410.00RENI JAYANTI ANGGRAINI                                                                   BONUS MEMBER      MEI 2019                            014
16795040068                        00000000000216661.00RENSLY Y SAADJAD                                                                         BONUS MEMBER      MEI 2019                            014
10321937313                        00000000000111400.00RIA SILVIA                                                                               BONUS MEMBER      MEI 2019                            014
11391712064                        00000000000053200.00RIA SUHARTI                                                                              BONUS MEMBER      MEI 2019                            014
10021092656                        00000000000053200.00RIANA ARIESTYA LOEKITO                                                                   BONUS MEMBER      MEI 2019                            014
19710036585                        00000000000399896.00RINA ARIYANIE TAHIR                                                                      BONUS MEMBER      MEI 2019                            014
17920717351                        00000000003340444.00RISDIYANTO                                                                               BONUS MEMBER      MEI 2019                            014
17920441119                        00000000001904557.00ROBERTH PARENGKUAN                                                                       BONUS MEMBER      MEI 2019                            014
18000517471                        00000000000321211.00ROSALINA SIPAYUNG                                                                        BONUS MEMBER      MEI 2019                            014
18705168993                        00000000000111400.00ROSITA NATADARMA DJAJA                                                                   BONUS MEMBER      MEI 2019                            014
11410577344                        00000000000101846.00RUDI SANTOSO                                                                             BONUS MEMBER      MEI 2019                            014
12881095361                        00000000000336919.00RULLY ARISCHANDRA                                                                        BONUS MEMBER      MEI 2019                            014
18585127929                        00000000001204638.00RUSDIANA,SE                                                                              BONUS MEMBER      MEI 2019                            014
16665050541                        00000000006724184.00RUSIANI                                                                                  BONUS MEMBER      MEI 2019                            014
11410324047                        00000000004450722.00RUTH HANDAYANI DARMAWAN                                                                  BONUS MEMBER      MEI 2019                            014
18140313158                        00000000000053200.00RUTH PAULUS, SE                                                                          BONUS MEMBER      MEI 2019                            014
12581015901                        00000000004299333.00SALIM                                                                                    BONUS MEMBER      MEI 2019                            014
12910247967                        00000000000100987.00SALLY ELISABETH                                                                          BONUS MEMBER      MEI 2019                            014
16270097543                        00000000000100682.00SALMA LUBIS                                                                              BONUS MEMBER      MEI 2019                            014
17910170583                        00000000026634901.00SALMIA RODHIYA HUSAINY                                                                   BONUS MEMBER      MEI 2019                            014
11950715568                        00000000000203259.00SANTY                                                                                    BONUS MEMBER      MEI 2019                            014
10040049177                        00000000000126678.00SARAH AYUDA                                                                              BONUS MEMBER      MEI 2019                            014
10222308885                        00000000001938993.00SARMANA                                                                                  BONUS MEMBER      MEI 2019                            014
11010200209                        00000000004393502.00SETYOTUHU TATIK                                                                          BONUS MEMBER      MEI 2019                            014
17895423521                        00000000000067120.00SIDRATUL MUNTAHA                                                                         BONUS MEMBER      MEI 2019                            014
10091189304                        00000000000072600.00SISWANTO                                                                                 BONUS MEMBER      MEI 2019                            014
10110468733                        00000000000052230.00SONY CHANDRASA WIDJAJA                                                                   BONUS MEMBER      MEI 2019                            014
14361496102                        00000000000053200.00SRIANA ANGGREINI                                                                         BONUS MEMBER      MEI 2019                            014
16240695390                        00000000000053200.00STACIA ANGGAPUTRI                                                                        BONUS MEMBER      MEI 2019                            014
18295083863                        00000000000672345.00STANLEY ALEXANDER DORING                                                                 BONUS MEMBER      MEI 2019                            014
10530074676                        00000000000102008.00STEFANUS BONIFASIUS PASUMA                                                               BONUS MEMBER      MEI 2019                            014
12533338585                        00000000006540737.00STEVIE LENGKONG                                                                          BONUS MEMBER      MEI 2019                            014
14281731054                        00000000000402400.00SUHENJANTI SOLAIMAN                                                                      BONUS MEMBER      MEI 2019                            014
10081835956                        00000000000061691.00SUJOKO AH.T                                                                              BONUS MEMBER      MEI 2019                            014
17685098881                        00000000000261065.00SUKRAWAN                                                                                 BONUS MEMBER      MEI 2019                            014
17910249091                        00000000005858842.00SULEMAN MILE                                                                             BONUS MEMBER      MEI 2019                            014
12861012044                        00000000000423352.00SULHANA ARMAINI                                                                          BONUS MEMBER      MEI 2019                            014
11280189983                        00000000000471949.00SUNDARI                                                                                  BONUS MEMBER      MEI 2019                            014
10192243131                        00000000000261127.00SUPRIJANTO                                                                               BONUS MEMBER      MEI 2019                            014
12540333371                        00000000000560420.00SUSANTI OEY                                                                              BONUS MEMBER      MEI 2019                            014
10291671861                        00000000000105822.00SUSANTI SE                                                                               BONUS MEMBER      MEI 2019                            014
11410476271                        00000000004384875.00SUZANNA ELLY SENTOSA                                                                     BONUS MEMBER      MEI 2019                            014
10341981041                        00000000000106356.00SYAFRIDA HANUM                                                                           BONUS MEMBER      MEI 2019                            014
14361242143                        00000000000092679.00SYAFRINA                                                                                 BONUS MEMBER      MEI 2019                            014
16155200786                        00000000000252050.00SYLVIA CHRISTINA                                                                         BONUS MEMBER      MEI 2019                            014
13080072162                        00000000004601931.00TEDDY WIJAYAPUTRA                                                                        BONUS MEMBER      MEI 2019                            014
10010455375                        00000000000190455.00TEGUH RIYADI                                                                             BONUS MEMBER      MEI 2019                            014
12851058062                        00000000000053200.00THEN PIN NGIAN                                                                           BONUS MEMBER      MEI 2019                            014
11700423570                        00000000000439254.00THEODORA IVONNE TINEKE GOLIOT                                                            BONUS MEMBER      MEI 2019                            014
10031705486                        00000000000053200.00TIO TJEN AI                                                                              BONUS MEMBER      MEI 2019                            014
17540888889                        00000000000053200.00TJHIEN FIE WOEN                                                                          BONUS MEMBER      MEI 2019                            014
17050073038                        00000000000111400.00TJIANG TJI PENG                                                                          BONUS MEMBER      MEI 2019                            014
18000515184                        00000000003052267.00TONGAM F SILABAN                                                                         BONUS MEMBER      MEI 2019                            014
11196004352                        00000000000050665.00TONGON SARIHON SITORUS                                                                   BONUS MEMBER      MEI 2019                            014
11415788888                        00000000000282023.00TONY                                                                                     BONUS MEMBER      MEI 2019                            014
11710553897                        00000000000443286.00TRI PUJI ASTUTI                                                                          BONUS MEMBER      MEI 2019                            014
17910493684                        00000000000148542.00USMAN                                                                                    BONUS MEMBER      MEI 2019                            014
12851193156                        00000000000136474.00VANYA UTAMI SUMA                                                                         BONUS MEMBER      MEI 2019                            014
14280024983                        00000000000052230.00VELDA DWITAMI SUMA                                                                       BONUS MEMBER      MEI 2019                            014
13880480749                        00000000000055625.00VELIWATI                                                                                 BONUS MEMBER      MEI 2019                            014
17835097536                        00000000000211795.00VICTORIA NURHAYATI                                                                       BONUS MEMBER      MEI 2019                            014
16010017074                        00000000000217397.00WANDA MARIA NADIYENSI                                                                    BONUS MEMBER      MEI 2019                            014
15085723160                        00000000000072600.00WARAS                                                                                    BONUS MEMBER      MEI 2019                            014
13800831376                        00000000000111400.00WEIDI                                                                                    BONUS MEMBER      MEI 2019                            014
13191467131                        00000000000053200.00WELLA SOLIHIN                                                                            BONUS MEMBER      MEI 2019                            014
11410592998                        00000000000456186.00WELLY DJUNAIDI                                                                           BONUS MEMBER      MEI 2019                            014
17920333456                        00000000000102007.00WILLYANTO                                                                                BONUS MEMBER      MEI 2019                            014
14010427113                        00000000001098043.00WINARTI                                                                                  BONUS MEMBER      MEI 2019                            014
12450591141                        00000000000053200.00WINY ANDI PUTRO                                                                          BONUS MEMBER      MEI 2019                            014
16700225061                        00000000000225860.00YACOB CHRISTIAN                                                                          BONUS MEMBER      MEI 2019                            014
16240123931                        00000000000053200.00YATI KUMALA                                                                              BONUS MEMBER      MEI 2019                            014
11520368066                        00000000000641021.00YAYUK RIWAYATI                                                                           BONUS MEMBER      MEI 2019                            014
15375036719                        00000000000646986.00YB JALU DANANJAYA                                                                        BONUS MEMBER      MEI 2019                            014
16750538990                        00000000000121265.00YEREMIA BAGUS PRATAMA                                                                    BONUS MEMBER      MEI 2019                            014
17925086223                        00000000000629768.00YOSIANTO                                                                                 BONUS MEMBER      MEI 2019                            014
14290532944                        00000000000526512.00YOYOK DWI HIMALAYA                                                                       BONUS MEMBER      MEI 2019                            014
15210665007                        00000000000050532.00YULI ASTERINA                                                                            BONUS MEMBER      MEI 2019                            014
12872372513                        00000000011445944.00YULIANTI LIAN                                                                            BONUS MEMBER      MEI 2019                            014
17920687151                        00000000000061717.00YUMIATI PALINDANG                                                                        BONUS MEMBER      MEI 2019                            014
10120280899                        00000000000445961.00ZAINAL ARIFIN                                                                            BONUS MEMBER      MEI 2019                            014
10280110752                        00000000000095752.00ZIRA ENDYANA NURSYAHBANI                                                                 BONUS MEMBER      MEI 2019                            014
