FK;KD_JENIS_TRANSAKSI;FG_PENGGANTI;NOMOR_FAKTUR;MASA_PAJAK;TAHUN_PAJAK;TANGGAL_FAKTUR;NPWP;NAMA;ALAMAT_LENGKAP;JUMLAH_DPP;JUMLAH_PPN;JUMLAH_PPNBM;ID_KETERANGAN_TAMBAHAN;FP_UANG_MUKA;UANG_MUKA_DPP;UANG_MUKA_PPN;UANG_MUKA_PPNBM;REFERENSI
LT;NPWP;NAMA;JALAN;BLOK;NOMOR;RT;RW;KECAMATAN;KELURAHAN;KABUPATEN;PROPINSI;KODE_POS;NOMOR_TELEPON
OF;KODE_OBJEK;NAMA;HARGA_SATUAN;JUMLAH_BARANG;HARGA_TOTAL;DISKON;DPP;PPN;TARIF_PPNBM;PPNBM
FK;01;0;0041534881645;12;2015;08/12/2015;478640824626000;"Anang Purwito";"Jl.SLAMET RIYADI GANG CENTRAL KAV 7 JEMBER 68112";1908328;190832;0;0;0;0;0;0;18129
LT;478640824626000;"Anang Purwito";-;-;-;0;0;-;-;-;-;-;-
OF;NT020006;"Echina-C Plus";160720;4;642880;0;584436;58444;0;0
OF;NT020010;Ginsana;283220;1;283220;0;257473;25747;0;0
OF;NT020004;Legreskin;260680;2;521360;0;473964;47396;0;0
OF;NT020001;Legres;130340;5;651700;0;592455;59245;0;0
FK;01;0;0041534881728;12;2015;14/12/2015;073245110047000;"Inneke Kusumo";"Jl.Pluit sakti raya no.143 Rt:09 Rw:07

Pluit Penjaringan

Jakarta Utara";1383637;138363;0;0;0;0;0;0;147931
LT;073245110047000;"Inneke Kusumo";-;-;-;0;0;-;-;-;-;-;-
OF;NT020003;"Magozai ";598000;2;1196000;0;1087273;108727;0;0
OF;HF060004;"HF Joint Booster";326000;1;326000;0;296364;29636;0;0
FK;01;0;0041534881798;12;2015;16/12/2015;597360627532000;"AGUS HARIYANTO";"Jl. Pandawa AF-6 Grogol Indah Sukoharjo";1135691;113569;0;0;0;0;0;0;18223
LT;597360627532000;"AGUS HARIYANTO";-;-;-;0;0;-;-;-;-;-;-
OF;NT020003;"Magozai ";562120;2;1124240;0;1022036;102204;0;0
OF;NT020001;Legres;125020;1;125020;0;113655;11365;0;0
FK;01;0;0041534881803;12;2015;16/12/2015;597360627532000;"AGUS HARIYANTO";"Jl. Pandawa AF-6 Grogol Indah Sukoharjo";511018;51102;0;0;0;0;0;0;18228
LT;597360627532000;"AGUS HARIYANTO";-;-;-;0;0;-;-;-;-;-;-
OF;NT020003;"Magozai ";562120;1;562120;0;511018;51102;0;0
FK;01;0;0041534881906;12;2015;19/12/2015;597360627532000;"AGUS HARIYANTO";"Jl. Pandawa AF-6 Grogol Indah Sukoharjo";1632182;163218;0;0;0;0;0;0;18282
LT;597360627532000;"AGUS HARIYANTO";-;-;-;0;0;-;-;-;-;-;-
OF;NT020003;"Magozai ";562120;2;1124240;0;1022036;102204;0;0
OF;NT020001;Legres;125020;1;125020;0;113655;11365;0;0
OF;NT020004;Legreskin;250040;1;250040;0;227309;22731;0;0
OF;HF060011;"HF Salmon Oil (30)";98700;3;296100;0;269182;26918;0;0
FK;01;0;0041534881923;12;2015;21/12/2015;478640824626000;"Anang Purwito";"Jl.SLAMET RIYADI GANG CENTRAL KAV 7 JEMBER 68112";450000;45000;0;0;0;0;0;0;18288
LT;478640824626000;"Anang Purwito";-;-;-;0;0;-;-;-;-;-;-
OF;SK010034;"Starter Kit + Calcium";99000;5;495000;0;450000;45000;0;0
FK;01;0;0041534884891;12;2015;28/12/2015;774312052009000;"Hj Netty Nasir";"Jl. Masjid AL-Barkah No.2 RT.005 RW.001 Kel:Gedong Kec:Pasar Rebo";241818;24182;0;0;0;0;0;0;149793
LT;774312052009000;"Hj Netty Nasir";-;-;-;0;0;-;-;-;-;-;-
OF;NT020001;Legres;133000;2;266000;0;241818;24182;0;0
FK;01;0;0041534884920;12;2015;28/12/2015;597360627532000;"AGUS HARIYANTO";"Jl. Pandawa AF-6 Grogol Indah Sukoharjo";167491;16749;0;0;0;0;0;0;18434
LT;597360627532000;"AGUS HARIYANTO";-;-;-;0;0;-;-;-;-;-;-
OF;HF060009;"HF Pureway-C";92120;2;184240;0;167491;16749;0;0
FK;01;0;0041534884921;12;2015;29/12/2015;597360627532000;"AGUS HARIYANTO";"Jl. Pandawa AF-6 Grogol Indah Sukoharjo";227309;22731;0;0;0;0;0;0;18435
LT;597360627532000;"AGUS HARIYANTO";-;-;-;0;0;-;-;-;-;-;-
OF;NT020004;Legreskin;250040;1;250040;0;227309;22731;0;0
