FK;KD_JENIS_TRANSAKSI;FG_PENGGANTI;NOMOR_FAKTUR;MASA_PAJAK;TAHUN_PAJAK;TANGGAL_FAKTUR;NPWP;NAMA;ALAMAT_LENGKAP;JUMLAH_DPP;JUMLAH_PPN;JUMLAH_PPNBM;ID_KETERANGAN_TAMBAHAN;FP_UANG_MUKA;UANG_MUKA_DPP;UANG_MUKA_PPN;UANG_MUKA_PPNBM;REFERENSI
LT;NPWP;NAMA;JALAN;BLOK;NOMOR;RT;RW;KECAMATAN;KELURAHAN;KABUPATEN;PROPINSI;KODE_POS;NOMOR_TELEPON
OF;KODE_OBJEK;NAMA;HARGA_SATUAN;JUMLAH_BARANG;HARGA_TOTAL;DISKON;DPP;PPN;TARIF_PPNBM;PPNBM
FK;01;0;0171731992190;5;2017;24/05/2017;013032966073000;"PT. Soho Global Health";"Jl. Rawa Sumur Kav BB II No. 4A-B KIP Jakarta Timur";17751000;1775100;0;0;0;0;0;0;FL61201700001	
LT;013032966073000;"PT. Soho Global Health";"Jl. Rawa Sumur Kav BB II No. 4A-B KIP Jakarta Timur";-;-;0;0;-;-;-;"Jakarta Timur";13930;-
OF;"";"Klaim ROP Honda Mobilio B1773BIV an Andrias Robertus Feb-April";17751000;1;17751000;0;17751000;1775100;0;0	
FK;01;0;0171731992191;7;2017;24/07/2017;010027134007000;"PT. Soho Industri Pharmasi";"Jl. Pulogadung No.6 KIP Jatinegara - Cakung Jakarta Timur";5917000;591700;0;0;0;0;0;0;FL61201700002
LT;010027134007000;"PT. Soho Industri Pharmasi";"Jl. Pulogadung No.6 KIP";-;-;0;0;"Jatinegara";"Cakung";-;"Jakarta Timur";13920;-
OF;"";"Klaim ROP Toyota Avanza B1971BIT Fatimah S Bulan Mei-Aug";5917000;1;5917000;0;5917000;591700;0;0	
FK;01;0;0171731991342;4;2017;04/04/2017;061106084008000;"Mira Rebeka Sani";"Jl. Kesenian Blok O 1/12 Rt.016 Rw.009 Duren Sawit Jakarta Timur";1533055;153305;0;0;0;0;0;0;28497
LT;061106084008000;"Mira Rebeka Sani";-;-;-;0;0;-;-;-;-;-;-
OF;PP080124;"Magozai Promo (Buy 3 Get 1)";562120;3;1686360;0;1533055;153305;0;0
FK;01;0;0171731991343;4;2017;04/04/2017;061106084008000;"Mira Rebeka Sani";"Jl. Kesenian Blok O 1/12 Rt.016 Rw.009 Duren Sawit Jakarta Timur";1533055;153305;0;0;0;0;0;0;28498
LT;061106084008000;"Mira Rebeka Sani";-;-;-;0;0;-;-;-;-;-;-
OF;PP080124;"Magozai Promo (Buy 3 Get 1)";562120;3;1686360;0;1533055;153305;0;0
FK;01;0;0171731991416;4;2017;05/04/2017;672354446619000;"Surjana Dewi Effendy";"JL. Manyar Tirtoyoso Selatan 4 no. 11 RT 007 RW 005 Manyarsabrangan Mulyorejo surabaya";14611818;1461181;0;0;0;0;0;0;28518
LT;672354446619000;"Surjana Dewi Effendy";-;-;-;0;0;-;-;-;-;-;-
OF;PP0206;"TOP UP Loyalty 1 Calcium with Vitamin D";49000;12;588000;0;534545;53454;0;0
OF;PP0210;"TOP UP Juice Extractor";199000;2;398000;0;361818;36182;0;0
OF;PP0190;"Asta-gen Promo (Buy 3 Get 1 Renewskin 30)";253800;18;4568400;0;4153091;415309;0;0
OF;HF060012;"HF Glucosefit";277300;1;277300;0;252091;25209;0;0
OF;PP0192;"Calcium with Vitamin D Promo (Buy 3 Get 1)";268840;30;8065200;0;7332000;733200;0;0
OF;PP0196;"U-Claire Eye Gel Promo (Gratis Renewskin 15)";181890;2;363780;0;330709;33071;0;0
OF;PP0211;"Ginsana Promo (Gratis Legres)";312080;1;312080;0;283709;28371;0;0
OF;PP080130;"Legres Promo (Buy 3 Get 1)";125020;12;1500240;0;1363855;136385;0;0
FK;01;0;0171731991424;4;2017;05/04/2017;594682387037000;"Zainal Arifin.";"Jl. Thalib II No.5 Krukut - Tamansari Jakarta Barat";1567664;156766;0;0;0;0;0;0;28522
LT;594682387037000;"Zainal Arifin.";-;-;-;0;0;-;-;-;-;-;-
OF;PP080163;"Care for Cancer Plus Pack";1349370;1;1349370;0;1226700;122670;0;0
OF;PP080130;"Legres Promo (Buy 3 Get 1)";125020;3;375060;0;340964;34096;0;0
FK;01;0;0171731991440;4;2017;06/04/2017;061106084008000;"Mira Rebeka Sani";"Jl. Kesenian Blok O 1/12 Rt.016 Rw.009 Duren Sawit Jakarta Timur";6246319;624631;0;0;0;0;0;0;28535
LT;061106084008000;"Mira Rebeka Sani";-;-;-;0;0;-;-;-;-;-;-
OF;NT020012;Legalon;305500;3;916500;0;833182;83318;0;0
OF;NT020008;Biorate;246750;1;246750;0;224318;22432;0;0
OF;NT020007;Sistocare;256620;1;256620;0;233291;23329;0;0
OF;PP080124;"Magozai Promo (Buy 3 Get 1)";562120;9;5059080;0;4599164;459916;0;0
OF;PP0206;"TOP UP Loyalty 1 Calcium with Vitamin D";49000;8;392000;0;356364;35636;0;0
FK;01;0;0171731991456;4;2017;06/04/2017;082738550831000;"Harun D. Tumbuan";"Komplek RSD Madani No.19 Kota Palu Sualwesi Tengah";90000;9000;0;0;0;0;0;0;28548
LT;082738550831000;"Harun D. Tumbuan";-;-;-;0;0;-;-;-;-;-;-
OF;SK0045;"Starter Kit April 2017";99000;1;99000;0;90000;9000;0;0
FK;01;0;0171731991458;4;2017;06/04/2017;594682387037000;"Zainal Arifin.";"Jl. Thalib II No.5 Krukut - Tamansari Jakarta Barat";1564419;156441;0;0;0;0;0;0;28549
LT;594682387037000;"Zainal Arifin.";-;-;-;0;0;-;-;-;-;-;-
OF;PP080124;"Magozai Promo (Buy 3 Get 1)";562120;3;1686360;0;1533055;153305;0;0
OF;MT0125;"Catalog Vol.2 Th 2017";6900;5;34500;0;31364;3136;0;0
FK;01;0;0171731991460;4;2017;06/04/2017;594682387037000;"Zainal Arifin.";"Jl. Thalib II No.5 Krukut - Tamansari Jakarta Barat";445455;44545;0;0;0;0;0;0;28551
LT;594682387037000;"Zainal Arifin.";-;-;-;0;0;-;-;-;-;-;-
OF;PP0206;"TOP UP Loyalty 1 Calcium with Vitamin D";49000;10;490000;0;445455;44545;0;0
FK;01;0;0171731991486;4;2017;10/04/2017;061106084008000;"Mira Rebeka Sani";"Jl. Kesenian Blok O 1/12 Rt.016 Rw.009 Duren Sawit Jakarta Timur";723636;72364;0;0;0;0;0;0;28569
LT;061106084008000;"Mira Rebeka Sani";-;-;-;0;0;-;-;-;-;-;-
OF;PP0210;"TOP UP Juice Extractor";199000;4;796000;0;723636;72364;0;0
FK;01;0;0171731991487;4;2017;10/04/2017;061106084008000;"Mira Rebeka Sani";"Jl. Kesenian Blok O 1/12 Rt.016 Rw.009 Duren Sawit Jakarta Timur";180909;18091;0;0;0;0;0;0;28570
LT;061106084008000;"Mira Rebeka Sani";-;-;-;0;0;-;-;-;-;-;-
OF;PP0210;"TOP UP Juice Extractor";199000;1;199000;0;180909;18091;0;0
FK;01;0;0171731991494;4;2017;10/04/2017;579473596823000;"Supantia Saleh";"Jl. Bitung Tengah RT.010 Rw.004. Bitung Tengah - Maesa Bitung";723636;72364;0;0;0;0;0;0;28577
LT;579473596823000;"Supantia Saleh";-;-;-;0;0;-;-;-;-;-;-
OF;PP0210;"TOP UP Juice Extractor";199000;4;796000;0;723636;72364;0;0
FK;01;0;0171731991498;4;2017;10/04/2017;061106084008000;"Mira Rebeka Sani";"Jl. Kesenian Blok O 1/12 Rt.016 Rw.009 Duren Sawit Jakarta Timur";180909;18091;0;0;0;0;0;0;28581
LT;061106084008000;"Mira Rebeka Sani";-;-;-;0;0;-;-;-;-;-;-
OF;PP0210;"TOP UP Juice Extractor";199000;1;199000;0;180909;18091;0;0
FK;01;0;0171731991499;4;2017;10/04/2017;061106084008000;"Mira Rebeka Sani";"Jl. Kesenian Blok O 1/12 Rt.016 Rw.009 Duren Sawit Jakarta Timur";1577600;157759;0;0;0;0;0;0;28582
LT;061106084008000;"Mira Rebeka Sani";-;-;-;0;0;-;-;-;-;-;-
OF;PP080124;"Magozai Promo (Buy 3 Get 1)";562120;3;1686360;0;1533055;153305;0;0
OF;PP0206;"TOP UP Loyalty 1 Calcium with Vitamin D";49000;1;49000;0;44545;4454;0;0
FK;01;0;0171731991500;4;2017;10/04/2017;061106084008000;"Mira Rebeka Sani";"Jl. Kesenian Blok O 1/12 Rt.016 Rw.009 Duren Sawit Jakarta Timur";6438573;643857;0;0;0;0;0;0;28583
LT;061106084008000;"Mira Rebeka Sani";-;-;-;0;0;-;-;-;-;-;-
OF;PP080124;"Magozai Promo (Buy 3 Get 1)";562120;12;6745440;0;6132218;613222;0;0
OF;HF060004;"HF Joint Booster 60s";336990;1;336990;0;306355;30635;0;0
FK;01;0;0171731991518;4;2017;10/04/2017;594682387037000;"Zainal Arifin.";"Jl. Thalib II No.5 Krukut - Tamansari Jakarta Barat";4599164;459916;0;0;0;0;0;0;28600
LT;594682387037000;"Zainal Arifin.";-;-;-;0;0;-;-;-;-;-;-
OF;PP080124;"Magozai Promo (Buy 3 Get 1)";562120;9;5059080;0;4599164;459916;0;0
FK;01;0;0171731991532;4;2017;11/04/2017;082738550831000;"Harun D. Tumbuan";"Komplek RSD Madani No.19 Kota Palu Sualwesi Tengah";11566701;1156669;0;0;0;0;0;0;28612
LT;082738550831000;"Harun D. Tumbuan";-;-;-;0;0;-;-;-;-;-;-
OF;PP080130;"Legres Promo (Buy 3 Get 1)";125020;12;1500240;0;1363855;136385;0;0
OF;PP080124;"Magozai Promo (Buy 3 Get 1)";562120;6;3372720;0;3066109;306611;0;0
OF;NT020011;Asta-Gen;253800;6;1522800;0;1384364;138436;0;0
OF;HF060012;"HF Glucosefit";277300;4;1109200;0;1008364;100836;0;0
OF;HF060008;"HF Coformula";540500;2;1081000;0;982727;98273;0;0
OF;NT020012;Legalon;305500;2;611000;0;555455;55545;0;0
OF;HF0013;"HF Joint Booster 30s";202570;4;810280;0;736618;73662;0;0
OF;PP0192;"Calcium with Vitamin D Promo (Buy 3 Get 1)";268840;3;806520;0;733200;73320;0;0
OF;PP080163;"Care for Cancer Plus Pack";1349370;1;1349370;0;1226700;122670;0;0
OF;HF060007;"HF Bee Propolis Liquid";280120;2;560240;0;509309;50931;0;0
FK;01;0;0171731991533;4;2017;11/04/2017;082738550831000;"Harun D. Tumbuan";"Komplek RSD Madani No.19 Kota Palu Sualwesi Tengah";980000;98000;0;0;0;0;0;0;28613
LT;082738550831000;"Harun D. Tumbuan";-;-;-;0;0;-;-;-;-;-;-
OF;PP0206;"TOP UP Loyalty 1 Calcium with Vitamin D";49000;22;1078000;0;980000;98000;0;0
FK;01;0;0171731991534;4;2017;11/04/2017;082738550831000;"Harun D. Tumbuan";"Komplek RSD Madani No.19 Kota Palu Sualwesi Tengah";723636;72364;0;0;0;0;0;0;28614
LT;082738550831000;"Harun D. Tumbuan";-;-;-;0;0;-;-;-;-;-;-
OF;PP0210;"TOP UP Juice Extractor";199000;4;796000;0;723636;72364;0;0
FK;01;0;0171731991540;4;2017;11/04/2017;672354446619000;"Surjana Dewi Effendy";"JL. Manyar Tirtoyoso Selatan 4 no. 11 RT 007 RW 005 Manyarsabrangan Mulyorejo surabaya";6087491;608748;0;0;0;0;0;0;28618
LT;672354446619000;"Surjana Dewi Effendy";-;-;-;0;0;-;-;-;-;-;-
OF;NT020015;Curcomplex95;540500;3;1621500;0;1474091;147409;0;0
OF;NT020007;Sistocare;256620;1;256620;0;233291;23329;0;0
OF;PP0196;"U-Claire Eye Gel Promo (Gratis Renewskin 15)";181890;10;1818900;0;1653545;165354;0;0
OF;PP080130;"Legres Promo (Buy 3 Get 1)";125020;15;1875300;0;1704818;170482;0;0
OF;PP0195;"U-Claire Day & Night Cream Promo Disc 25%";266960;2;533920;0;485382;48538;0;0
OF;MT0128;"Catalog Vol.2 Th 2017 (100 pcs)";590000;1;590000;0;536364;53636;0;0
FK;01;0;0171731991554;4;2017;12/04/2017;061106084008000;"Mira Rebeka Sani";"Jl. Kesenian Blok O 1/12 Rt.016 Rw.009 Duren Sawit Jakarta Timur";3066109;306611;0;0;0;0;0;0;28628
LT;061106084008000;"Mira Rebeka Sani";-;-;-;0;0;-;-;-;-;-;-
OF;PP080124;"Magozai Promo (Buy 3 Get 1)";562120;6;3372720;0;3066109;306611;0;0
FK;01;0;0171731991561;4;2017;12/04/2017;061106084008000;"Mira Rebeka Sani";"Jl. Kesenian Blok O 1/12 Rt.016 Rw.009 Duren Sawit Jakarta Timur";1533055;153305;0;0;0;0;0;0;28633
LT;061106084008000;"Mira Rebeka Sani";-;-;-;0;0;-;-;-;-;-;-
OF;PP080124;"Magozai Promo (Buy 3 Get 1)";562120;3;1686360;0;1533055;153305;0;0
FK;01;0;0171731991583;4;2017;13/04/2017;672354446619000;"Surjana Dewi Effendy";"JL. Manyar Tirtoyoso Selatan 4 no. 11 RT 007 RW 005 Manyarsabrangan Mulyorejo surabaya";6573164;657316;0;0;0;0;0;0;28648
LT;672354446619000;"Surjana Dewi Effendy";-;-;-;0;0;-;-;-;-;-;-
OF;NT020001;Legres;125020;27;3375540;0;3068673;306867;0;0
OF;NT020011;Asta-Gen;253800;10;2538000;0;2307273;230727;0;0
OF;BY030009;"UC - Bright Intense Night Cream";250510;1;250510;0;227736;22774;0;0
OF;BY030007;"UC - Bright Intense Serum";265550;1;265550;0;241409;24141;0;0
OF;PP0195;"U-Claire Day & Night Cream Promo Disc 25%";266960;3;800880;0;728073;72807;0;0
FK;01;0;0171731991597;4;2017;13/04/2017;579473596823000;"Supantia Saleh";"Jl. Bitung Tengah RT.010 Rw.004. Bitung Tengah - Maesa Bitung";5226091;522609;0;0;0;0;0;0;28658
LT;579473596823000;"Supantia Saleh";-;-;-;0;0;-;-;-;-;-;-
OF;PP080124;"Magozai Promo (Buy 3 Get 1)";562120;9;5059080;0;4599164;459916;0;0
OF;MT0092;"Paket Legres + Alat Cek Darah";444620;1;444620;0;404200;40420;0;0
OF;PP0206;"TOP UP Loyalty 1 Calcium with Vitamin D";49000;5;245000;0;222727;22273;0;0
FK;01;0;0171731991610;4;2017;13/04/2017;672354446619000;"Surjana Dewi Effendy";"JL. Manyar Tirtoyoso Selatan 4 no. 11 RT 007 RW 005 Manyarsabrangan Mulyorejo surabaya";267273;26727;0;0;0;0;0;0;28670
LT;672354446619000;"Surjana Dewi Effendy";-;-;-;0;0;-;-;-;-;-;-
OF;PP0206;"TOP UP Loyalty 1 Calcium with Vitamin D";49000;6;294000;0;267273;26727;0;0
FK;01;0;0171731991628;4;2017;15/04/2017;061106084008000;"Mira Rebeka Sani";"Jl. Kesenian Blok O 1/12 Rt.016 Rw.009 Duren Sawit Jakarta Timur";1926146;192614;0;0;0;0;0;0;28686
LT;061106084008000;"Mira Rebeka Sani";-;-;-;0;0;-;-;-;-;-;-
OF;PP080124;"Magozai Promo (Buy 3 Get 1)";562120;3;1686360;0;1533055;153305;0;0
OF;BY030011;"Astaderm Face Cream";197400;1;197400;0;179455;17945;0;0
OF;BY030012;"Astaderm Face Serum";235000;1;235000;0;213636;21364;0;0
FK;01;0;0171731991679;4;2017;18/04/2017;082738550831000;"Harun D. Tumbuan";"Komplek RSD Madani No.19 Kota Palu Sualwesi Tengah";89091;8909;0;0;0;0;0;0;28727
LT;082738550831000;"Harun D. Tumbuan";-;-;-;0;0;-;-;-;-;-;-
OF;PP0206;"TOP UP Loyalty 1 Calcium with Vitamin D";49000;2;98000;0;89091;8909;0;0
FK;01;0;0171731991684;4;2017;18/04/2017;594682387037000;"Zainal Arifin.";"Jl. Thalib II No.5 Krukut - Tamansari Jakarta Barat";180909;18091;0;0;0;0;0;0;28732
LT;594682387037000;"Zainal Arifin.";-;-;-;0;0;-;-;-;-;-;-
OF;PP0210;"TOP UP Juice Extractor";199000;1;199000;0;180909;18091;0;0
FK;01;0;0171731991692;4;2017;18/04/2017;061106084008000;"Mira Rebeka Sani";"Jl. Kesenian Blok O 1/12 Rt.016 Rw.009 Duren Sawit Jakarta Timur";4028145;402814;0;0;0;0;0;0;28738
LT;061106084008000;"Mira Rebeka Sani";-;-;-;0;0;-;-;-;-;-;-
OF;PP080124;"Magozai Promo (Buy 3 Get 1)";562120;6;3372720;0;3066109;306611;0;0
OF;PP0191;"UC BI Facial Foam Promo (Gratis Renewskin 30)";190350;1;190350;0;173045;17304;0;0
OF;PP0196;"U-Claire Eye Gel Promo (Gratis Renewskin 15)";181890;1;181890;0;165355;16535;0;0
OF;PP0206;"TOP UP Loyalty 1 Calcium with Vitamin D";49000;14;686000;0;623636;62364;0;0
FK;01;0;0171731991693;4;2017;18/04/2017;579473596823000;"Supantia Saleh";"Jl. Bitung Tengah RT.010 Rw.004. Bitung Tengah - Maesa Bitung";517291;51729;0;0;0;0;0;0;28739
LT;579473596823000;"Supantia Saleh";-;-;-;0;0;-;-;-;-;-;-
OF;NT020003;"Magozai 750ml";562120;1;562120;0;511018;51102;0;0
OF;MT0125;"Catalog Vol.2 Th 2017";6900;1;6900;0;6273;627;0;0
FK;01;0;0171731991699;4;2017;18/04/2017;674087382114000;"IDA FENNY ELYSA";"JL. DEBLOD SUNDORO NO. 41 LK. II";5048892;504888;0;0;0;0;0;0;28745
LT;674087382114000;"IDA FENNY ELYSA";-;-;-;0;0;-;-;-;-;-;-
OF;NT020011;Asta-Gen;253800;6;1522800;0;1384364;138436;0;0
OF;HF060010;"HF Salmon Oil 90s";282000;8;2256000;0;2050909;205091;0;0
OF;PP0206;"TOP UP Loyalty 1 Calcium with Vitamin D";49000;10;490000;0;445455;44545;0;0
OF;HF060012;"HF Glucosefit";277300;2;554600;0;504182;50418;0;0
OF;PP080133;"Calway-C Junior Promo (Buy 3 Get 1)";243460;3;730380;0;663982;66398;0;0
FK;01;0;0171731991705;4;2017;18/04/2017;674087382114000;"IDA FENNY ELYSA";"JL. DEBLOD SUNDORO NO. 41 LK. II";904545;90454;0;0;0;0;0;0;28751
LT;674087382114000;"IDA FENNY ELYSA";-;-;-;0;0;-;-;-;-;-;-
OF;PP0210;"TOP UP Juice Extractor";199000;5;995000;0;904545;90454;0;0
FK;01;0;0171731991714;4;2017;18/04/2017;698090388822000;"Lutfia Y.K. Nasib Alamri, SE";"DISNAKERTRANS PROP. GORONTALO / JL AGUS SALIM RT 001 RW 001 DULALOWO KEC KOTA TENGAH KOTA GORONTALO";27320273;2732027;0;0;0;0;0;0;28760
LT;698090388822000;"Lutfia Y.K. Nasib Alamri, SE";-;-;-;0;0;-;-;-;-;-;-
OF;PP0206;"TOP UP Loyalty 1 Calcium with Vitamin D";49000;18;882000;0;801818;80182;0;0
OF;HF060012;"HF Glucosefit";277300;25;6932500;0;6302273;630227;0;0
OF;HF060011;"HF Salmon Oil 30s";111860;20;2237200;0;2033818;203382;0;0
OF;NT020015;Curcomplex95;540500;15;8107500;0;7370455;737045;0;0
OF;HF060007;"HF Bee Propolis Liquid";280120;20;5602400;0;5093091;509309;0;0
OF;SK0045;"Starter Kit April 2017";99000;7;693000;0;630000;63000;0;0
OF;NT020012;Legalon;305500;3;916500;0;833182;83318;0;0
OF;PP0211;"Ginsana Promo (Gratis Legres)";312080;15;4681200;0;4255636;425564;0;0
FK;01;0;0171731991721;4;2017;19/04/2017;082738550831000;"Harun D. Tumbuan";"Komplek RSD Madani No.19 Kota Palu Sualwesi Tengah";12793401;1279339;0;0;0;0;0;0;28767
LT;082738550831000;"Harun D. Tumbuan";-;-;-;0;0;-;-;-;-;-;-
OF;PP080130;"Legres Promo (Buy 3 Get 1)";125020;12;1500240;0;1363855;136385;0;0
OF;PP080124;"Magozai Promo (Buy 3 Get 1)";562120;6;3372720;0;3066109;306611;0;0
OF;NT020011;Asta-Gen;253800;6;1522800;0;1384364;138436;0;0
OF;HF060012;"HF Glucosefit";277300;4;1109200;0;1008364;100836;0;0
OF;HF060008;"HF Coformula";540500;2;1081000;0;982727;98273;0;0
OF;NT020012;Legalon;305500;2;611000;0;555455;55545;0;0
OF;HF0013;"HF Joint Booster 30s";202570;4;810280;0;736618;73662;0;0
OF;PP0192;"Calcium with Vitamin D Promo (Buy 3 Get 1)";268840;3;806520;0;733200;73320;0;0
OF;PP080163;"Care for Cancer Plus Pack";1349370;1;1349370;0;1226700;122670;0;0
OF;HF060007;"HF Bee Propolis Liquid";280120;2;560240;0;509309;50931;0;0
OF;PP0201;"Joint Well Plus Promo (Gratis Magozai 750ml)";1349370;1;1349370;0;1226700;122670;0;0
FK;01;0;0171731991729;4;2017;19/04/2017;061106084008000;"Mira Rebeka Sani";"Jl. Kesenian Blok O 1/12 Rt.016 Rw.009 Duren Sawit Jakarta Timur";1577600;157759;0;0;0;0;0;0;28774
LT;061106084008000;"Mira Rebeka Sani";-;-;-;0;0;-;-;-;-;-;-
OF;PP080124;"Magozai Promo (Buy 3 Get 1)";562120;3;1686360;0;1533055;153305;0;0
OF;PP0206;"TOP UP Loyalty 1 Calcium with Vitamin D";49000;1;49000;0;44545;4454;0;0
FK;01;0;0171731991733;4;2017;19/04/2017;082738550831000;"Harun D. Tumbuan";"Komplek RSD Madani No.19 Kota Palu Sualwesi Tengah";12893809;1289381;0;0;0;0;0;0;28777
LT;082738550831000;"Harun D. Tumbuan";-;-;-;0;0;-;-;-;-;-;-
OF;PP080124;"Magozai Promo (Buy 3 Get 1)";562120;21;11804520;0;10731382;1073138;0;0
OF;PP0201;"Joint Well Plus Promo (Gratis Magozai 750ml)";1349370;1;1349370;0;1226700;122670;0;0
OF;NT020017;"Magozai 375ml";343100;3;1029300;0;935727;93573;0;0
FK;01;0;0171731991747;4;2017;20/04/2017;061106084008000;"Mira Rebeka Sani";"Jl. Kesenian Blok O 1/12 Rt.016 Rw.009 Duren Sawit Jakarta Timur";1533055;153305;0;0;0;0;0;0;28788
LT;061106084008000;"Mira Rebeka Sani";-;-;-;0;0;-;-;-;-;-;-
OF;PP080124;"Magozai Promo (Buy 3 Get 1)";562120;3;1686360;0;1533055;153305;0;0
FK;01;0;0171731991771;4;2017;21/04/2017;145772877711000;"Yesoa Amd.Pd";"Jl. Pangkalima Kapang, Anjir Kalampan KM 1200 Rt. 002 No. 07 Kapuas Kalimantan Tengah 73552";7451273;745126;0;0;0;0;0;0;28807
LT;145772877711000;"Yesoa Amd.Pd";-;-;-;0;0;-;-;-;-;-;-
OF;PP080130;"Legres Promo (Buy 3 Get 1)";125020;3;375060;0;340964;34096;0;0
OF;NT020009;Gravica;246750;1;246750;0;224318;22432;0;0
OF;NT020012;Legalon;305500;2;611000;0;555455;55545;0;0
OF;HF060006;"HF Bee Propolis 30s";204920;3;614760;0;558873;55887;0;0
OF;PP0190;"Asta-gen Promo (Buy 3 Get 1 Renewskin 30)";253800;3;761400;0;692182;69218;0;0
OF;PP0211;"Ginsana Promo (Gratis Legres)";312080;3;936240;0;851127;85113;0;0
OF;PP080139;"Antioxidant Life Promo (Gratis Salmon Oil 90)";1378040;1;1378040;0;1252764;125276;0;0
OF;PP0201;"Joint Well Plus Promo (Gratis Magozai 750ml)";1349370;1;1349370;0;1226700;122670;0;0
OF;PP0199;"Healthy Cardio Promo (Gratis Magozai 750ml)";1477680;1;1477680;0;1343345;134334;0;0
OF;PP0206;"TOP UP Loyalty 1 Calcium with Vitamin D";49000;3;147000;0;133636;13364;0;0
OF;SK0045;"Starter Kit April 2017";99000;1;99000;0;90000;9000;0;0
OF;MT0125;"Catalog Vol.2 Th 2017";6900;29;200100;0;181909;18191;0;0
FK;01;0;0171731991772;4;2017;21/04/2017;145772877711000;"Yesoa Amd.Pd";"Jl. Pangkalima Kapang, Anjir Kalampan KM 1200 Rt. 002 No. 07 Kapuas Kalimantan Tengah 73552";6273;627;0;0;0;0;0;0;28808
LT;145772877711000;"Yesoa Amd.Pd";-;-;-;0;0;-;-;-;-;-;-
OF;MT0125;"Catalog Vol.2 Th 2017";6900;1;6900;0;6273;627;0;0
FK;01;0;0171731991773;4;2017;21/04/2017;061106084008000;"Mira Rebeka Sani";"Jl. Kesenian Blok O 1/12 Rt.016 Rw.009 Duren Sawit Jakarta Timur";1617336;161733;0;0;0;0;0;0;28809
LT;061106084008000;"Mira Rebeka Sani";-;-;-;0;0;-;-;-;-;-;-
OF;PP0201;"Joint Well Plus Promo (Gratis Magozai 750ml)";1349370;1;1349370;0;1226700;122670;0;0
OF;PP0191;"UC BI Facial Foam Promo (Gratis Renewskin 30)";190350;2;380700;0;346091;34609;0;0
OF;PP0206;"TOP UP Loyalty 1 Calcium with Vitamin D";49000;1;49000;0;44545;4454;0;0
FK;01;0;0171731991789;4;2017;22/04/2017;672354446619000;"Surjana Dewi Effendy";"JL. Manyar Tirtoyoso Selatan 4 no. 11 RT 007 RW 005 Manyarsabrangan Mulyorejo surabaya";4710254;471025;0;0;0;0;0;0;28825
LT;672354446619000;"Surjana Dewi Effendy";-;-;-;0;0;-;-;-;-;-;-
OF;NT020011;Asta-Gen;253800;3;761400;0;692182;69218;0;0
OF;NT020008;Biorate;246750;1;246750;0;224318;22432;0;0
OF;HF060004;"HF Joint Booster 60s";336990;2;673980;0;612709;61271;0;0
OF;HF060011;"HF Salmon Oil 30s";111860;1;111860;0;101691;10169;0;0
OF;NT020003;"Magozai 750ml";562120;2;1124240;0;1022036;102204;0;0
OF;PP0203;"Skin Nutrition Promo (Gratis Renewskin 30)";410310;1;410310;0;373009;37301;0;0
OF;PP0199;"Healthy Cardio Promo (Gratis Magozai 750ml)";1477680;1;1477680;0;1343345;134334;0;0
OF;PP080130;"Legres Promo (Buy 3 Get 1)";125020;3;375060;0;340964;34096;0;0
FK;01;0;0171731991802;4;2017;22/04/2017;061106084008000;"Mira Rebeka Sani";"Jl. Kesenian Blok O 1/12 Rt.016 Rw.009 Duren Sawit Jakarta Timur";1533055;153305;0;0;0;0;0;0;28835
LT;061106084008000;"Mira Rebeka Sani";-;-;-;0;0;-;-;-;-;-;-
OF;PP080124;"Magozai Promo (Buy 3 Get 1)";562120;3;1686360;0;1533055;153305;0;0
FK;01;0;0171731991832;4;2017;25/04/2017;061106084008000;"Mira Rebeka Sani";"Jl. Kesenian Blok O 1/12 Rt.016 Rw.009 Duren Sawit Jakarta Timur";3066109;306611;0;0;0;0;0;0;28860
LT;061106084008000;"Mira Rebeka Sani";-;-;-;0;0;-;-;-;-;-;-
OF;PP080124;"Magozai Promo (Buy 3 Get 1)";562120;6;3372720;0;3066109;306611;0;0
FK;01;0;0171731991852;4;2017;25/04/2017;478640824626000;"Anang Purwito";"Jl.SLAMET RIYADI GANG CENTRAL KAV 7 JEMBER 68112";432091;43209;0;0;0;0;0;0;28879
LT;478640824626000;"Anang Purwito";-;-;-;0;0;-;-;-;-;-;-
OF;BY030007;"UC - Bright Intense Serum";276850;1;276850;0;251682;25168;0;0
OF;BY030006;"UC - Bright Intense - Facial Foam";198450;1;198450;0;180409;18041;0;0
FK;01;0;0171731991853;4;2017;25/04/2017;478640824626000;"Anang Purwito";"Jl.SLAMET RIYADI GANG CENTRAL KAV 7 JEMBER 68112";1107845;110784;0;0;0;0;0;0;28880
LT;478640824626000;"Anang Purwito";-;-;-;0;0;-;-;-;-;-;-
OF;PP0206;"TOP UP Loyalty 1 Calcium with Vitamin D";49000;1;49000;0;44545;4454;0;0
OF;NT020008;Biorate;257250;1;257250;0;233864;23386;0;0
OF;NT020001;Legres;130340;7;912380;0;829436;82944;0;0
FK;01;0;0171731991856;4;2017;26/04/2017;698090388822000;"Lutfia Y.K. Nasib Alamri, SE";"DISNAKERTRANS PROP. GORONTALO / JL AGUS SALIM RT 001 RW 001 DULALOWO KEC KOTA TENGAH KOTA GORONTALO";31593090;3159309;0;0;0;0;0;0;28882
LT;698090388822000;"Lutfia Y.K. Nasib Alamri, SE";-;-;-;0;0;-;-;-;-;-;-
OF;HF060009;"HF Pureway-C";107630;20;2152600;0;1956909;195691;0;0
OF;NT020011;Asta-Gen;253800;10;2538000;0;2307273;230727;0;0
OF;NT020007;Sistocare;256620;10;2566200;0;2332909;233291;0;0
OF;HF060010;"HF Salmon Oil 90s";282000;40;11280000;0;10254545;1025454;0;0
OF;NT0022;"Calcium with Vitamin D";268840;30;8065200;0;7332000;733200;0;0
OF;HF060006;"HF Bee Propolis 30s";204920;20;4098400;0;3725818;372582;0;0
OF;HF060012;"HF Glucosefit";277300;10;2773000;0;2520909;252091;0;0
OF;NT020015;Curcomplex95;540500;2;1081000;0;982727;98273;0;0
OF;SK0045;"Starter Kit April 2017";99000;2;198000;0;180000;18000;0;0
FK;01;0;0171731991903;4;2017;27/04/2017;594682387037000;"Zainal Arifin.";"Jl. Thalib II No.5 Krukut - Tamansari Jakarta Barat";8893255;889325;0;0;0;0;0;0;28923
LT;594682387037000;"Zainal Arifin.";-;-;-;0;0;-;-;-;-;-;-
OF;PP080139;"Antioxidant Life Promo (Gratis Salmon Oil 90)";1378040;1;1378040;0;1252764;125276;0;0
OF;PP080163;"Care for Cancer Plus Pack";1349370;1;1349370;0;1226700;122670;0;0
OF;PP0204;"Renewskin 30 Promo BI Night Cream Hrg Khusus 99rb";309730;1;309730;0;281573;28157;0;0
OF;PP080124;"Magozai Promo (Buy 3 Get 1)";562120;12;6745440;0;6132218;613222;0;0
FK;01;0;0171731991907;4;2017;27/04/2017;061106084008000;"Mira Rebeka Sani";"Jl. Kesenian Blok O 1/12 Rt.016 Rw.009 Duren Sawit Jakarta Timur";1533055;153305;0;0;0;0;0;0;28927
LT;061106084008000;"Mira Rebeka Sani";-;-;-;0;0;-;-;-;-;-;-
OF;PP080124;"Magozai Promo (Buy 3 Get 1)";562120;3;1686360;0;1533055;153305;0;0
FK;01;0;0171731991941;4;2017;28/04/2017;594682387037000;"Zainal Arifin.";"Jl. Thalib II No.5 Krukut - Tamansari Jakarta Barat";1874019;187401;0;0;0;0;0;0;28951
LT;594682387037000;"Zainal Arifin.";-;-;-;0;0;-;-;-;-;-;-
OF;PP080130;"Legres Promo (Buy 3 Get 1)";125020;3;375060;0;340964;34096;0;0
OF;PP080124;"Magozai Promo (Buy 3 Get 1)";562120;3;1686360;0;1533055;153305;0;0
FK;01;0;0171731991943;4;2017;28/04/2017;579473596823000;"Supantia Saleh";"Jl. Bitung Tengah RT.010 Rw.004. Bitung Tengah - Maesa Bitung";1623055;162305;0;0;0;0;0;0;28953
LT;579473596823000;"Supantia Saleh";-;-;-;0;0;-;-;-;-;-;-
OF;PP080124;"Magozai Promo (Buy 3 Get 1)";562120;3;1686360;0;1533055;153305;0;0
OF;SK0045;"Starter Kit April 2017";99000;1;99000;0;90000;9000;0;0
FK;01;0;0171731991968;4;2017;28/04/2017;082738550831000;"Harun D. Tumbuan";"Komplek RSD Madani No.19 Kota Palu Sualwesi Tengah";10382300;1038230;0;0;0;0;0;0;28977
LT;082738550831000;"Harun D. Tumbuan";-;-;-;0;0;-;-;-;-;-;-
OF;NT020009;Gravica;246750;2;493500;0;448636;44864;0;0
OF;HF060003;"HF Bee Propolis 90s";512300;4;2049200;0;1862909;186291;0;0
OF;HF060012;"HF Glucosefit";277300;2;554600;0;504182;50418;0;0
OF;HF060004;"HF Joint Booster 60s";336990;2;673980;0;612709;61271;0;0
OF;PP0201;"Joint Well Plus Promo (Gratis Magozai 750ml)";1349370;3;4048110;0;3680100;368010;0;0
OF;NT020017;"Magozai 375ml";343100;9;3087900;0;2807182;280718;0;0
OF;NT020007;Sistocare;256620;2;513240;0;466582;46658;0;0
FK;01;0;0171731991993;4;2017;28/04/2017;672354446619000;"Surjana Dewi Effendy";"JL. Manyar Tirtoyoso Selatan 4 no. 11 RT 007 RW 005 Manyarsabrangan Mulyorejo surabaya";6188619;618861;0;0;0;0;0;0;29001
LT;672354446619000;"Surjana Dewi Effendy";-;-;-;0;0;-;-;-;-;-;-
OF;NT020008;Biorate;246750;4;987000;0;897273;89727;0;0
OF;PP0190;"Asta-gen Promo (Buy 3 Get 1 Renewskin 30)";253800;3;761400;0;692182;69218;0;0
OF;PP080124;"Magozai Promo (Buy 3 Get 1)";562120;9;5059080;0;4599164;459916;0;0
FK;01;0;0171731992001;4;2017;29/04/2017;579473596823000;"Supantia Saleh";"Jl. Bitung Tengah RT.010 Rw.004. Bitung Tengah - Maesa Bitung";180000;18000;0;0;0;0;0;0;29009
LT;579473596823000;"Supantia Saleh";-;-;-;0;0;-;-;-;-;-;-
OF;SK0045;"Starter Kit April 2017";99000;2;198000;0;180000;18000;0;0
FK;01;0;0171731992027;4;2017;29/04/2017;594682387037000;"Zainal Arifin.";"Jl. Thalib II No.5 Krukut - Tamansari Jakarta Barat";4732800;473280;0;0;0;0;0;0;29028
LT;594682387037000;"Zainal Arifin.";-;-;-;0;0;-;-;-;-;-;-
OF;PP080124;"Magozai Promo (Buy 3 Get 1)";562120;9;5059080;0;4599164;459916;0;0
OF;PP0206;"TOP UP Loyalty 1 Calcium with Vitamin D";49000;3;147000;0;133636;13364;0;0
FK;01;0;0171731992034;4;2017;29/04/2017;698090388822000;"Lutfia Y.K. Nasib Alamri, SE";"DISNAKERTRANS PROP. GORONTALO / JL AGUS SALIM RT 001 RW 001 DULALOWO KEC KOTA TENGAH KOTA GORONTALO";27354545;2735454;0;0;0;0;0;0;29035
LT;698090388822000;"Lutfia Y.K. Nasib Alamri, SE";-;-;-;0;0;-;-;-;-;-;-
OF;PP080130;"Legres Promo (Buy 3 Get 1)";125020;150;18753000;0;17048182;1704818;0;0
OF;HF0013;"HF Joint Booster 30s";202570;10;2025700;0;1841545;184154;0;0
OF;SK0045;"Starter Kit April 2017";99000;2;198000;0;180000;18000;0;0
OF;BY030011;"Astaderm Face Cream";197400;4;789600;0;717818;71782;0;0
OF;NT020015;Curcomplex95;540500;5;2702500;0;2456818;245682;0;0
OF;NT020003;"Magozai 750ml";562120;10;5621200;0;5110182;511018;0;0
FK;01;0;0171731992066;4;2017;29/04/2017;594682387037000;"Zainal Arifin.";"Jl. Thalib II No.5 Krukut - Tamansari Jakarta Barat";2214982;221498;0;0;0;0;0;0;29063
LT;594682387037000;"Zainal Arifin.";-;-;-;0;0;-;-;-;-;-;-
OF;PP080130;"Legres Promo (Buy 3 Get 1)";125020;6;750120;0;681927;68193;0;0
OF;PP080124;"Magozai Promo (Buy 3 Get 1)";562120;3;1686360;0;1533055;153305;0;0
FK;01;0;0171731992111;4;2017;30/04/2017;579473596823000;"Supantia Saleh";"Jl. Bitung Tengah RT.010 Rw.004. Bitung Tengah - Maesa Bitung";222727;22273;0;0;0;0;0;0;29108
LT;579473596823000;"Supantia Saleh";-;-;-;0;0;-;-;-;-;-;-
OF;PP0206;"TOP UP Loyalty 1 Calcium with Vitamin D";49000;5;245000;0;222727;22273;0;0
FK;01;0;0171731992115;4;2017;30/04/2017;082738550831000;"Harun D. Tumbuan";"Komplek RSD Madani No.19 Kota Palu Sualwesi Tengah";2689846;268984;0;0;0;0;0;0;29112
LT;082738550831000;"Harun D. Tumbuan";-;-;-;0;0;-;-;-;-;-;-
OF;HF060004;"HF Joint Booster 60s";336990;5;1684950;0;1531773;153177;0;0
OF;MT0092;"Paket Legres + Alat Cek Darah";473000;1;473000;0;430000;43000;0;0
OF;PP0197;"Anti-Aging 50+ Promo (Disc 25%)";800880;1;800880;0;728073;72807;0;0
FK;01;0;0171731992139;4;2017;30/04/2017;594682387037000;"Zainal Arifin.";"Jl. Thalib II No.5 Krukut - Tamansari Jakarta Barat";681927;68193;0;0;0;0;0;0;29136
LT;594682387037000;"Zainal Arifin.";-;-;-;0;0;-;-;-;-;-;-
OF;PP080130;"Legres Promo (Buy 3 Get 1)";125020;6;750120;0;681927;68193;0;0
FK;01;0;0171731992150;4;2017;30/04/2017;579473596823000;"Supantia Saleh";"Jl. Bitung Tengah RT.010 Rw.004. Bitung Tengah - Maesa Bitung";1040100;104010;0;0;0;0;0;0;29147
LT;579473596823000;"Supantia Saleh";-;-;-;0;0;-;-;-;-;-;-
OF;HF060004;"HF Joint Booster 60s";336990;1;336990;0;306355;30635;0;0
OF;NT020003;"Magozai 750ml";562120;1;562120;0;511018;51102;0;0
OF;PP0206;"TOP UP Loyalty 1 Calcium with Vitamin D";49000;5;245000;0;222727;22273;0;0
FK;01;0;0171731992153;4;2017;30/04/2017;579473596823000;"Supantia Saleh";"Jl. Bitung Tengah RT.010 Rw.004. Bitung Tengah - Maesa Bitung";758837;75883;0;0;0;0;0;0;29150
LT;579473596823000;"Supantia Saleh";-;-;-;0;0;-;-;-;-;-;-
OF;HF060003;"HF Bee Propolis 90s";512300;1;512300;0;465727;46573;0;0
OF;BY030011;"Astaderm Face Cream";197400;1;197400;0;179455;17945;0;0
OF;NT020001;Legres;125020;1;125020;0;113655;11365;0;0
FK;01;0;0171731992158;4;2017;30/04/2017;672354446619000;"Surjana Dewi Effendy";"JL. Manyar Tirtoyoso Selatan 4 no. 11 RT 007 RW 005 Manyarsabrangan Mulyorejo surabaya";1533055;153305;0;0;0;0;0;0;29155
LT;672354446619000;"Surjana Dewi Effendy";-;-;-;0;0;-;-;-;-;-;-
OF;PP080124;"Magozai Promo (Buy 3 Get 1)";562120;3;1686360;0;1533055;153305;0;0
FK;01;0;0171731992178;4;2017;30/04/2017;082738550831000;"Harun D. Tumbuan";"Komplek RSD Madani No.19 Kota Palu Sualwesi Tengah";54545;5454;0;0;0;0;0;0;29175
LT;082738550831000;"Harun D. Tumbuan";-;-;-;0;0;-;-;-;-;-;-
OF;MT0101;"Newsletter Unihealth";6000;10;60000;0;54545;5454;0;0
FK;01;0;0171731992179;4;2017;30/04/2017;082738550831000;"Harun D. Tumbuan";"Komplek RSD Madani No.19 Kota Palu Sualwesi Tengah";62727;6273;0;0;0;0;0;0;29176
LT;082738550831000;"Harun D. Tumbuan";-;-;-;0;0;-;-;-;-;-;-
OF;MT0125;"Catalog Vol.2 Th 2017";6900;10;69000;0;62727;6273;0;0
