0MP201610100033059008 00030331               00000000024057540.0000208LLG               BONUS MEMBER      SEPTEMBER 2016                                                                                                                                        
11020006842683                                       00000000000069550.00EVAMIARTI YUNASRI                                                     N      0080017    MANDIRI           wtc 1 jakarta selaBONUS MEMBER      SEPTEMBER 2016                      1R888
11440012791080                                       00000000000053950.00FAJAR NIRMALAWATI                                                     N      0080017    MANDIRI           MADIUN  TAMAN     BONUS MEMBER      SEPTEMBER 2016                      1R888
11540005831866                                       00000000000059725.00JELLY FRANS KEINTJEM                                                  N      0080017    MANDIRI           Timika-TembagapuraBONUS MEMBER      SEPTEMBER 2016                      1R888
17014378248                                          00000000000050125.00DR. RIZA MAULANA                                                      N      4510017    Mandiri Syariah   Luwuk             BONUS MEMBER      SEPTEMBER 2016                      1R888
1520601001631504                                     00000000000062375.00MOH. AMIN AMBO CAGE                                                   N      0020307    BRI               Pehondaa Poso     BONUS MEMBER      SEPTEMBER 2016                      1R888
11100005908378                                       00000000000051925.00DEWI ANGGRAENY                                                        N      0080017    MANDIRI           Jambi             BONUS MEMBER      SEPTEMBER 2016                      1R888
10340148159121                                       00000000000050875.00OTNIEL GEERLAND CANDRA                                                N      0220026    CIMB Niaga        IBC ANDAYANI      BONUS MEMBER      SEPTEMBER 2016                      1R888
11480006950458                                       00000000000073525.00CHARLES OEY JAYA                                                      N      0080017    MANDIRI           Samarinda         BONUS MEMBER      SEPTEMBER 2016                      1R888
11520099133700                                       00000000000050900.00ICHWAN MAHYAR                                                         N      0080017    MANDIRI           kartini Makassar  BONUS MEMBER      SEPTEMBER 2016                      1R888
1381301012688531                                     00000000000078475.00ASTRIUNI                                                              N      0020307    BRI               tamalate panakukanBONUS MEMBER      SEPTEMBER 2016                      1R888
1516101009733538                                     00000000000050200.00NYOMAN ALI                                                            N      0020307    BRI               luwuk             BONUS MEMBER      SEPTEMBER 2016                      1R888
1214301000896534                                     00000000000052875.00RASNAWATI                                                             N      0020307    BRI               KCP. Lasusua      BONUS MEMBER      SEPTEMBER 2016                      1R888
1202301008212502                                     00000000000050900.00ANDRIYANTO ABDUSSAMAD SKM, M.KES                                      N      0020307    BRI               Gorontalo         BONUS MEMBER      SEPTEMBER 2016                      1R888
1734301000546504                                     00000000000328925.00FARADILA SANDI BOLI                                                   N      0020307    BRI               Bogani Kotamobagu BONUS MEMBER      SEPTEMBER 2016                      1R888
1019201021839538                                     00000000000050400.00HARDINA FITRIANA                                                      N      0020307    BRI               SAMRATULANGI KENDABONUS MEMBER      SEPTEMBER 2016                      1R888
11480096031979                                       00000000000050900.00DRA. JUSTINA R BENYAMIN                                               N      0080017    MANDIRI           samarinda         BONUS MEMBER      SEPTEMBER 2016                      1R888
1032101012875506                                     00000000000051725.00DAHLIMAR                                                              N      0020307    BRI               Pariaman          BONUS MEMBER      SEPTEMBER 2016                      1R888
1003601000480568                                     00000000000391480.00ELFIRA REVIANA GILALOM                                                N      0020307    BRI               Kotamobagu        BONUS MEMBER      SEPTEMBER 2016                      1R888
11510007094615                                       00000000000050900.00APRIANI DG MATORANG                                                   N      0080017    MANDIRI           Luwuk             BONUS MEMBER      SEPTEMBER 2016                      1R888
1027901008370539                                     00000000000372600.00HERLINA MOBY                                                          N      0020307    BRI               Gorontalo         BONUS MEMBER      SEPTEMBER 2016                      1R888
10023819872                                          00000000000051325.00WENO YAPERSON                                                         N      1530016    Bank Sinar Mas    BENGKULU          BONUS MEMBER      SEPTEMBER 2016                      1R888
11060090025183                                       00000000000056475.00EDI USMAN                                                             N      0080017    MANDIRI           MEDAN USU         BONUS MEMBER      SEPTEMBER 2016                      1R888
10344462250                                          00000000000334850.00ARIEF ANAKTA PANAMBUNAN                                               N      0090010    BNI               Manado            BONUS MEMBER      SEPTEMBER 2016                      1R888
1002701000314506                                     00000000000051725.00MIN J. THALIB SPD                                                     N      0020307    BRI               gorontalo         BONUS MEMBER      SEPTEMBER 2016                      1R888
123202040041354                                      00000000000052625.00SUKAESIH                                                              N      1170010    Bank Sumut        SUMATERA UTARA    BONUS MEMBER      SEPTEMBER 2016                      1R888
1023201006085502                                     00000000000050400.00ALBERTIN TODING SANDA                                                 N      0020307    BRI               RANTEPAO          BONUS MEMBER      SEPTEMBER 2016                      1R888
10032104808                                          00000000000050900.00YULIA ANITA                                                           N      1530016    Bank Sinar Mas    palembang         BONUS MEMBER      SEPTEMBER 2016                      1R888
11510094002588                                       00000000000052875.00MUTIARA MARLIANA PURBA                                                N      0080017    MANDIRI           Palu              BONUS MEMBER      SEPTEMBER 2016                      1R888
1518901011318534                                     00000000000051225.00AGUSTINUS FERNANDO                                                    N      0020307    BRI               PALU              BONUS MEMBER      SEPTEMBER 2016                      1R888
11100001107801                                       00000000000051825.00SUPARDINATA                                                           N      0080017    MANDIRI           Dr.Sutomo         BONUS MEMBER      SEPTEMBER 2016                      1R888
1500401001906531                                     00000000000083800.00NURLAILAH                                                             N      0020307    BRI               masamba           BONUS MEMBER      SEPTEMBER 2016                      1R888
10310007347977                                       00000000000050800.00MUHAMMAD ZAKARIYA                                                     N      0080017    MANDIRI           PELAIHARI         BONUS MEMBER      SEPTEMBER 2016                      1R888
1512901007926533                                     00000000000051725.00ALBERT HENGA                                                          N      0020307    BRI               unit sentral goronBONUS MEMBER      SEPTEMBER 2016                      1R888
11510006074247                                       00000000000332225.00FIRDAUS PETRO KOROLUS                                                 N      0080017    MANDIRI           Poso              BONUS MEMBER      SEPTEMBER 2016                      1R888
1492701014608531                                     00000000000319350.00HERLINA UDDIN, S.STP, M.SI                                            N      0020307    BRI               Unit andounuhu    BONUS MEMBER      SEPTEMBER 2016                      1R888
1016701037523508                                     00000000000050150.00DESTIN.A.MA                                                           N      0020307    BRI               Luwuk             BONUS MEMBER      SEPTEMBER 2016                      1R888
12525314914                                          00000000000053075.00ERYADI                                                                N      1230015    Bank Kalbar       SAMBAS            BONUS MEMBER      SEPTEMBER 2016                      1R888
1000301037625502                                     00000000000050825.00LISNA HILALINA                                                        N      0020307    BRI               Banjarmasin       BONUS MEMBER      SEPTEMBER 2016                      1R888
11510056783456                                       00000000000102150.00RIWAN FRIDOLIN KELO, ST                                               N      0080017    MANDIRI           Tentena           BONUS MEMBER      SEPTEMBER 2016                      1R888
1002001099414501                                     00000000000051075.00MIARIN EDLIN KUSWARDANI                                               N      0020307    BRI               JAMBI             BONUS MEMBER      SEPTEMBER 2016                      1R888
1358101016020530                                     00000000000051575.00HASANUDDIN                                                            N      0020307    BRI               sungai saddang    BONUS MEMBER      SEPTEMBER 2016                      1R888
1333201027345536                                     00000000000050900.00TRISNAWATI, BSC                                                       N      0020307    BRI               Luwuk             BONUS MEMBER      SEPTEMBER 2016                      1R888
1027901039597502                                     00000000000051575.00AGUS SUSANTO                                                          N      0020307    BRI               Limboto           BONUS MEMBER      SEPTEMBER 2016                      1R888
1515101001422504                                     00000000000052525.00NILUH SRI SUARTINI S.PD                                               N      0020307    BRI               LIMBOTO           BONUS MEMBER      SEPTEMBER 2016                      1R888
11520086001290                                       00000000000326250.00NIRNA LACHMUDDIN                                                      N      0080017    MANDIRI           KENDARI           BONUS MEMBER      SEPTEMBER 2016                      1R888
1399301003119539                                     00000000000050550.00FAISALLUDDIN, SKM                                                     N      0020307    BRI               UNIT RIMO TAPAKTUABONUS MEMBER      SEPTEMBER 2016                      1R888
1547501021196537                                     00000000000050150.00EDWAR IMUSMAN                                                         N      0020307    BRI               PADANG            BONUS MEMBER      SEPTEMBER 2016                      1R888
1202301008895504                                     00000000000052450.00MARMI MARIDJAN                                                        N      0020307    BRI               agus salim        BONUS MEMBER      SEPTEMBER 2016                      1R888
1032601009856539                                     00000000000054825.00SRI YULIANTI                                                          N      0020307    BRI               MURHUM            BONUS MEMBER      SEPTEMBER 2016                      1R888
11510006973199                                       00000000000102950.00YULIANA ASALI                                                         N      0080017    MANDIRI           parigi            BONUS MEMBER      SEPTEMBER 2016                      1R888
1202301014834504                                     00000000000105900.00ROLIA MAMONTO,AMA.PD                                                  N      0020307    BRI               AGUS SALIM        BONUS MEMBER      SEPTEMBER 2016                      1R888
11205001570000010                                    00000000000051725.00HERMI DOTA                                                            N      2000150    BANK BTN          Tawaeli           BONUS MEMBER      SEPTEMBER 2016                      1R888
11500097016107                                       00000000000056750.00PANMILO YANGIN                                                        N      0080017    MANDIRI           Manado            BONUS MEMBER      SEPTEMBER 2016                      1R888
11510006698788                                       00000000000051575.00TRI PRIHATIN                                                          N      0080017    MANDIRI           Palu              BONUS MEMBER      SEPTEMBER 2016                      1R888
10362110193                                          00000000000051825.00DR. KARTIN LIHAWA, M.PD                                               N      0090010    BNI               GORONTALO         BONUS MEMBER      SEPTEMBER 2016                      1R888
11480013707313                                       00000000000088450.00SUCAHYO MAS'AN AL WAHID                                               N      0080017    MANDIRI           SAMARINDA SEBERANGBONUS MEMBER      SEPTEMBER 2016                      1R888
10433273476                                          00000000000051725.00NOVRIYENI BENTU                                                       N      0090010    BNI               gorontalo         BONUS MEMBER      SEPTEMBER 2016                      1R888
1170801002215505                                     00000000000050400.00ANDI GASSING                                                          N      0020307    BRI               Bitung            BONUS MEMBER      SEPTEMBER 2016                      1R888
18110057591                                          00000000000468950.00SRI RAHMALIA ZEES                                                     N      1470011    BANK MUALAMAT     Gorontalo         BONUS MEMBER      SEPTEMBER 2016                      1R888
10216657337                                          00000000000057550.00NURHAMIA HRP                                                          N      0090010    BNI               PADANG SIDIMPUAN  BONUS MEMBER      SEPTEMBER 2016                      1R888
1016701036996504                                     00000000000052525.00YOHANIS PITER                                                         N      0020307    BRI               Luwuk             BONUS MEMBER      SEPTEMBER 2016                      1R888
1603202368                                           00000000000051950.00SLAMAT RIADI                                                          N      1150014    BPD Jambi         Kuala Tungkal     BONUS MEMBER      SEPTEMBER 2016                      1R888
1202301005874509                                     00000000000051250.00KARMILA MACHMUD, MA, PH.D                                             N      0020307    BRI               KCP AGUSSALIM     BONUS MEMBER      SEPTEMBER 2016                      1R888
1563201014485531                                     00000000000050800.00LILING DAYUNI RANGGANIS                                               N      0020307    BRI               JAMBI             BONUS MEMBER      SEPTEMBER 2016                      1R888
170302439995010004921                                00000000000050375.00RODHIAH                                                               N      4510017    Mandiri Syariah   Kuala Tungkal     BONUS MEMBER      SEPTEMBER 2016                      1R888
1016701025699509                                     00000000000050775.00DR. NOVITA                                                            N      0020307    BRI               Luwuk             BONUS MEMBER      SEPTEMBER 2016                      1R888
11540011826991                                       00000000000051250.00PINGKAN KARTINI KONJANAN                                              N      0080017    MANDIRI           jayapura          BONUS MEMBER      SEPTEMBER 2016                      1R888
102702030014862                                      00000000000329300.00RACHMAT PUTRA UTAMA MAKALALAG, SPI                                    N      1270017    Sulut             Kotamobagu        BONUS MEMBER      SEPTEMBER 2016                      1R888
1313901012502535                                     00000000000051150.00INDRAWATI                                                             N      0020307    BRI               KARANG PILANG     BONUS MEMBER      SEPTEMBER 2016                      1R888
1000200150025831                                     00000000000050900.00MAGDALENA                                                             N      2000150    BANK BTN          samarinda         BONUS MEMBER      SEPTEMBER 2016                      1R888
10079977451                                          00000000000052825.00HADIDJAH HASAN                                                        N      0090010    BNI               GORONTALO         BONUS MEMBER      SEPTEMBER 2016                      1R888
11540005165349                                       00000000000050400.00EMMY BATOTANETE                                                       N      0080017    MANDIRI           Wamena            BONUS MEMBER      SEPTEMBER 2016                      1R888
1514301002013531                                     00000000000050900.00SRI AMATILA TUADINGO                                                  N      0020307    BRI               Kotamobagu        BONUS MEMBER      SEPTEMBER 2016                      1R888
1738801002782530                                     00000000000329350.00JERRY DAUD KOUROUW                                                    N      0020307    BRI               Wangurer          BONUS MEMBER      SEPTEMBER 2016                      1R888
1002701035415505                                     00000000000116050.00DR. DHARMA BALANGO                                                    N      0020307    BRI               GORONTALO         BONUS MEMBER      SEPTEMBER 2016                      1R888
11410007890080                                       00000000000050650.00SUNNY WIJAYA                                                          N      0080017    MANDIRI           Surabaya          BONUS MEMBER      SEPTEMBER 2016                      1R888
103002030009348                                      00000000000050900.00NITA VERA KOLINTAMA                                                   N      1270017    Sulut             Molibagu          BONUS MEMBER      SEPTEMBER 2016                      1R888
1021620020052260                                     00000000000050950.00SURTIN  I BOTUTIHE                                                    N      4260121    BANK MEGA         GORONTALO         BONUS MEMBER      SEPTEMBER 2016                      1R888
11100006110933                                       00000000000050250.00AMSYARNEDI ASNAWI                                                     N      0080017    MANDIRI           JAMBI             BONUS MEMBER      SEPTEMBER 2016                      1R888
11460006542570                                       00000000000051575.00MEGA GUS SUNDEWI A.MD, KEB                                            N      0080017    MANDIRI           SAMBAS            BONUS MEMBER      SEPTEMBER 2016                      1R888
1060020120000083105                                  00000000000051950.00RUMITA HERBET                                                         N      1250011    Bank Kalteng      Kapuas            BONUS MEMBER      SEPTEMBER 2016                      1R888
11510096032088                                       00000000000055200.00FERAWATI LAMONDJONG, S.SI.APT                                         N      0080017    MANDIRI           Luwuk             BONUS MEMBER      SEPTEMBER 2016                      1R888
10320154253                                          00000000000401425.00FAHRI KAMULI                                                          N      4270027    BNI SYARIAH       gorontalo         BONUS MEMBER      SEPTEMBER 2016                      1R888
1002701038575508                                     00000000000397300.00SUKARMAN KAMULI                                                       N      0020307    BRI               Gorontalo         BONUS MEMBER      SEPTEMBER 2016                      1R888
1750302690463001                                     00000000000066425.00SURTIN  I BOTUTIHE                                                    N      1270017    Bank Sultra       GORONTALO         BONUS MEMBER      SEPTEMBER 2016                      1R888
1781101000796534                                     00000000000105800.00YAYA D SIDIKI                                                         N      0020307    BRI               Gorontalo         BONUS MEMBER      SEPTEMBER 2016                      1R888
1780501004536531                                     00000000000051575.00SUMIANI S PD                                                          N      0020307    BRI               Palu              BONUS MEMBER      SEPTEMBER 2016                      1R888
1773401001826536                                     00000000000325425.00SRIKANDI INDRIYANI MUMU SP                                            N      0020307    BRI               kotamobagi        BONUS MEMBER      SEPTEMBER 2016                      1R888
10345630203                                          00000000000330800.00FAHMI KAMULI                                                          N      0090010    BNI Taplus        GORONTALO         BONUS MEMBER      SEPTEMBER 2016                      1R888
1002701080309505                                     00000000000051700.00MELIS DJAFAR                                                          N      0020307    BRI               Gorontalo         BONUS MEMBER      SEPTEMBER 2016                      1R888
10079977803                                          00000000000056750.00PROF. DR MOON OTOLUWA, M.HUM                                          N      0090010    BNI               GORONTALO         BONUS MEMBER      SEPTEMBER 2016                      1R888
1202301001004534                                     00000000000050925.00ROSTIN KUDE                                                           N      0020307    BRI               gorontalo         BONUS MEMBER      SEPTEMBER 2016                      1R888
1455401007732530                                     00000000000056700.00ETNA SETIATIN                                                         N      0020307    BRI SIMPEDES      4554 Unit Bati-batBONUS MEMBER      SEPTEMBER 2016                      1R888
11100004488158                                       00000000000052625.00DEWI ANDRI YANI LBS                                                   N      0080017    MANDIRI           JAMBI             BONUS MEMBER      SEPTEMBER 2016                      1R888
11220004632116                                       00000000000094800.00RAYMOND CHANDRA                                                       N      0080017    MANDIRI           jakarta barat     BONUS MEMBER      SEPTEMBER 2016                      1R888
10411417075                                          00000000000050600.00ABU BAKAR                                                             N      0090010    BNI               SURABAYA          BONUS MEMBER      SEPTEMBER 2016                      1R888
1566601009243533                                     00000000000051325.00HAIRIYAH                                                              N      0020307    BRI               KUALA TUNGKAL     BONUS MEMBER      SEPTEMBER 2016                      1R888
11070010335281                                       00000000000050825.00ARMIN SYAHPUTRA HAKIM HARAHAP                                         N      0080017    MANDIRI           PANYABUNGAN       BONUS MEMBER      SEPTEMBER 2016                      1R888
1016701036483501                                     00000000000053925.00MEI EKAPUTRI S. PULU                                                  N      0020307    BRI               Luwuk             BONUS MEMBER      SEPTEMBER 2016                      1R888
1023201028112505                                     00000000000051675.00ELISABETH MASURI                                                      N      0020307    BRI               Rantepao          BONUS MEMBER      SEPTEMBER 2016                      1R888
11060011006395                                       00000000000052750.00DR. JUANA LUSIANTI                                                    N      0080017    MANDIRI           Medan             BONUS MEMBER      SEPTEMBER 2016                      1R888
1333101001972505                                     00000000000052925.00JULAEHA GAIB                                                          N      0020307    BRI               Kotamobagu        BONUS MEMBER      SEPTEMBER 2016                      1R888
10461347017                                          00000000000050400.00AKBAR                                                                 N      4270027    BNI SYARIAH       Syariah Mikro KotaBONUS MEMBER      SEPTEMBER 2016                      1R888
133320101671532                                      00000000000050150.00MASTELDA ALATINGE                                                     N      0020307    BRI               Luwuk             BONUS MEMBER      SEPTEMBER 2016                      1R888
10318008874                                          00000000000050900.00KAHARTO                                                               N      0090010    BNI               makassar          BONUS MEMBER      SEPTEMBER 2016                      1R888
10310010204843                                       00000000000050800.00FAULYNA                                                               N      0080017    MANDIRI           Kertak Hanyar     BONUS MEMBER      SEPTEMBER 2016                      1R888
11460007359818                                       00000000000051650.00HJ KUSMAYATI                                                          N      0080017    MANDIRI           SAMBAS            BONUS MEMBER      SEPTEMBER 2016                      1R888
1019201126766509                                     00000000000050400.00STARNI                                                                N      0020307    BRI               kendari           BONUS MEMBER      SEPTEMBER 2016                      1R888
17503025312660001                                    00000000000112150.00DEWICE MANGGAS                                                        N      1270017    Bank Sultra       CAPEM SUWAWA      BONUS MEMBER      SEPTEMBER 2016                      1R888
11070009799539                                       00000000000053825.00R.R. MANURUNG S.H.                                                    N      0080017    MANDIRI           KOTA PINANG       BONUS MEMBER      SEPTEMBER 2016                      1R888
12525284781                                          00000000000054650.00ERWANA                                                                N      1230015    Bank Kalbar       SAMBAS            BONUS MEMBER      SEPTEMBER 2016                      1R888
1002701053812503                                     00000000000050900.00IR. NURLAELA NINGSI MUSA                                              N      0020307    BRI               Gorontalo         BONUS MEMBER      SEPTEMBER 2016                      1R888
1019201118920509                                     00000000000161175.00RATMAN SARITA,AMA                                                     N      0020307    BRI               kendari           BONUS MEMBER      SEPTEMBER 2016                      1R888
11070007219712                                       00000000000084125.00SYAFRUDDIN                                                            N      0080017    MANDIRI           PANYABUNGAN       BONUS MEMBER      SEPTEMBER 2016                      1R888
10259957453                                          00000000000050275.00FRIEDA LILAWATI NATALIA R                                             N      0090010    BNI               Samarinda         BONUS MEMBER      SEPTEMBER 2016                      1R888
1335901038157536                                     00000000000327575.00FEBRI REZKI RAHAYU                                                    N      0020307    BRI               UNIT RIMBO BUJANG BONUS MEMBER      SEPTEMBER 2016                      1R888
1019201111615501                                     00000000000055550.00GUSTI SETIAWAN HAFID S.SOS                                            N      0020307    BRI               KENDARI           BONUS MEMBER      SEPTEMBER 2016                      1R888
1130901004244502                                     00000000000055225.00RAHMADHANI                                                            N      0020307    BRI               LANGSA            BONUS MEMBER      SEPTEMBER 2016                      1R888
10127974673                                          00000000000325425.00SAPHAN BUATA                                                          N      0090010    BNI               Gorontalo         BONUS MEMBER      SEPTEMBER 2016                      1R888
10232001000723500                                    00000000000050400.00EMMY  MANGINTE                                                        N      0020307    BRI               Makale            BONUS MEMBER      SEPTEMBER 2016                      1R888
1713601007128538                                     00000000000050900.00SARLINA, SH                                                           N      0020307    BRI               BRI Simpedes TampoBONUS MEMBER      SEPTEMBER 2016                      1R888
11540010944570                                       00000000000325225.00SURMIANI SUYUTI MS                                                    N      0080017    MANDIRI           jayapura          BONUS MEMBER      SEPTEMBER 2016                      1R888
10600201000124472                                    00000000000051325.00FRIDA JENTA                                                           N      1250011    Bank Kalteng      Palangkaraya      BONUS MEMBER      SEPTEMBER 2016                      1R888
10360304270                                          00000000000054175.00FATMI YULIANA                                                         N      0090010    BNI               Capem Luwu MasambaBONUS MEMBER      SEPTEMBER 2016                      1R888
10341745297                                          00000000000050775.00ONDERMAN SABINTOE                                                     N      0090010    BNI               poso              BONUS MEMBER      SEPTEMBER 2016                      1R888
1064601009266530                                     00000000000334975.00WA SINAR                                                              N      0020307    BRI               KENDARI           BONUS MEMBER      SEPTEMBER 2016                      1R888
11510007214684                                       00000000000050900.00IR. M. RIZAL PANRELLY MTP                                             N      0080017    MANDIRI           Luwuk             BONUS MEMBER      SEPTEMBER 2016                      1R888
1002701038357502                                     00000000000056475.00SUPARTIN, S.PD, M.PD                                                  N      0020307    BRI               GORONTALO         BONUS MEMBER      SEPTEMBER 2016                      1R888
11070004615391                                       00000000000070900.00ELI MAHARANI LUBIS                                                    N      0080017    MANDIRI           PANYABUNGAN       BONUS MEMBER      SEPTEMBER 2016                      1R888
1518901008985538                                     00000000000052450.00SANTHY LIDIAWATI TUNGGAI                                              N      0020307    BRI               palu              BONUS MEMBER      SEPTEMBER 2016                      1R888
1006001010510536                                     00000000000054650.00SITI MUAWANAH                                                         N      0020307    BRI               Palu              BONUS MEMBER      SEPTEMBER 2016                      1R888
10220798440                                          00000000000053300.00IDHIYATURRAHMI                                                        N      0090010    BNI               Kuala Tungkal     BONUS MEMBER      SEPTEMBER 2016                      1R888
11520010362576                                       00000000000050900.00SYAMSU MILLAH                                                         N      0080017    MANDIRI           Kartini Makassar  BONUS MEMBER      SEPTEMBER 2016                      1R888
1301101001099501                                     00000000000051575.00HERU SUHARTANTO                                                       N      0020307    BRI               Kotamobagu        BONUS MEMBER      SEPTEMBER 2016                      1R888
10222803358                                          00000000000050625.00JOICE IMELDA SAIDAH                                                   N      0090010    BNI               Bekasi            BONUS MEMBER      SEPTEMBER 2016                      1R888
11620000323026                                       00000000000054350.00KARTINA SKM                                                           N      0080017    MANDIRI           Kendari Mesjid AguBONUS MEMBER      SEPTEMBER 2016                      1R888
11620001449184                                       00000000000054300.00IR.YENNY FREDERIKA EMY                                                N      0080017    MANDIRI           kendari           BONUS MEMBER      SEPTEMBER 2016                      1R888
10291297779                                          00000000000064975.00NANIK WINARNI                                                         N      0090010    BNI               Kramat            BONUS MEMBER      SEPTEMBER 2016                      1R888
19000025781452                                       00000000000051675.00DIAN YEVITA                                                           N      0080017    MANDIRI           JAMBI             BONUS MEMBER      SEPTEMBER 2016                      1R888
11550006325529                                       00000000000343250.00HUTAMA ADILUKITO                                                      N      0080017    MANDIRI           KCP BUMI PERMATA IBONUS MEMBER      SEPTEMBER 2016                      1R888
1007201024518501                                     00000000000106200.00RISNIATI A. MAWURI                                                    N      0020307    BRI               Poso              BONUS MEMBER      SEPTEMBER 2016                      1R888
1760607479900                                        00000000000050600.00LANNY KURNIANINGSIH                                                   N      0220026    CIMB Niaga        DUKUH KUPANG      BONUS MEMBER      SEPTEMBER 2016                      1R888
1493401016429536                                     00000000000328900.00ERNAWATI                                                              N      0020307    BRI               Unit Ladongi      BONUS MEMBER      SEPTEMBER 2016                      1R888
1381901020419530                                     00000000000050900.00RAYU                                                                  N      0020307    BRI               pongtiku          BONUS MEMBER      SEPTEMBER 2016                      1R888
11530015297720                                       00000000000050275.00MURNIATI                                                              N      0080017    MANDIRI           Pangkep           BONUS MEMBER      SEPTEMBER 2016                      1R888
11500010783189                                       00000000000050000.00HADIJAH THALIB                                                        N      4510017    Mandiri Syariah   Bitung            BONUS MEMBER      SEPTEMBER 2016                      1R888
1520101015670532                                     00000000000329800.00MARICE TUNGKA                                                         N      0020307    BRI               Poso              BONUS MEMBER      SEPTEMBER 2016                      1R888
19000034714486                                       00000000000050000.00DR. NI LUH INDRI ASTARI, SP.THT                                       N      0080017    MANDIRI           Buleleng          BONUS MEMBER      SEPTEMBER 2016                      1R888
11270003014                                          00000000000050150.00FANDITA RONY WIJAYA                                                   N      1470011    BANK MUALAMAT     BOGOR             BONUS MEMBER      SEPTEMBER 2016                      1R888
17088386827                                          00000000000053400.00RIDHO JUNIAN PERDANA                                                  N      4510017    Mandiri Syariah   Sentani           BONUS MEMBER      SEPTEMBER 2016                      1R888
1002701066968505                                     00000000000051400.00MASNI TAWABA                                                          N      0020307    BRI               Gorontalo         BONUS MEMBER      SEPTEMBER 2016                      1R888
1516401015385537                                     00000000000058850.00SUMARNI TALIB                                                         N      0020307    BRI               SALAKAN           BONUS MEMBER      SEPTEMBER 2016                      1R888
1518401002210503                                     00000000000327500.00FATMA A DEU                                                           N      0020307    BRI               Unit Kartini      BONUS MEMBER      SEPTEMBER 2016                      1R888
1005001089144505                                     00000000000050275.00RAHMANIAR                                                             N      0020307    BRI               Makassar Ahmad YanBONUS MEMBER      SEPTEMBER 2016                      1R888
137201500017378                                      00000000000050900.00WARDHANI                                                              N      2000150    BANK BTN          KiMa Makassar     BONUS MEMBER      SEPTEMBER 2016                      1R888
1707801006288531                                     00000000000050900.00YUSRI S.SOS                                                           N      0020307    BRI               borong Raya MakassBONUS MEMBER      SEPTEMBER 2016                      1R888
1068701009274505                                     00000000000325375.00INA LUSIN                                                             N      0020307    BRI               Nabire            BONUS MEMBER      SEPTEMBER 2016                      1R888
10209996582                                          00000000000050900.00NIRWANA NATALIA DUNDA                                                 N      0090010    BNI               gorontalo         BONUS MEMBER      SEPTEMBER 2016                      1R888
134202040014144                                      00000000000050900.00MISKAH RANGKUTI                                                       N      1170010    Bank Sumut        NATAL             BONUS MEMBER      SEPTEMBER 2016                      1R888
11500010462982                                       00000000000640400.00DRA. RASUNA TALIB,M.HUM                                               N      0080017    MANDIRI           Gorontalo         BONUS MEMBER      SEPTEMBER 2016                      1R888
10296434621                                          00000000001265110.00MAIMUN IHSAN                                                          N      0090010    BNI               gorontalo         BONUS MEMBER      SEPTEMBER 2016                      1R888
1003601000204564                                     00000000000328575.00NELMI ANGKATO                                                         N      0020307    BRI               Kotamobagu        BONUS MEMBER      SEPTEMBER 2016                      1R888
1513201012931536                                     00000000000326175.00LUSIANA KAJID                                                         N      0020307    BRI               Gorontalo         BONUS MEMBER      SEPTEMBER 2016                      1R888
11100007910281                                       00000000000050050.00HJ. SUYANTI                                                           N      0080017    MANDIRI           MENDALO DARAT     BONUS MEMBER      SEPTEMBER 2016                      1R888
11510004585748                                       00000000000050175.00DR. FRESKA HONGKIRIWANG                                               N      0080017    MANDIRI           Luwuk             BONUS MEMBER      SEPTEMBER 2016                      1R888
10294433459                                          00000000000052625.00IBU NORMAYANI                                                         N      0090010    BNI               BANJARMASIN       BONUS MEMBER      SEPTEMBER 2016                      1R888
1700170716000                                        00000000000134500.00ANDU SUFYAN                                                           N      0220026    CIMB Niaga        JL. SUDIRMAN YOGYABONUS MEMBER      SEPTEMBER 2016                      1R888
11510006982729                                       00000000000050675.00INCE ROSMINI                                                          N      0080017    MANDIRI           Poso              BONUS MEMBER      SEPTEMBER 2016                      1R888
11520040000099                                       00000000000060200.00CLARA                                                                 N      0080017    MANDIRI           KENDARI           BONUS MEMBER      SEPTEMBER 2016                      1R888
12090100998188                                       00000000000070750.00ROEMANI                                                               N      0220026    CIMB Niaga        Tidar             BONUS MEMBER      SEPTEMBER 2016                      1R888
11500004695142                                       00000000000339650.00ERAWATY IBRAHIM                                                       N      0080017    MANDIRI           Gorontalo         BONUS MEMBER      SEPTEMBER 2016                      1R888
1032601058825501                                     00000000000050900.00NURSINA EDU                                                           N      0020307    BRI               MURHUM            BONUS MEMBER      SEPTEMBER 2016                      1R888
10362131612                                          00000000000100950.00NOVIANTY DJAFRI                                                       N      0090010    BNI               Gorontalo         BONUS MEMBER      SEPTEMBER 2016                      1R888
10081068612                                          00000000000054125.00MASKAMIAN ANJAM,IR HJ                                                 N      0090010    BNI               Banjarbaru        BONUS MEMBER      SEPTEMBER 2016                      1R888
10253081094                                          00000000000050400.00TRISNA PUTRI YATARI                                                   N      0080017    MANDIRI           Kuala Tanjung     BONUS MEMBER      SEPTEMBER 2016                      1R888
1202301009227500                                     00000000000051750.00VITA ASTRIYANI STP                                                    N      0020307    BRI               Gorontalo         BONUS MEMBER      SEPTEMBER 2016                      1R888
1040401006969507                                     00000000000053700.00YUSTINA SUMIYATI                                                      N      0020307    BRI               YOGYAKARTA MLATI  BONUS MEMBER      SEPTEMBER 2016                      1R888
17039393756                                          00000000000381400.00NURHADIAH                                                             N      4510017    Mandiri Syariah   kendari           BONUS MEMBER      SEPTEMBER 2016                      1R888
1305401013795537                                     00000000000064675.00YULIANA                                                               N      0020307    BRI               Unit Ujung Pare paBONUS MEMBER      SEPTEMBER 2016                      1R888
1610801015957533                                     00000000000050900.00SUYATI S.PD                                                           N      0020307    BRI               Bangkalan         BONUS MEMBER      SEPTEMBER 2016                      1R888
1002701055358507                                     00000000000325100.00HASLINDA MOODUTO                                                      N      0020307    BRI               Gorontalo         BONUS MEMBER      SEPTEMBER 2016                      1R888
11370005660838                                       00000000000475175.00RENA S.SIT, M.PH                                                      N      0080017    MANDIRI           Yogyakarta        BONUS MEMBER      SEPTEMBER 2016                      1R888
1005001102449509                                     00000000000050900.00SUDIRMAN H, SYAMSU                                                    N      0020307    BRI               Ahmad Yani MakassaBONUS MEMBER      SEPTEMBER 2016                      1R888
1781101002750534                                     00000000000056000.00MUHAMMAD TAUFIQ UMAR                                                  N      0020307    BRI               KOTA TIMUR        BONUS MEMBER      SEPTEMBER 2016                      1R888
1563201012947537                                     00000000000050800.00DYAH MAHANANI                                                         N      0020307    BRI               JAMBI             BONUS MEMBER      SEPTEMBER 2016                      1R888
1491801009992530                                     00000000000325050.00HJ.RAHMATIA                                                           N      0020307    BRI               abepura           BONUS MEMBER      SEPTEMBER 2016                      1R888
1016701045792507                                     00000000000056000.00NI WAYAN FITRIANI                                                     N      0020307    BRI               LUWUK             BONUS MEMBER      SEPTEMBER 2016                      1R888
11252045909                                          00000000000060200.00SYARIFAH ZOHRAH                                                       N      1240018    Bank KalTim       KELEDANG          BONUS MEMBER      SEPTEMBER 2016                      1R888
1513301039589534                                     00000000000975000.00FENNY MBUINGA, S.SOS                                                  N      0020307    BRI               Gorontalo         BONUS MEMBER      SEPTEMBER 2016                      1R888
1003535692960                                        00000000000051575.00NURLAILI S PD                                                         N      0110042    BANK DANAMON      LANGSA            BONUS MEMBER      SEPTEMBER 2016                      1R888
11490005260221                                       00000000000050500.00MARINI                                                                N      0080017    MANDIRI           Balikpapan        BONUS MEMBER      SEPTEMBER 2016                      1R888
10310006273323                                       00000000000052625.00NANA MARIANA                                                          N      0080017    MANDIRI           BANJARMASIN P.SAMUBONUS MEMBER      SEPTEMBER 2016                      1R888
11370010134647                                       00000000000119750.00HILDA HARUN S.K.M.                                                    N      0080017    MANDIRI           Kendari           BONUS MEMBER      SEPTEMBER 2016                      1R888
13025773801                                          00000000000051525.00YESISKA ALIN                                                          N      1230015    Bank Kalbar       SANGGAU           BONUS MEMBER      SEPTEMBER 2016                      1R888
1347101025487532                                     00000000000050400.00SUSILAWATI                                                            N      0020307    BRI               3471 UNIT JERUJU PBONUS MEMBER      SEPTEMBER 2016                      1R888
19000037483691                                       00000000000050900.00PAULINA MANUS KOFI                                                    N      0080017    MANDIRI           KENDARI, SOEKARNO BONUS MEMBER      SEPTEMBER 2016                      1R888
1745201002971532                                     00000000000059525.00RABIA                                                                 N      0020307    BRI               7452 Unit Unhalu KBONUS MEMBER      SEPTEMBER 2016                      1R888
11510007340281                                       00000000000055200.00JESSIE VERENT TOLEMBO                                                 N      0080017    MANDIRI           Tentena           BONUS MEMBER      SEPTEMBER 2016                      1R888
17098276798                                          00000000000055800.00DR. DAVY ALEXANDER C.LENGKEY, SPB                                     N      4510017    Mandiri Syariah   Luwuk             BONUS MEMBER      SEPTEMBER 2016                      1R888
11510004962707                                       00000000000054600.00ANDI ISWAHYU,SSI.,APT                                                 N      0080017    MANDIRI           Luwuk             BONUS MEMBER      SEPTEMBER 2016                      1R888
10379896345                                          00000000000051125.00DRG.RIDWAN ADJIS ICHSAN                                               N      0090010    BNI               Bitung            BONUS MEMBER      SEPTEMBER 2016                      1R888
10155503916                                          00000000000053150.00RANGGA RANTE TONDOK                                                   N      0090010    BNI               Palopo            BONUS MEMBER      SEPTEMBER 2016                      1R888
11620000880785                                       00000000000326475.00INDRAWATI                                                             N      0080017    MANDIRI           KENDARI           BONUS MEMBER      SEPTEMBER 2016                      1R888
1006001053908502                                     00000000000324850.00FERAWATI MIRANTI                                                      N      0020307    BRI               PALU              BONUS MEMBER      SEPTEMBER 2016                      1R888
1524301004678539                                     00000000000050400.00GRES FERA WATANIA                                                     N      0020307    BRI               Tombatu           BONUS MEMBER      SEPTEMBER 2016                      1R888
1729901001501532                                     00000000000102750.00HJ NURJIHAD                                                           N      0020307    BRI               Samarinda         BONUS MEMBER      SEPTEMBER 2016                      1R888
1333201026442539                                     00000000000052550.00ABDUL HARIS PILOHIMA                                                  N      0020307    BRI               Banggai Kepulauan BONUS MEMBER      SEPTEMBER 2016                      1R888
1518001010169538                                     00000000000053550.00RIFKA FRANINDA                                                        N      0020307    BRI               Palu              BONUS MEMBER      SEPTEMBER 2016                      1R888
