FK;KD_JENIS_TRANSAKSI;FG_PENGGANTI;NOMOR_FAKTUR;MASA_PAJAK;TAHUN_PAJAK;TANGGAL_FAKTUR;NPWP;NAMA;ALAMAT_LENGKAP;JUMLAH_DPP;JUMLAH_PPN;JUMLAH_PPNBM;ID_KETERANGAN_TAMBAHAN;FP_UANG_MUKA;UANG_MUKA_DPP;UANG_MUKA_PPN;UANG_MUKA_PPNBM;REFERENSI
LT;NPWP;NAMA;JALAN;BLOK;NOMOR;RT;RW;KECAMATAN;KELURAHAN;KABUPATEN;PROPINSI;KODE_POS;NOMOR_TELEPON
OF;KODE_OBJEK;NAMA;HARGA_SATUAN;JUMLAH_BARANG;HARGA_TOTAL;DISKON;DPP;PPN;TARIF_PPNBM;PPNBM
FK;01;0;0041509111312;10;2015;26/10/2015;073245110047000;"Inneke Kusumo";"Jl.Pluit sakti raya no.143 Rt:09 Rw:07 Pluit Penjaringan Jakarta Utara";1630909;163091;0;0;0;0;0;0;138855
LT;073245110047000;"Inneke Kusumo";-;-;-;0;0;-;-;-;-;-;-
OF;NT020003;"Magozai ";598000;3;1794000;0;1630909;163091;0;0
FK;01;0;0041509111447;10;2015;30/10/2015;154440663201000;Wenny;"Komp. Pondok Indah Permai A/2 T.Hitam Padang";362727;36273;0;0;0;0;0;0;140003
LT;154440663201000;Wenny;-;-;-;0;0;-;-;-;-;-;-
OF;NT020001;Legres;133000;3;399000;0;362727;36273;0;0
