0SP201904090033059008 00030331               00000000459271339.0000385BCA               BONUS MEMBER      MARET 2019                                                                                                                                            
13422880868                                          00000000000243562.00A TENRI NOLA UPA                                                      B      0140397    BCA               KCP Mataraman     BONUS MEMBER      MARET 2019                          1R014
17685051231                                          00000000006565874.00A YUDI JAYA MUSRADHY P                                                B      0140397    BCA               Sungguminasa      BONUS MEMBER      MARET 2019                          1R014
17920665068                                          00000000000101393.00ABDUL FARIS                                                           B      0140397    BCA               PALU              BONUS MEMBER      MARET 2019                          1R014
13880409866                                          00000000000103677.00ACHMAD YUSUF DR SPKK                                                  B      0140397    BCA               Dharmahusada SurabBONUS MEMBER      MARET 2019                          1R014
17910573050                                          00000000001232496.00ADRYAN FRISTIOHADI MSC-A                                              B      0140397    BCA               Kendari           BONUS MEMBER      MARET 2019                          1R014
18140224457                                          00000000000052308.00AFRIAN NURCAHYO SALEH                                                 B      0140397    BCA               Jayapura          BONUS MEMBER      MARET 2019                          1R014
17360166532                                          00000000000727510.00AGUS RINI SULISTIOWATY                                                B      0140397    BCA               tajur             BONUS MEMBER      MARET 2019                          1R014
16665052579                                          00000000000102044.00AGUSTINA EKA BUDI                                                     B      0140397    BCA               Sambas            BONUS MEMBER      MARET 2019                          1R014
10540962600                                          00000000000236034.00ALAN DWILANGGA                                                        B      0140397    BCA               Tasikmalaya       BONUS MEMBER      MARET 2019                          1R014
18140203620                                          00000000000163901.00ALBERT LENGKONG                                                       B      0140397    BCA               JAYAPURA          BONUS MEMBER      MARET 2019                          1R014
14582204377                                          00000000000663055.00ALDO LAMMY                                                            B      0140397    BCA               Jakarta           BONUS MEMBER      MARET 2019                          1R014
12581605007                                          00000000000216059.00ALFRYATI VENTHY SANDA SAU TAN                                         B      0140397    BCA               Surabaya          BONUS MEMBER      MARET 2019                          1R014
12200053624                                          00000000000107989.00AMAN YULIUS                                                           B      0140397    BCA               Pekanbaru         BONUS MEMBER      MARET 2019                          1R014
12851104242                                          00000000000342260.00AMIN SUMA                                                             B      0140397    BCA               285               BONUS MEMBER      MARET 2019                          1R014
16265019343                                          00000000000050290.00ANA SUSILOWATI SE                                                     B      0140397    BCA               Plaza Marina      BONUS MEMBER      MARET 2019                          1R014
18160188708                                          00000000000050290.00ANASTASIA PRASASTI ANGGRAINI                                          B      0140397    BCA               Borobudur         BONUS MEMBER      MARET 2019                          1R014
16720438061                                          00000000000051260.00ANASTASIA VANIA SEPUTRA                                               B      0140397    BCA               Taman Pondok IndahBONUS MEMBER      MARET 2019                          1R014
10270948880                                          00000000000052472.00ANDRE ABENG                                                           B      0140397    BCA               SAMARINDA         BONUS MEMBER      MARET 2019                          1R014
11821922238                                          00000000000233862.00ANG MARINA ARYATI S                                                   B      0140397    BCA               Semarang          BONUS MEMBER      MARET 2019                          1R014
17910710600                                          00000000000206460.00ANGELA WILDA GEODELITA ZALUCHU                                        B      0140397    BCA               Kendari           BONUS MEMBER      MARET 2019                          1R014
18690593301                                          00000000000152140.00ANITA JAMALUDIN SE                                                    B      0140397    BCA               Depok             BONUS MEMBER      MARET 2019                          1R014
10940643180                                          00000000000150200.00ANNA LUCKY MERIDIANA Z, ST                                            B      0140397    BCA               Pekanbaru         BONUS MEMBER      MARET 2019                          1R014
16720068379                                          00000000000221010.00ANNA TRISULA AL LO TJIOE                                              B      0140397    BCA               taman pondok indahBONUS MEMBER      MARET 2019                          1R014
10320912555                                          00000000000202580.00ANTONY FIRGO IR                                                       B      0140397    BCA               KCU Padang        BONUS MEMBER      MARET 2019                          1R014
18295031677                                          00000000000310182.00ARTHER SONLY LEMBONG                                                  B      0140397    BCA               Manado            BONUS MEMBER      MARET 2019                          1R014
17870484423                                          00000000000052634.00ASMANI                                                                B      0140397    BCA               SIPIN JAMBI       BONUS MEMBER      MARET 2019                          1R014
11773086592                                          00000000000163536.00BABANG SOETRISNO                                                      B      0140397    BCA               Madiun            BONUS MEMBER      MARET 2019                          1R014
13909519772                                          00000000000300650.00BASRI                                                                 B      0140397    BCA               Veteran makassar  BONUS MEMBER      MARET 2019                          1R014
16730262564                                          00000000000111400.00BASUKI SISWANTA                                                       B      0140397    BCA               Rungkut           BONUS MEMBER      MARET 2019                          1R014
12671571195                                          00000000000051502.00BAYU ADHI KURNIAWAN                                                   B      0140397    BCA               CINERE            BONUS MEMBER      MARET 2019                          1R014
15660270860                                          00000000000063186.00BERNADETHA MARIES PRANAN                                              B      0140397    BCA               KCP PANGLIMA POLIMBONUS MEMBER      MARET 2019                          1R014
10292392931                                          00000000000283258.00BOYDO IMMANUEL SARAGIH                                                B      0140397    BCA               PONTIANAK         BONUS MEMBER      MARET 2019                          1R014
15060095398                                          00000000000163539.00BUDHY SUTANTO.IR                                                      B      0140397    BCA               Surabaya          BONUS MEMBER      MARET 2019                          1R014
14641121589                                          00000000000103640.00BUDI HARTONO                                                          B      0140397    BCA               Surabaya          BONUS MEMBER      MARET 2019                          1R014
14212295292                                          00000000000308820.00BUDI RAHARDJO                                                         B      0140397    BCA               Margonda Depok    BONUS MEMBER      MARET 2019                          1R014
10103448899                                          00000000000223338.00CALVIN ALEXANDER EFANS J                                              B      0140397    BCA               Veteran           BONUS MEMBER      MARET 2019                          1R014
10095158779                                          00000000000053200.00CATHARINA ARIANI WAHYUNINGSIH                                         B      0140397    BCA               Semarang          BONUS MEMBER      MARET 2019                          1R014
13691033021                                          00000000002334276.00CHARLIE BUDIMAN SH                                                    B      0140397    BCA               Tanah Abang       BONUS MEMBER      MARET 2019                          1R014
14710032497                                          00000000003175295.00CHARLOTHA PUTRI SHARON                                                B      0140397    BCA               Surabaya          BONUS MEMBER      MARET 2019                          1R014
10262469075                                          00000000000215110.00CHINTYA SALU                                                          B      0140397    BCA               Manado            BONUS MEMBER      MARET 2019                          1R014
10690308983                                          00000000000053200.00CHRISELDA TANTRA                                                      B      0140397    BCA               bukittinggi       BONUS MEMBER      MARET 2019                          1R014
11700200953                                          00000000000256912.00CHRISTIE MONINGKEY                                                    B      0140397    BCA               Tomohon           BONUS MEMBER      MARET 2019                          1R014
11192151575                                          00000000000072600.00CINDRA WATI JAP                                                       B      0140397    BCA               KCU JAMBI         BONUS MEMBER      MARET 2019                          1R014
12211205123                                          00000000000092000.00CITRA HALIM                                                           B      0140397    BCA               Menara Imperium   BONUS MEMBER      MARET 2019                          1R014
16800040017                                          00000000000108248.00CONNY R TOMBOKAN                                                      B      0140397    BCA               Kelapa Gading     BONUS MEMBER      MARET 2019                          1R014
12540095739                                          00000000000161934.00CORINA LUCHAS                                                         B      0140397    BCA               samarinda         BONUS MEMBER      MARET 2019                          1R014
18050030734                                          00000000000222226.00CORNELIA CHANDRA BSC                                                  B      0140397    BCA               bukittinggi       BONUS MEMBER      MARET 2019                          1R014
11710941510                                          00000000000564985.00CORNELLYA KANDARY                                                     B      0140397    BCA               RAMADI USMAN      BONUS MEMBER      MARET 2019                          1R014
16270081434                                          00000000000101685.00CURDI SOPANDI                                                         B      0140397    BCA               KCP Tebet Barat 2 BONUS MEMBER      MARET 2019                          1R014
10430970968                                          00000000002673861.00CUT ZAKIA PUTRI FANDANI                                               B      0140397    BCA               BANDA ACEH        BONUS MEMBER      MARET 2019                          1R014
17895400173                                          00000000000313713.00CYINTIA DEVI ARINDA PUTRI                                             B      0140397    BCA               BANJARBARU        BONUS MEMBER      MARET 2019                          1R014
11910414859                                          00000000000050048.00D MARLANELLY P. N. NERWAN ST. MT                                      B      0140397    BCA               Balikpapan        BONUS MEMBER      MARET 2019                          1R014
18585131683                                          00000000001199958.00DAMARIS TIKU                                                          B      0140397    BCA               PANGKALAN BUN     BONUS MEMBER      MARET 2019                          1R014
13451721435                                          00000000000053200.00DAMAYANTI                                                             B      0140397    BCA               Pondok lestari    BONUS MEMBER      MARET 2019                          1R014
11630357205                                          00000000000792788.00DARMAWAN TEDJA                                                        B      0140397    BCA               Padang            BONUS MEMBER      MARET 2019                          1R014
17920315482                                          00000000000889698.00DARUSMAN M LAMANGKAU SE                                               B      0140397    BCA               Palu              BONUS MEMBER      MARET 2019                          1R014
12710645542                                          00000000000053200.00DEASY FIRDANINGSIH                                                    B      0140397    BCA               Sepanjang         BONUS MEMBER      MARET 2019                          1R014
17025018966                                          00000000000053200.00DELLY MULIARIADI                                                      B      0140397    BCA               000000000         BONUS MEMBER      MARET 2019                          1R014
11192097287                                          00000000012423479.00DELVIRA                                                               B      0140397    BCA               Jambi             BONUS MEMBER      MARET 2019                          1R014
15120478330                                          00000000000050290.00DENNY CHRISTUPEL TUPAMAHU                                             B      0140397    BCA               Prapen            BONUS MEMBER      MARET 2019                          1R014
18205033315                                          00000000001089046.00DERMAWATI TURNIP                                                      B      0140397    BCA               SETIA BUDI        BONUS MEMBER      MARET 2019                          1R014
10041619898                                          00000000000255930.00DESY MARIANI                                                          B      0140397    BCA               KCP REG TANAH ABANBONUS MEMBER      MARET 2019                          1R014
17880492262                                          00000000000107618.00DEWI HESTYANA                                                         B      0140397    BCA               Surabaya          BONUS MEMBER      MARET 2019                          1R014
11285783614                                          00000000000153505.00DHARMA SALIM                                                          B      0140397    BCA               Jakarta barat     BONUS MEMBER      MARET 2019                          1R014
11302095897                                          00000000000169600.00DIAN TJAHYARINA                                                       B      0140397    BCA               Manyar surabaya   BONUS MEMBER      MARET 2019                          1R014
17920178531                                          00000000001682010.00DIONISIUS RORI PARENGKUA                                              B      0140397    BCA               palu              BONUS MEMBER      MARET 2019                          1R014
16050168288                                          00000000000072600.00DONIH                                                                 B      0140397    BCA               605               BONUS MEMBER      MARET 2019                          1R014
10102196773                                          00000000000053200.00DR ESTHER MAGDALENA RUMONDOR                                          B      0140397    BCA               KREMBANGAN        BONUS MEMBER      MARET 2019                          1R014
12150181073                                          00000000000103269.00DR JOHAN PRASETYO, SP KFR                                             B      0140397    BCA               Surabaya          BONUS MEMBER      MARET 2019                          1R014
10871081637                                          00000000000101892.00DR RUDY SPOG                                                          B      0140397    BCA               PASURUAN          BONUS MEMBER      MARET 2019                          1R014
10323801476                                          00000000000072600.00DR WIDYARMAN                                                          B      0140397    BCA               padang            BONUS MEMBER      MARET 2019                          1R014
11710163681                                          00000000000072600.00DR. SAUKANI HALIM, SP.OG                                              B      0140397    BCA               Pontianak         BONUS MEMBER      MARET 2019                          1R014
10292110772                                          00000000000072600.00EDISON P SARAGIH SP                                                   B      0140397    BCA               PONTIANAK         BONUS MEMBER      MARET 2019                          1R014
13091172451                                          00000000000111400.00ELKE SALIM                                                            B      0140397    BCA               0000000000        BONUS MEMBER      MARET 2019                          1R014
10021223785                                          00000000000456560.00ELLYJATY SALIM                                                        B      0140397    BCA               00000000000000000 BONUS MEMBER      MARET 2019                          1R014
16610439592                                          00000000000101588.00ELYEZER SAMPE                                                         B      0140397    BCA               Proklamasi Depok  BONUS MEMBER      MARET 2019                          1R014
16041046721                                          00000000000053200.00EMILY HAPPYWISE                                                       B      0140397    BCA               BINTARO EXCHANGE  BONUS MEMBER      MARET 2019                          1R014
12581563851                                          00000000007452981.00EMMY INDRIATY                                                         B      0140397    BCA               Diponegoro        BONUS MEMBER      MARET 2019                          1R014
17830196981                                          00000000000050468.00EMMYLIA SUTEDJA                                                       B      0140397    BCA               semarang          BONUS MEMBER      MARET 2019                          1R014
12731381820                                          00000000000089672.00ENDAH DWIYARTI                                                        B      0140397    BCA               cawang            BONUS MEMBER      MARET 2019                          1R014
11230359667                                          00000000000099760.00ENDANG DWI ASTUTIK                                                    B      0140397    BCA               kepanjen          BONUS MEMBER      MARET 2019                          1R014
15415035435                                          00000000001201885.00ENDY MUHARDIN MOEGNI DR                                               B      0140397    BCA               KCP MALL GRAND INDBONUS MEMBER      MARET 2019                          1R014
15065069935                                          00000000002225607.00ENI SUHARTATIK                                                        B      0140397    BCA               tropodo           BONUS MEMBER      MARET 2019                          1R014
15730249294                                          00000000000522935.00ERNA AGUSTIN S                                                        B      0140397    BCA               JAKARTA           BONUS MEMBER      MARET 2019                          1R014
15210127188                                          00000000000102040.00ERNA SUKDJIOWATI                                                      B      0140397    BCA               nganjuk           BONUS MEMBER      MARET 2019                          1R014
18600271122                                          00000000000216730.00ESLYN R. JABAR                                                        B      0140397    BCA               Palangkaraya      BONUS MEMBER      MARET 2019                          1R014
10281796967                                          00000000000266600.00ESTER JULIATI SUSANTO                                                 B      0140397    BCA               Jakarta           BONUS MEMBER      MARET 2019                          1R014
14650374903                                          00000000000105629.00ESTER PAULINA KUSLOSARIR                                              B      0140397    BCA               PERAK             BONUS MEMBER      MARET 2019                          1R014
16975522222                                          00000000000072600.00ESTER SETIAWATI                                                       B      0140397    BCA               KCP Adi Sucipto   BONUS MEMBER      MARET 2019                          1R014
16155020567                                          00000000000106948.00ESTER TJENDRAWATI                                                     B      0140397    BCA               Sidoarjo          BONUS MEMBER      MARET 2019                          1R014
10430004239                                          00000000000101200.00EVARIAMI                                                              B      0140397    BCA               B.ACEH            BONUS MEMBER      MARET 2019                          1R014
15050232478                                          00000000000104432.00FAIZAH HAFSA                                                          B      0140397    BCA               permata hijau jakaBONUS MEMBER      MARET 2019                          1R014
12582164542                                          00000000000160870.00FEBRIAN DWI LAKSONO                                                   B      0140397    BCA               sudirman jakarta  BONUS MEMBER      MARET 2019                          1R014
10060230340                                          00000000000261265.00FERDYNANDS SAMPE                                                      B      0140397    BCA               GKBI Sudirman     BONUS MEMBER      MARET 2019                          1R014
10292188739                                          00000000000156250.00FHOBIE CLAUDIA                                                        B      0140397    BCA               PONTIANAK         BONUS MEMBER      MARET 2019                          1R014
17970003651                                          00000000002221103.00FITRIYANTI RASYID                                                     B      0140397    BCA               Makassar          BONUS MEMBER      MARET 2019                          1R014
11601111891                                          00000000000227800.00FLORENCE VALENTIA                                                     B      0140397    BCA               Mangdu            BONUS MEMBER      MARET 2019                          1R014
18140330559                                          00000000000055358.00FOLISTINA                                                             B      0140397    BCA               Jayapura          BONUS MEMBER      MARET 2019                          1R014
10491569688                                          00000000005762613.00FRANSISKUS YANNO SOERATMAN                                            B      0140397    BCA               maluku            BONUS MEMBER      MARET 2019                          1R014
10110909039                                          00000000000185585.00FREDDY SEMBIRING                                                      B      0140397    BCA               Malang            BONUS MEMBER      MARET 2019                          1R014
18585001577                                          00000000000803741.00FUJIOKO FAUNA                                                         B      0140397    BCA               pangkalan bun     BONUS MEMBER      MARET 2019                          1R014
10255875375                                          00000000002165295.00GEMA TAKBIR MUH. SURYA T, SE                                          B      0140397    BCA               Makassar          BONUS MEMBER      MARET 2019                          1R014
11710933029                                          00000000000305400.00GOLDINA PRITI PINTARTI C                                              B      0140397    BCA               KCP RAHADI USMAN  BONUS MEMBER      MARET 2019                          1R014
12600020938                                          00000000000130800.00GRETHANIE SENNA LESMANA                                               B      0140397    BCA               260               BONUS MEMBER      MARET 2019                          1R014
17245011369                                          00000000000269547.00GUSTI SETIAWAN HAFID                                                  B      0140397    BCA               KCP MANDONGA      BONUS MEMBER      MARET 2019                          1R014
10651929724                                          00000000000072600.00H JURMANSYAH KAOEM                                                    B      0140397    BCA               KCP Pemuda        BONUS MEMBER      MARET 2019                          1R014
15610136615                                          00000000000056110.00H SUBKHAN DRS                                                         B      0140397    BCA               kcu gresik        BONUS MEMBER      MARET 2019                          1R014
17670410468                                          00000000000113237.00HALARI INSAN IHSANI                                                   B      0140397    BCA               Sesetan           BONUS MEMBER      MARET 2019                          1R014
13900389212                                          00000000001681292.00HAMSIAH SANGKALA                                                      B      0140397    BCA               Makassar          BONUS MEMBER      MARET 2019                          1R014
15370095665                                          00000000000092000.00HANDONO RISETO                                                        B      0140397    BCA               537               BONUS MEMBER      MARET 2019                          1R014
17920451742                                          00000000000719561.00HANIFA                                                                B      0140397    BCA               PALU              BONUS MEMBER      MARET 2019                          1R014
17570037697                                          00000000000458660.00HANNA KUSNADI                                                         B      0140397    BCA               757               BONUS MEMBER      MARET 2019                          1R014
10262244251                                          00000000000731052.00HANNA SILVANNA MANONGKO                                               B      0140397    BCA               manado            BONUS MEMBER      MARET 2019                          1R014
10312348720                                          00000000000051502.00HANS HANANTO ANDREAS                                                  B      0140397    BCA               Kudus             BONUS MEMBER      MARET 2019                          1R014
11451329036                                          00000000000163780.00HAPPY SIRINGORINGO                                                    B      0140397    BCA               GATOT SUBROTO     BONUS MEMBER      MARET 2019                          1R014
17955187806                                          00000000000436065.00HARDIANTI MANOPPO                                                     B      0140397    BCA               Abepura           BONUS MEMBER      MARET 2019                          1R014
10291799719                                          00000000000187933.00HARI LIEWARNATA IR MM                                                 B      0140397    BCA               Pontianak         BONUS MEMBER      MARET 2019                          1R014
11410453394                                          00000000000053200.00HARTOYO                                                               B      0140397    BCA               Nganjuk           BONUS MEMBER      MARET 2019                          1R014
17795019669                                          00000000009583208.00HARUN D. TUMBUAN                                                      B      0140397    BCA               Palu              BONUS MEMBER      MARET 2019                          1R014
15930411967                                          00000000000372330.00HASAN                                                                 B      0140397    BCA               KCP KOSAMBI       BONUS MEMBER      MARET 2019                          1R014
17870016845                                          00000000000538812.00HASNAH                                                                B      0140397    BCA               Jambi             BONUS MEMBER      MARET 2019                          1R014
17685089955                                          00000000001622477.00HASNIH S                                                              B      0140397    BCA               sungguminasa      BONUS MEMBER      MARET 2019                          1R014
18320091552                                          00000000000100730.00HELEN ALPRIDA LIMBONG                                                 B      0140397    BCA               Bandung           BONUS MEMBER      MARET 2019                          1R014
10272616980                                          00000000000104852.00HELEN TANSIL                                                          B      0140397    BCA               Samarinda         BONUS MEMBER      MARET 2019                          1R014
10281733167                                          00000000000084094.00HELENA WIDJAJA                                                        B      0140397    BCA               Jakarta           BONUS MEMBER      MARET 2019                          1R014
10210293884                                          00000000000537278.00HENDARTO SANTOSO                                                      B      0140397    BCA               Palembang         BONUS MEMBER      MARET 2019                          1R014
16830502546                                          00000000000283430.00HENNY                                                                 B      0140397    BCA               KCP Pasar CibinongBONUS MEMBER      MARET 2019                          1R014
15110144468                                          00000000002112382.00HENNY JUARIA                                                          B      0140397    BCA               Surabaya          BONUS MEMBER      MARET 2019                          1R014
16140200440                                          00000000000050872.00HENNY PUSPAWATI SE                                                    B      0140397    BCA               mojosari          BONUS MEMBER      MARET 2019                          1R014
15830269039                                          00000000000102739.00HENNY SANTOSO                                                         B      0140397    BCA               Kcp bandengan utarBONUS MEMBER      MARET 2019                          1R014
17925295591                                          00000000000060718.00HENNY SUSANTI                                                         B      0140397    BCA               IMAM BONJOL       BONUS MEMBER      MARET 2019                          1R014
12930371222                                          00000000000053200.00HENSILYANA BERTHY ST                                                  B      0140397    BCA               KCP Bandar Jaya   BONUS MEMBER      MARET 2019                          1R014
14720195645                                          00000000000102360.00HENY IRAWATI                                                          B      0140397    BCA               Surabaya          BONUS MEMBER      MARET 2019                          1R014
18585064722                                          00000000000129345.00HERIYANE YANCAR ARUS                                                  B      0140397    BCA               KCP Pangkalan Bun BONUS MEMBER      MARET 2019                          1R014
10880652192                                          00000000001346203.00HERLIN YUNARA                                                         B      0140397    BCA               Sby Darmo Raya    BONUS MEMBER      MARET 2019                          1R014
13650261258                                          00000000000225901.00HERLINA H.                                                            B      0140397    BCA               RSAJ Akademis     BONUS MEMBER      MARET 2019                          1R014
17155046929                                          00000000000053200.00HERMAHNIAR P                                                          B      0140397    BCA               KCP Sei Raya SalamBONUS MEMBER      MARET 2019                          1R014
12903845619                                          00000000000100901.00HERMAN AMIL S HUT                                                     B      0140397    BCA               KCP Somba Opu     BONUS MEMBER      MARET 2019                          1R014
10650239687                                          00000000000053200.00HERU SARWONO                                                          B      0140397    BCA               Jakarta           BONUS MEMBER      MARET 2019                          1R014
17920383445                                          00000000000103508.00HJ MAYA MALANIA NOOR-IR-                                              B      0140397    BCA               PALU              BONUS MEMBER      MARET 2019                          1R014
15790142553                                          00000000000122118.00HJ. ANDI NURUL ASKIN, SH, MH                                          B      0140397    BCA               RAWASARI          BONUS MEMBER      MARET 2019                          1R014
17160038327                                          00000000001349471.00HJ. NETTY NASIR                                                       B      0140397    BCA               MT Haryono        BONUS MEMBER      MARET 2019                          1R014
10210694960                                          00000000000273438.00HUDIJAH                                                               B      0140397    BCA               Palembang         BONUS MEMBER      MARET 2019                          1R014
10291362418                                          00000000011634769.00IMACULATA KORNIA                                                      B      0140397    BCA               BCA RAHADI USMAN  BONUS MEMBER      MARET 2019                          1R014
11990862482                                          00000000000080966.00IMELDA LILYANA LOLON                                                  B      0140397    BCA               Pandaan           BONUS MEMBER      MARET 2019                          1R014
10870989547                                          00000000000562008.00IMRAN                                                                 B      0140397    BCA               SUNGKONO          BONUS MEMBER      MARET 2019                          1R014
12460330001                                          00000000001595840.00INAVIANTI WINARTO                                                     B      0140397    BCA               Semarang          BONUS MEMBER      MARET 2019                          1R014
12560098696                                          00000000000552613.00INDAH CITRA DEWI SUCITRO                                              B      0140397    BCA               Surabaya          BONUS MEMBER      MARET 2019                          1R014
14540284551                                          00000000000050290.00INDANIARTI RAMBU                                                      B      0140397    BCA               cabang surabaya   BONUS MEMBER      MARET 2019                          1R014
13890358038                                          00000000000100992.00INDIRA YANA SRI DARMA PUTRA                                           B      0140397    BCA               SUTOREJO          BONUS MEMBER      MARET 2019                          1R014
15880209959                                          00000000018500232.00INDRIYATI SALIM                                                       B      0140397    BCA               Jakarta           BONUS MEMBER      MARET 2019                          1R014
10050412822                                          00000000000099760.00INE DEWI ANDRIANI                                                     B      0140397    BCA               KCU Wisma MilleniaBONUS MEMBER      MARET 2019                          1R014
14260366811                                          00000000000620174.00INGE H S / THEO A D                                                   B      0140397    BCA               kcp tolegerejo    BONUS MEMBER      MARET 2019                          1R014
12440015231                                          00000000000073000.00INNEKE KUSUMO                                                         B      0140397    BCA               Pluit Kencana     BONUS MEMBER      MARET 2019                          1R014
16380003447                                          00000000000145900.00IR. SOEBIJANTO TRIWIBOWO                                              B      0140397    BCA               Jakarta           BONUS MEMBER      MARET 2019                          1R014
11340719227                                          00000000000105580.00IRAWAN                                                                B      0140397    BCA               Cirebon           BONUS MEMBER      MARET 2019                          1R014
15270747762                                          00000000000074140.00IRENE KARYADI                                                         B      0140397    BCA               000000000         BONUS MEMBER      MARET 2019                          1R014
14643157040                                          00000000000165155.00IRUM SPRM DR                                                          B      0140397    BCA               surabaya          BONUS MEMBER      MARET 2019                          1R014
16465093840                                          00000000000270432.00IRWAN HARIYADI                                                        B      0140397    BCA               PONTIANAK         BONUS MEMBER      MARET 2019                          1R014
18630026653                                          00000000000061332.00IVANA WIJAYA                                                          B      0140397    BCA               PAKUWON TRADE CENTBONUS MEMBER      MARET 2019                          1R014
15000013562                                          00000000000423340.00JANTI NGADIMAN                                                        B      0140397    BCA               Sunter Indah      BONUS MEMBER      MARET 2019                          1R014
10030200101                                          00000000000398360.00JANTI W                                                               B      0140397    BCA               Gunsa 45          BONUS MEMBER      MARET 2019                          1R014
10181090234                                          00000000016592886.00JOHANES PUTRA MAYNINEDO                                               B      0140397    BCA               Sidoarjo          BONUS MEMBER      MARET 2019                          1R014
12670094408                                          00000000000117767.00JOHANNA FRANSISCA MAILO\`OL                                           B      0140397    BCA               CINERE            BONUS MEMBER      MARET 2019                          1R014
11191496111                                          00000000000102120.00JON TOMI                                                              B      0140397    BCA               Jambi             BONUS MEMBER      MARET 2019                          1R014
11781176392                                          00000000002145548.00JOUSJE ADAM                                                           B      0140397    BCA               Permata Hijau     BONUS MEMBER      MARET 2019                          1R014
16600278027                                          00000000000072600.00JOVITA KARTIKASARI                                                    B      0140397    BCA               Jakarta           BONUS MEMBER      MARET 2019                          1R014
11681694248                                          00000000000627677.00JUANITA ICHSANI                                                       B      0140397    BCA               Pluit             BONUS MEMBER      MARET 2019                          1R014
10010554322                                          00000000000072600.00JUKILAWATI                                                            B      0140397    BCA               KCU Asemka        BONUS MEMBER      MARET 2019                          1R014
12411120211                                          00000000000119463.00JULIANA                                                               B      0140397    BCA               jembatan merah    BONUS MEMBER      MARET 2019                          1R014
10016099168                                          00000000000111400.00JULIANA TJONDRO                                                       B      0140397    BCA               Asemka            BONUS MEMBER      MARET 2019                          1R014
10870842562                                          00000000000162844.00JUNI PANTJAWATI SUTANTO                                               B      0140397    BCA               kcp sundokono     BONUS MEMBER      MARET 2019                          1R014
10885727030                                          00000000000443029.00KALEB YEREMIA YUNIOR KOR                                              B      0140397    BCA               Surabaya          BONUS MEMBER      MARET 2019                          1R014
15125109711                                          00000000000283084.00KARTILAH                                                              B      0140397    BCA               Gajahmada PontianaBONUS MEMBER      MARET 2019                          1R014
14970573513                                          00000000000152566.00KIEMI MANALU                                                          B      0140397    BCA               SERPONG           BONUS MEMBER      MARET 2019                          1R014
12620007202                                          00000000000305400.00KIKIE HARDI                                                           B      0140397    BCA               HASYIM ASHARI     BONUS MEMBER      MARET 2019                          1R014
12211227763                                          00000000000320435.00KONNI M TAMBUNAN                                                      B      0140397    BCA               MENARA IMPERIUM   BONUS MEMBER      MARET 2019                          1R014
17855044188                                          00000000000152140.00KRISTIN SUSILOWATI IKWAN                                              B      0140397    BCA               ternate           BONUS MEMBER      MARET 2019                          1R014
10400668710                                          00000000000189000.00KUMALA WIDODO                                                         B      0140397    BCA               040               BONUS MEMBER      MARET 2019                          1R014
17540409956                                          00000000000208400.00LEONY JOSNITA HANDJAJA                                                B      0140397    BCA               0000000000        BONUS MEMBER      MARET 2019                          1R014
13971165357                                          00000000000227800.00LIAN BIE HUI                                                          B      0140397    BCA               Jakarta           BONUS MEMBER      MARET 2019                          1R014
12871470865                                          00000000000072600.00LIAN BIE KIEM                                                         B      0140397    BCA               Kebon jeruk       BONUS MEMBER      MARET 2019                          1R014
15060026981                                          00000000000499663.00LIE AY HWA                                                            B      0140397    BCA               Surabaya          BONUS MEMBER      MARET 2019                          1R014
10090888919                                          00000000000229740.00LIEM ENG MEI                                                          B      0140397    BCA               Semarang          BONUS MEMBER      MARET 2019                          1R014
11710479824                                          00000000000162033.00LILIK YUNIATI                                                         B      0140397    BCA               PONTIANAK         BONUS MEMBER      MARET 2019                          1R014
12762222222                                          00000000007154276.00LILY NGADIMAN                                                         B      0140397    BCA               sunter            BONUS MEMBER      MARET 2019                          1R014
10420199104                                          00000000000102960.00LIM KIM LIEN                                                          B      0140397    BCA               TEBING TINGGI     BONUS MEMBER      MARET 2019                          1R014
17820060894                                          00000000000125550.00LINAWATI SH                                                           B      0140397    BCA               kcp a. yani       BONUS MEMBER      MARET 2019                          1R014
17795143955                                          00000000000733020.00LINDA                                                                 B      0140397    BCA               Cabang Palu       BONUS MEMBER      MARET 2019                          1R014
11990853688                                          00000000000102511.00LINDA PATRISTIANI                                                     B      0140397    BCA               PANDAAN           BONUS MEMBER      MARET 2019                          1R014
10490010009                                          00000000000053200.00LINDA PUSPA DEWI                                                      B      0140397    BCA               maluku            BONUS MEMBER      MARET 2019                          1R014
17830557878                                          00000000000072600.00LIONG SIOE GIE                                                        B      0140397    BCA               Semarang          BONUS MEMBER      MARET 2019                          1R014
10281828478                                          00000000000066612.00LOLITA PATRICIA CHANDRA                                               B      0140397    BCA               Wahid Hasyim      BONUS MEMBER      MARET 2019                          1R014
17570069858                                          00000000000072600.00LOUISA SUSIANA HAKIM                                                  B      0140397    BCA               Jakarta           BONUS MEMBER      MARET 2019                          1R014
16750173762                                          00000000000051502.00LUSI SUSILO                                                           B      0140397    BCA               Rungkut           BONUS MEMBER      MARET 2019                          1R014
16280639999                                          00000000000134971.00LUSIA RUDIHASWORO                                                     B      0140397    BCA               Kcp Arundina CibubBONUS MEMBER      MARET 2019                          1R014
17975271188                                          00000000000097162.00LUTFIA Y. K. NASIB ALAMR                                              B      0140397    BCA               Gorontalo         BONUS MEMBER      MARET 2019                          1R014
18620235661                                          00000000000558003.00LYDIANA DEWI EFFENDY                                                  B      0140397    BCA               Citraland         BONUS MEMBER      MARET 2019                          1R014
18160408007                                          00000000000403284.00MAGDALANI SANTOSO                                                     B      0140397    BCA               KCU BOROBUDUR MALABONUS MEMBER      MARET 2019                          1R014
14281621569                                          00000000000516860.00MAGDALENA KUSNADI                                                     B      0140397    BCA               428               BONUS MEMBER      MARET 2019                          1R014
11410251236                                          00000000000156257.00MAGDALENA NANIK S                                                     B      0140397    BCA               nganjuk           BONUS MEMBER      MARET 2019                          1R014
18190339344                                          00000000000652708.00MANUELLA ARTAWATY PURBA                                               B      0140397    BCA               KCP JELUTUNG      BONUS MEMBER      MARET 2019                          1R014
15680526020                                          00000000000212711.00MARGARETA MARIA                                                       B      0140397    BCA               KCP Kemang PratamaBONUS MEMBER      MARET 2019                          1R014
12851153031                                          00000000000314130.00MARGARETH STEFANNY WINAT                                              B      0140397    BCA               KCP TAMAN SARI    BONUS MEMBER      MARET 2019                          1R014
10260829971                                          00000000005637276.00MARIA BEATRIX LUNTUNGAN                                               B      0140397    BCA               Manado            BONUS MEMBER      MARET 2019                          1R014
10251360129                                          00000000000051502.00MARIA ROSALINA TANNUS                                                 B      0140397    BCA               Makassar A. Yani  BONUS MEMBER      MARET 2019                          1R014
10031555999                                          00000000000362751.00MARIO RENDY NGADIMAN                                                  B      0140397    BCA               Gunsa             BONUS MEMBER      MARET 2019                          1R014
10292155075                                          00000000001150318.00MARISA CAROLINA TEDJA                                                 B      0140397    BCA               Pontianak         BONUS MEMBER      MARET 2019                          1R014
14650268356                                          00000000049115458.00MARSUDI                                                               B      0140397    BCA               Makro Pepelegi SidBONUS MEMBER      MARET 2019                          1R014
11520325049                                          00000000001114260.00MARTHEN CAREL KORWA                                                   B      0140397    BCA               Kertajaya         BONUS MEMBER      MARET 2019                          1R014
16705015990                                          00000000000156602.00MARTINA TJITRADY                                                      B      0140397    BCA               Bontang           BONUS MEMBER      MARET 2019                          1R014
16610493350                                          00000000000154759.00MARTINUS B. PALAMBA                                                   B      0140397    BCA               Depok             BONUS MEMBER      MARET 2019                          1R014
17795044337                                          00000000000665983.00MARWAN AMIR                                                           B      0140397    BCA               Palu Barat        BONUS MEMBER      MARET 2019                          1R014
14870038254                                          00000000000072600.00MARYANA                                                               B      0140397    BCA               487               BONUS MEMBER      MARET 2019                          1R014
11910801674                                          00000000000072600.00MAX LEVI BOHAM                                                        B      0140397    BCA               balikpapan        BONUS MEMBER      MARET 2019                          1R014
10640167297                                          00000000001701393.00MEDYAWATI LIMANTARA DRG                                               B      0140397    BCA               Pucang Anom SurabaBONUS MEMBER      MARET 2019                          1R014
17955008405                                          00000000000396371.00MEITY S PAAT                                                          B      0140397    BCA               Jayapura          BONUS MEMBER      MARET 2019                          1R014
17160069281                                          00000000009318958.00MELAWATY ABYANI                                                       B      0140397    BCA               MT Haryono JakartaBONUS MEMBER      MARET 2019                          1R014
10884820207                                          00000000001436228.00MELYSA YULIANA                                                        B      0140397    BCA               Darmo             BONUS MEMBER      MARET 2019                          1R014
14411287399                                          00000000000101506.00MERIAM SELONITA SAMBO                                                 B      0140397    BCA               Plaza Sentral     BONUS MEMBER      MARET 2019                          1R014
11510310442                                          00000000000051502.00MERIYANTI                                                             B      0140397    BCA               Kenten Palembang  BONUS MEMBER      MARET 2019                          1R014
10210293175                                          00000000000483928.00METRY WIDJAJA KOHAR                                                   B      0140397    BCA               Utama ARivai      BONUS MEMBER      MARET 2019                          1R014
13053007500                                          00000000002345495.00MEYLIA                                                                B      0140397    BCA               PS Cikini         BONUS MEMBER      MARET 2019                          1R014
12741034559                                          00000000004865672.00MIRA REBEKA SANI                                                      B      0140397    BCA               00000             BONUS MEMBER      MARET 2019                          1R014
12308061090                                          00000000001606494.00MIRNA SAMPE                                                           B      0140397    BCA               Kalimalang        BONUS MEMBER      MARET 2019                          1R014
14010273841                                          00000000000072600.00MODESTA SANTI DEVIYANTI                                               B      0140397    BCA               KETAPANG          BONUS MEMBER      MARET 2019                          1R014
17920345365                                          00000000000082088.00MOH YAKUB KARAENG MATASA                                              B      0140397    BCA               PALU              BONUS MEMBER      MARET 2019                          1R014
17955199677                                          00000000000051182.00MOHAMAD AL AMIN                                                       B      0140397    BCA               kcp abepura       BONUS MEMBER      MARET 2019                          1R014
18140254534                                          00000000000137978.00MONNY SABACHTANI MAYOR S                                              B      0140397    BCA               Jayapura          BONUS MEMBER      MARET 2019                          1R014
17970228947                                          00000000000643106.00MUFTIHATURRAHMAH BURHAMZ                                              B      0140397    BCA               Makassar          BONUS MEMBER      MARET 2019                          1R014
17245083980                                          00000000000050290.00MUH ALFI R                                                            B      0140397    BCA               kcp mandonga      BONUS MEMBER      MARET 2019                          1R014
17910535905                                          00000000000054958.00MUH BASYARAH RACHMAN                                                  B      0140397    BCA               Kendari           BONUS MEMBER      MARET 2019                          1R014
10255460574                                          00000000000997355.00MUH. KADIR                                                            B      0140397    BCA               Sungguminasa      BONUS MEMBER      MARET 2019                          1R014
17920781742                                          00000000000282541.00MUHAMMAD HILMI MARWAN                                                 B      0140397    BCA               Palu Muh Hatta    BONUS MEMBER      MARET 2019                          1R014
16340111913                                          00000000000052958.00MUJI LESTARI                                                          B      0140397    BCA               Raden Saleh       BONUS MEMBER      MARET 2019                          1R014
12940047318                                          00000000000247200.00MUKLAM                                                                B      0140397    BCA               PANGERAN ANTASARI BONUS MEMBER      MARET 2019                          1R014
13860011858                                          00000000000092000.00MULIANA                                                               B      0140397    BCA               Pluit Utara       BONUS MEMBER      MARET 2019                          1R014
10250248121                                          00000000000640178.00MULIAWATI MUHIDDIN                                                    B      0140397    BCA               PETTARANI         BONUS MEMBER      MARET 2019                          1R014
16320228075                                          00000000000051956.00NANIK AQUARIUS DWI LESTARI                                            B      0140397    BCA               Kelapa Gading     BONUS MEMBER      MARET 2019                          1R014
14960003646                                          00000000000105966.00NENSIH BH MOCH. AMSOR                                                 B      0140397    BCA               Tebet Barat       BONUS MEMBER      MARET 2019                          1R014
18530066534                                          00000000000058535.00NETI ZAHARA                                                           B      0140397    BCA               cab celentang paleBONUS MEMBER      MARET 2019                          1R014
10653453890                                          00000000000179754.00NILAWATI"BDN RATU PRATIW                                              B      0140397    BCA               Kelapa Gading     BONUS MEMBER      MARET 2019                          1R014
18290171513                                          00000000000495045.00NINIK ELSAWATIE                                                       B      0140397    BCA               Surabaya          BONUS MEMBER      MARET 2019                          1R014
16871347155                                          00000000000053200.00NINIK SUWARTINI                                                       B      0140397    BCA               Pondok gede plaza BONUS MEMBER      MARET 2019                          1R014
10262097011                                          00000000000259973.00NONTJE TANGAHU                                                        B      0140397    BCA               manado            BONUS MEMBER      MARET 2019                          1R014
18585146125                                          00000000000109581.00NOOR LAILY                                                            B      0140397    BCA               pangkalan bun     BONUS MEMBER      MARET 2019                          1R014
15210742605                                          00000000000154856.00NOVI HANDAYANI                                                        B      0140397    BCA               KCP BULEVAR HIJAU BONUS MEMBER      MARET 2019                          1R014
10511559323                                          00000000000107520.00NOVITA MURSALIM                                                       B      0140397    BCA               Banjarmasin       BONUS MEMBER      MARET 2019                          1R014
14620445342                                          00000000000050620.00NOVITA SUSANTO                                                        B      0140397    BCA               Semarang          BONUS MEMBER      MARET 2019                          1R014
11240154532                                          00000000000050290.00NUNUK HIDA SULISTIYOWATI                                              B      0140397    BCA               Dampit            BONUS MEMBER      MARET 2019                          1R014
10881452595                                          00000000000053200.00NUR RACHMAWATI                                                        B      0140397    BCA               Surabaya          BONUS MEMBER      MARET 2019                          1R014
17990798600                                          00000000000093236.00NURAENI MUSRADHY PAKI                                                 B      0140397    BCA               Kawasan Industri  BONUS MEMBER      MARET 2019                          1R014
17920488344                                          00000000000101118.00NURAENI S. LADJIDJI                                                   B      0140397    BCA               Palu              BONUS MEMBER      MARET 2019                          1R014
11199004598                                          00000000000384289.00NURHASANAH HS                                                         B      0140397    BCA               Jambi             BONUS MEMBER      MARET 2019                          1R014
10255830223                                          00000000000858563.00NURJAYA SH                                                            B      0140397    BCA               MAKASSAR          BONUS MEMBER      MARET 2019                          1R014
17640857212                                          00000000000448249.00NURUL AZIZAH                                                          B      0140397    BCA               CITRA RAYA        BONUS MEMBER      MARET 2019                          1R014
15740065124                                          00000000000072600.00NY THERESIANA SANTI                                                   B      0140397    BCA               PASAR JATINEGARA  BONUS MEMBER      MARET 2019                          1R014
17920439246                                          00000000000106647.00OCTAVIA NOVA DALY                                                     B      0140397    BCA               Palu              BONUS MEMBER      MARET 2019                          1R014
12853001911                                          00000000000472822.00OEI IRENE ANGELINE WIJAY                                              B      0140397    BCA               KCP TAMAN SARI    BONUS MEMBER      MARET 2019                          1R014
10884819781                                          00000000000102008.00OENTOENG POEDJERAHARDJO                                               B      0140397    BCA               Darmo Surabaya    BONUS MEMBER      MARET 2019                          1R014
11822211288                                          00000000000323990.00OEY GIOK HWA                                                          B      0140397    BCA               Semarang.         BONUS MEMBER      MARET 2019                          1R014
13290127296                                          00000000000053200.00OEY INGGRID INDRAWATI WI                                              B      0140397    BCA               BALIWERTI         BONUS MEMBER      MARET 2019                          1R014
10353041450                                          00000000000072600.00OSBORN BUDIMAN                                                        B      0140397    BCA               KCU Sudirman      BONUS MEMBER      MARET 2019                          1R014
10320899222                                          00000000000072600.00OTTO BERINA IR                                                        B      0140397    BCA               Sawahan padang    BONUS MEMBER      MARET 2019                          1R014
17800213392                                          00000000000101378.00PREISY ANGEL M GOLIOTH S                                              B      0140397    BCA               Ranotana          BONUS MEMBER      MARET 2019                          1R014
10590511561                                          00000000000072600.00PURNAMA RIYANTI                                                       B      0140397    BCA               KCP.AHMAD YANI    BONUS MEMBER      MARET 2019                          1R014
12300840631                                          00000000000050387.00RAHAYU GUNAWAN                                                        B      0140397    BCA               kalimalang        BONUS MEMBER      MARET 2019                          1R014
17970160625                                          00000000001123632.00RAHMITA BURHAMZAH                                                     B      0140397    BCA               Maricaya Makassar BONUS MEMBER      MARET 2019                          1R014
11070504312                                          00000000000053200.00RAMA DHANI KUSUMA                                                     B      0140397    BCA               Surabaya          BONUS MEMBER      MARET 2019                          1R014
18585016191                                          00000000000395321.00RAMAYDA                                                               B      0140397    BCA               pangkalan bun     BONUS MEMBER      MARET 2019                          1R014
17910772435                                          00000000000103240.00RANI ANGGRAENI R                                                      B      0140397    BCA               KCU kendari       BONUS MEMBER      MARET 2019                          1R014
11821231235                                          00000000000188502.00RATNA DEWI                                                            B      0140397    BCA               Semarang          BONUS MEMBER      MARET 2019                          1R014
18585004134                                          00000000000782473.00RATNA RAHAYUNI                                                        B      0140397    BCA               PANGKALAN BUN     BONUS MEMBER      MARET 2019                          1R014
12741009970                                          00000000000532396.00RAY LAMMY                                                             B      0140397    BCA               Pondok Bambu      BONUS MEMBER      MARET 2019                          1R014
18275283882                                          00000000000095410.00RENI JAYANTI ANGGRAINI                                                B      0140397    BCA               KCP A YANI II     BONUS MEMBER      MARET 2019                          1R014
10130398782                                          00000000000078420.00RENO KAILOLA                                                          B      0140397    BCA               KCU Salatiga      BONUS MEMBER      MARET 2019                          1R014
11191896063                                          00000000000101735.00RETNO ENDAH SUSANTI                                                   B      0140397    BCA               Jambi             BONUS MEMBER      MARET 2019                          1R014
17910371635                                          00000000000754474.00REZKY ULFA RAHMADANI-R                                                B      0140397    BCA               Kendari           BONUS MEMBER      MARET 2019                          1R014
10321937313                                          00000000000119451.00RIA SILVIA                                                            B      0140397    BCA               KCU Padang        BONUS MEMBER      MARET 2019                          1R014
11391712064                                          00000000000053200.00RIA SUHARTI                                                           B      0140397    BCA               cimahi            BONUS MEMBER      MARET 2019                          1R014
14970191921                                          00000000000209491.00RIKA                                                                  B      0140397    BCA               497               BONUS MEMBER      MARET 2019                          1R014
13051019898                                          00000000000110430.00RINIWATY DARYANTO                                                     B      0140397    BCA               Jakarta           BONUS MEMBER      MARET 2019                          1R014
17920717351                                          00000000003314348.00RISDIYANTO                                                            B      0140397    BCA               palu              BONUS MEMBER      MARET 2019                          1R014
17920441119                                          00000000010750984.00ROBERTH PARENGKUAN                                                    B      0140397    BCA               Palu              BONUS MEMBER      MARET 2019                          1R014
18665037157                                          00000000000050290.00ROSALIA TRI SUPRANTI                                                  B      0140397    BCA               KCP SINTANG       BONUS MEMBER      MARET 2019                          1R014
18705168993                                          00000000000072600.00ROSITA NATADARMA DJAJA                                                B      0140397    BCA               KCP Mal Kelapa GadBONUS MEMBER      MARET 2019                          1R014
13490863159                                          00000000000054655.00ROSMENTINA GIRSANG                                                    B      0140397    BCA               MEDAN ISK MUDA    BONUS MEMBER      MARET 2019                          1R014
12281140151                                          00000000000142622.00ROSNIATI                                                              B      0140397    BCA               Mayestik          BONUS MEMBER      MARET 2019                          1R014
14970287464                                          00000000000107084.00RR WIDIASRI PUJI APHINI                                               B      0140397    BCA               KCU SERPONG       BONUS MEMBER      MARET 2019                          1R014
11410577344                                          00000000000631417.00RUDI SANTOSO                                                          B      0140397    BCA               sawahan           BONUS MEMBER      MARET 2019                          1R014
12881095361                                          00000000000050484.00RULLY ARISCHANDRA                                                     B      0140397    BCA               kcu Puri Indah    BONUS MEMBER      MARET 2019                          1R014
16665050541                                          00000000031434251.00RUSIANI                                                               B      0140397    BCA               Sambas            BONUS MEMBER      MARET 2019                          1R014
11410324047                                          00000000004503054.00RUTH HANDAYANI DARMAWAN                                               B      0140397    BCA               Nganjuk           BONUS MEMBER      MARET 2019                          1R014
12581015901                                          00000000004214438.00SALIM                                                                 B      0140397    BCA               Diponogoro        BONUS MEMBER      MARET 2019                          1R014
16270097543                                          00000000000211766.00SALMA LUBIS                                                           B      0140397    BCA               TEBET BARAT 2     BONUS MEMBER      MARET 2019                          1R014
17910170583                                          00000000029641775.00SALMIA RODHIYA HUSAINY                                                B      0140397    BCA               Kendari           BONUS MEMBER      MARET 2019                          1R014
10613336092                                          00000000000053200.00SATUI                                                                 B      0140397    BCA               Samarinda         BONUS MEMBER      MARET 2019                          1R014
16795700777                                          00000000000099760.00SELVI BAROLEH                                                         B      0140397    BCA               luwuk             BONUS MEMBER      MARET 2019                          1R014
10510697898                                          00000000000160628.00SESELIA LISNA                                                         B      0140397    BCA               Banjarmasin       BONUS MEMBER      MARET 2019                          1R014
14700218665                                          00000000000107634.00SESILIA MADE LENY YUNIARTY                                            B      0140397    BCA               WIYUNG            BONUS MEMBER      MARET 2019                          1R014
18985132778                                          00000000000054313.00SETIYOWATI DARSONO                                                    B      0140397    BCA               cabang Puri AnjasmBONUS MEMBER      MARET 2019                          1R014
11010200209                                          00000000008932700.00SETYOTUHU TATIK                                                       B      0140397    BCA               KCP Kapas KrampungBONUS MEMBER      MARET 2019                          1R014
15660023307                                          00000000000072600.00SHELLY                                                                B      0140397    BCA               Panglima polim    BONUS MEMBER      MARET 2019                          1R014
12290005101                                          00000000000286000.00SHIRLY SANTOSO                                                        B      0140397    BCA               Palmerah          BONUS MEMBER      MARET 2019                          1R014
13981074465                                          00000000000053200.00SILVIA                                                                B      0140397    BCA               Kcp mandala raya  BONUS MEMBER      MARET 2019                          1R014
10350602739                                          00000000000108830.00SITI MARIYAM                                                          B      0140397    BCA               KCU SUDIRMAN      BONUS MEMBER      MARET 2019                          1R014
14681155656                                          00000000000072600.00SOEWITO ISMAWAN                                                       B      0140397    BCA               kcu indrapura sby BONUS MEMBER      MARET 2019                          1R014
18810104431                                          00000000000072600.00SRI WAGIARTI                                                          B      0140397    BCA               kcp Balai Pustaka BONUS MEMBER      MARET 2019                          1R014
14361496102                                          00000000000051502.00SRIANA ANGGREINI                                                      B      0140397    BCA               TEBET BARAT       BONUS MEMBER      MARET 2019                          1R014
17920883006                                          00000000000134316.00STEFANI BEATRIX                                                       B      0140397    BCA               Palu              BONUS MEMBER      MARET 2019                          1R014
17820054088                                          00000000000051502.00STEVEN SETIAWAN                                                       B      0140397    BCA               Banjarmasin       BONUS MEMBER      MARET 2019                          1R014
12533338585                                          00000000009493410.00STEVIE LENGKONG                                                       B      0140397    BCA               Green Garden      BONUS MEMBER      MARET 2019                          1R014
13530096458                                          00000000000050290.00SUBIANTO HARSOJO                                                      B      0140397    BCA               kcp industri      BONUS MEMBER      MARET 2019                          1R014
11010613635                                          00000000000104756.00SUHARTI                                                               B      0140397    BCA               KAPAS KRAMPUNG    BONUS MEMBER      MARET 2019                          1R014
14281731054                                          00000000000317325.00SUHENJANTI SOLAIMAN                                                   B      0140397    BCA               Sunter mall       BONUS MEMBER      MARET 2019                          1R014
17685098881                                          00000000000362102.00SUKRAWAN                                                              B      0140397    BCA               Sungguminasa      BONUS MEMBER      MARET 2019                          1R014
17910249091                                          00000000010408952.00SULEMAN MILE                                                          B      0140397    BCA               0000000000        BONUS MEMBER      MARET 2019                          1R014
12861012044                                          00000000003853467.00SULHANA ARMAINI                                                       B      0140397    BCA               KEMANG TEBET      BONUS MEMBER      MARET 2019                          1R014
11651999214                                          00000000000102185.00SUMAJIANTO                                                            B      0140397    BCA               Kramat Jati       BONUS MEMBER      MARET 2019                          1R014
11280189983                                          00000000000103640.00SUNDARI                                                               B      0140397    BCA               Pasar Minggu      BONUS MEMBER      MARET 2019                          1R014
10921317271                                          00000000000103604.00SUPRI YANTO                                                           B      0140397    BCA               KCU Tebet         BONUS MEMBER      MARET 2019                          1R014
15710085015                                          00000000000072600.00SUSAN KARTAWIDJAJA                                                    B      0140397    BCA               Kyai Caringin     BONUS MEMBER      MARET 2019                          1R014
12540333371                                          00000000001881368.00SUSANTI OEY                                                           B      0140397    BCA               samarinda         BONUS MEMBER      MARET 2019                          1R014
10291671861                                          00000000000483699.00SUSANTI SE                                                            B      0140397    BCA               RAHADI USMAN      BONUS MEMBER      MARET 2019                          1R014
16860004001                                          00000000000122187.00SUSANTY WIJAYA                                                        B      0140397    BCA               KWITANG           BONUS MEMBER      MARET 2019                          1R014
12171014010                                          00000000000105580.00SUZANNA ARRYANI                                                       B      0140397    BCA               Kuningan          BONUS MEMBER      MARET 2019                          1R014
11410476271                                          00000000004447685.00SUZANNA ELLY SENTOSA                                                  B      0140397    BCA               nganjuk           BONUS MEMBER      MARET 2019                          1R014
10320979889                                          00000000000123719.00SUZUKI                                                                B      0140397    BCA               Padang            BONUS MEMBER      MARET 2019                          1R014
10341981041                                          00000000000051260.00SYAFRIDA HANUM                                                        B      0140397    BCA               KCU Pekanbaru     BONUS MEMBER      MARET 2019                          1R014
14361242143                                          00000000000507624.00SYAFRINA                                                              B      0140397    BCA               Tebet Barat       BONUS MEMBER      MARET 2019                          1R014
16155200786                                          00000000000050445.00SYLVIA CHRISTINA                                                      B      0140397    BCA               Sidoarjo          BONUS MEMBER      MARET 2019                          1R014
13080072162                                          00000000006992738.00TEDDY WIJAYAPUTRA                                                     B      0140397    BCA               Duta Merlin       BONUS MEMBER      MARET 2019                          1R014
10010455375                                          00000000000056094.00TEGUH RIYADI                                                          B      0140397    BCA               Jakarta           BONUS MEMBER      MARET 2019                          1R014
17815002628                                          00000000000105798.00THEN MARYAWATI                                                        B      0140397    BCA               BALIKPAPAN        BONUS MEMBER      MARET 2019                          1R014
12465106911                                          00000000000232102.00THEO ADHITYA DARMAWAN                                                 B      0140397    BCA               kcp Siliwangi     BONUS MEMBER      MARET 2019                          1R014
13191614168                                          00000000000051163.00THEOLA ZERLINA ICHSANI                                                B      0140397    BCA               Jakarta           BONUS MEMBER      MARET 2019                          1R014
12370130909                                          00000000000072600.00THERESIA INDRAWATI                                                    B      0140397    BCA               Pondok Indah      BONUS MEMBER      MARET 2019                          1R014
10841132423                                          00000000000072600.00THERESIA LIANTO                                                       B      0140397    BCA               Jakarta           BONUS MEMBER      MARET 2019                          1R014
10261634499                                          00000000000092824.00THREISYE VONNY SUMUAL                                                 B      0140397    BCA               manado            BONUS MEMBER      MARET 2019                          1R014
17815095600                                          00000000000469585.00TINI HARTANTO                                                         B      0140397    BCA               BALIKPAPAN        BONUS MEMBER      MARET 2019                          1R014
10031705486                                          00000000000072600.00TIO TJEN AI                                                           B      0140397    BCA               Gunung Sahari     BONUS MEMBER      MARET 2019                          1R014
17140106253                                          00000000000072600.00TJEUW TRISNAWATI SUSANTO                                              B      0140397    BCA               Iskandar Muda P InBONUS MEMBER      MARET 2019                          1R014
17050073038                                          00000000000072600.00TJIANG TJI PENG                                                       B      0140397    BCA               kcp tanjung duren BONUS MEMBER      MARET 2019                          1R014
15650009853                                          00000000001478054.00TJOA MIN NIO                                                          B      0140397    BCA               surabaya          BONUS MEMBER      MARET 2019                          1R014
11650279782                                          00000000000073570.00TOMMY ADHA HARSONO                                                    B      0140397    BCA               KRAMATJATI        BONUS MEMBER      MARET 2019                          1R014
18000515184                                          00000000006468417.00TONGAM F SILABAN                                                      B      0140397    BCA               Medan             BONUS MEMBER      MARET 2019                          1R014
11196004352                                          00000000000212694.00TONGON SARIHON SITORUS                                                B      0140397    BCA               SIPIN - JAMBI     BONUS MEMBER      MARET 2019                          1R014
15165101089                                          00000000000150200.00TRI MILIK PUSPAWATI DR                                                B      0140397    BCA               SEI JAWI          BONUS MEMBER      MARET 2019                          1R014
11710553897                                          00000000001733480.00TRI PUJI ASTUTI                                                       B      0140397    BCA               PONTIANAK         BONUS MEMBER      MARET 2019                          1R014
10931005927                                          00000000000051502.00TRISILO WURYATI NINGSIH                                               B      0140397    BCA               KCP SUNTER        BONUS MEMBER      MARET 2019                          1R014
15060080005                                          00000000000050049.00TRISNORINI                                                            B      0140397    BCA               Surabaya          BONUS MEMBER      MARET 2019                          1R014
17445049760                                          00000000000575315.00TV TRISNA HARTATI                                                     B      0140397    BCA               DENPASAR          BONUS MEMBER      MARET 2019                          1R014
17910493684                                          00000000000158542.00USMAN                                                                 B      0140397    BCA               KENDARI           BONUS MEMBER      MARET 2019                          1R014
13422776271                                          00000000000160482.00VANNY VIDYA HEUMASSE APT                                              B      0140397    BCA               Matraman          BONUS MEMBER      MARET 2019                          1R014
12851193156                                          00000000000284060.00VANYA UTAMI SUMA                                                      B      0140397    BCA               285               BONUS MEMBER      MARET 2019                          1R014
14280024983                                          00000000000225860.00VELDA DWITAMI SUMA                                                    B      0140397    BCA               KCP SUNTER MALL   BONUS MEMBER      MARET 2019                          1R014
11192006621                                          00000000000101734.00VENI KENNIS                                                           B      0140397    BCA               kcu jambi         BONUS MEMBER      MARET 2019                          1R014
10511220971                                          00000000000092000.00VERTA DWI REKASANDI                                                   B      0140397    BCA               banjarmasin-kayutaBONUS MEMBER      MARET 2019                          1R014
17955103505                                          00000000000052991.00VEYBIE S LUMAPOW                                                      B      0140397    BCA               Sentani           BONUS MEMBER      MARET 2019                          1R014
17835097536                                          00000000000274166.00VICTORIA NURHAYATI                                                    B      0140397    BCA               Rembang           BONUS MEMBER      MARET 2019                          1R014
17795121986                                          00000000000197186.00VIENA VICTORIA MENGKO                                                 B      0140397    BCA               Palu              BONUS MEMBER      MARET 2019                          1R014
10292178172                                          00000000000103931.00VINCENT                                                               B      0140397    BCA               PONTIANAK         BONUS MEMBER      MARET 2019                          1R014
17920788712                                          00000000000335859.00WAFIQAH AMIRAH MARWAN                                                 B      0140397    BCA               PALU              BONUS MEMBER      MARET 2019                          1R014
10255695245                                          00000000000578937.00WAHYU SETIAWAN                                                        B      0140397    BCA               Ahmad Yani        BONUS MEMBER      MARET 2019                          1R014
16010017074                                          00000000000157073.00WANDA MARIA NADIYENSI                                                 B      0140397    BCA               KCP ARJUNA        BONUS MEMBER      MARET 2019                          1R014
15085723160                                          00000000000051502.00WARAS                                                                 B      0140397    BCA               Surabaya          BONUS MEMBER      MARET 2019                          1R014
11410592998                                          00000000000333050.00WELLY DJUNAIDI                                                        B      0140397    BCA               nganjuk           BONUS MEMBER      MARET 2019                          1R014
12046377777                                          00000000000227800.00WEN GI WIDJAJA                                                        B      0140397    BCA               204               BONUS MEMBER      MARET 2019                          1R014
10440875149                                          00000000000050290.00WINARSIH                                                              B      0140397    BCA               Surabaya          BONUS MEMBER      MARET 2019                          1R014
10120213237                                          00000000000483800.00WINARTI                                                               B      0140397    BCA               Gajahmada         BONUS MEMBER      MARET 2019                          1R014
16750306002                                          00000000000451870.00WOLTER CHRISTIAN JUSHARD                                              B      0140397    BCA               RUNGKUT           BONUS MEMBER      MARET 2019                          1R014
16240123931                                          00000000000072600.00YATI KUMALA                                                           B      0140397    BCA               permata ujung mentBONUS MEMBER      MARET 2019                          1R014
11520368066                                          00000000006024775.00YAYUK RIWAYATI                                                        B      0140397    BCA               Kertajaya         BONUS MEMBER      MARET 2019                          1R014
16440521442                                          00000000000072600.00YENNY TANUWIJAYA                                                      B      0140397    BCA               Ricci             BONUS MEMBER      MARET 2019                          1R014
10321109364                                          00000000000357780.00YENYTA FIRGO                                                          B      0140397    BCA               Padang            BONUS MEMBER      MARET 2019                          1R014
10510781431                                          00000000000266600.00YOONYS ANDRAY                                                         B      0140397    BCA               BANJARMASIN       BONUS MEMBER      MARET 2019                          1R014
17925086223                                          00000000001132598.00YOSIANTO                                                              B      0140397    BCA               IMAM BONJOL       BONUS MEMBER      MARET 2019                          1R014
14290532944                                          00000000000481637.00YOYOK DWI HIMALAYA                                                    B      0140397    BCA               ahmad yani        BONUS MEMBER      MARET 2019                          1R014
10261879157                                          00000000001113713.00YUDIN IBRAHIM                                                         B      0140397    BCA               Manado            BONUS MEMBER      MARET 2019                          1R014
12872372513                                          00000000034975284.00YULIANTI LIAN                                                         B      0140397    BCA               00000             BONUS MEMBER      MARET 2019                          1R014
10350555935                                          00000000000101894.00YULIDA                                                                B      0140397    BCA               kcu sudirman      BONUS MEMBER      MARET 2019                          1R014
17700211783                                          00000000000171437.00YULITA YOHANA TUNGA                                                   B      0140397    BCA               kerobokan         BONUS MEMBER      MARET 2019                          1R014
18665004194                                          00000000000063385.00ZAINAL                                                                B      0140397    BCA               Sintang           BONUS MEMBER      MARET 2019                          1R014
10120280899                                          00000000003114562.00ZAINAL ARIFIN                                                         B      0140397    BCA               Gajah Mada        BONUS MEMBER      MARET 2019                          1R014
10280110752                                          00000000000289254.00ZIRA ENDYANA NURSYAHBANI                                              B      0140397    BCA               KCU WAHID HASYIM  BONUS MEMBER      MARET 2019                          1R014
