RK;NPWP;NAMA;KD_JENIS_TRANSAKSI;FG_PENGGANTI;NOMOR_FAKTUR;TANGGAL_FAKTUR;NO_DOKUMEN_FAKTUR;TANGGAL_RETUR;MASA_PAJAK_RETUR;TAHUN_PAJAK_RETUR;NILAI_RETUR_DPP;NILAI_RETUR_PPN;NILAI_RETUR_PPNBM
RK;000000000000000;Delvira.;01;0;0001623804616;09/06/2016;0064/UHNCAB/RET/2016;09/06/2016;6;2016;17784909;1778491;0
RK;000000000000000;Delvira.;01;0;0001623804616;09/06/2016;0065/UHNCAB/RET/2016;09/06/2016;6;2016;441818;44182;0
RK;000000000000000;DOMINIKA;01;0;0001623804728;15/06/2016;0066/UHNCAB/RET/2016;15/06/2016;6;2016;5401327;540133;0
RK;000000000000000;"Grace Siska.";01;0;0001623804905;22/06/2016;0067/UHNCAB/RET/2016;22/06/2016;6;2016;18029400;1802940;0
RK;000000000000000;"Vera D. Raintung";01;0;0001623804982;25/06/2016;0068/UHNCAB/RET/2016;25/06/2016;6;2016;3758291;375829;0
RK;000000000000000;Yohanes.;01;0;0001623805080;28/06/2016;0069/UHNCAB/RET/2016;28/06/2016;6;2016;5132082;513208;0
RK;000000000000000;"Rudy Stefanus Tjahjadi";01;0;0001623805082;28/06/2016;0071/UHNCAB/RET/2016;28/06/2016;6;2016;20740109;2074011;0
RK;000000000000000;"Lily Ngadiman.";01;0;0001623805108;28/06/2016;0072/UHNCAB/RET/2016;28/06/2016;6;2016;23506836;2350684;0
RK;000000000000000;"Rudy Stefanus Tjahjadi";01;0;0001623805074;28/06/2016;0070/UHNCAB/RET/2016;28/06/2016;6;2016;20740109;2074011;0
RK;000000000000000;"Preisy A M Golioth";01;0;0001623805218;29/06/2016;0075/UHNCAB/RET/2016;29/06/2016;6;2016;11614982;1161498;0
RK;000000000000000;"Elisabeth Flora Tangos";01;0;0001623805126;29/06/2016;0073/UHNCAB/RET/2016;29/06/2016;6;2016;8864100;886410;0
RK;000000000000000;"Emmy Indriati.";01;0;0001623805161;29/06/2016;0074/UHNCAB/RET/2016;29/06/2016;6;2016;9281218;928122;0
RK;000000000000000;"Fitri Subandi.";01;0;0001623805287;30/06/2016;0077/UHNCAB/RET/2016;30/06/2016;6;2016;500000;50000;0
RK;000000000000000;"Ir. MENY JACOMIN PANDEJ";01;0;0001623805163;29/06/2016;0076/UHNCAB/RET/2016;30/06/2016;6;2016;2284200;228420;0
