FK;KD_JENIS_TRANSAKSI;FG_PENGGANTI;NOMOR_FAKTUR;MASA_PAJAK;TAHUN_PAJAK;TANGGAL_FAKTUR;NPWP;NAMA;ALAMAT_LENGKAP;JUMLAH_DPP;JUMLAH_PPN;JUMLAH_PPNBM;ID_KETERANGAN_TAMBAHAN;FP_UANG_MUKA;UANG_MUKA_DPP;UANG_MUKA_PPN;UANG_MUKA_PPNBM;REFERENSI
LT;NPWP;NAMA;JALAN;BLOK;NOMOR;RT;RW;KECAMATAN;KELURAHAN;KABUPATEN;PROPINSI;KODE_POS;NOMOR_TELEPON
OF;KODE_OBJEK;NAMA;HARGA_SATUAN;JUMLAH_BARANG;HARGA_TOTAL;DISKON;DPP;PPN;TARIF_PPNBM;PPNBM
FK;01;0;0031558300392;8;2015;19/08/2015;073245110047000;"Inneke Kusumo";"Jl.Pluit sakti raya no.143 Rt:09 Rw:07 Pluit Penjaringan Jakarta Utara";1208182;120818;0;0;0;0;0;0;129927
LT;073245110047000;"Inneke Kusumo";-;-;-;0;0;-;-;-;-;-;-
OF;NT020003;"Magozai ";598000;2;1196000;0;1087273;108727;0;0
OF;NT020001;Legres;133000;1;133000;0;120909;12091;0;0
FK;01;0;0031558328511;8;2015;31/08/2015;774312052009000;"Hj Netty Nasir";"Jl. Masjid AL-Barkah No.2 RT.005 RW.001 Kel:Gedong Kec:Pasar Rebo";241818;24182;0;0;0;0;0;0;132533
LT;774312052009000;"Hj Netty Nasir";-;-;-;0;0;-;-;-;-;-;-
OF;NT020001;Legres;133000;2;266000;0;241818;24182;0;0
