0SP202003090033059008 00030331               00000000329823096.0000223BCA               BONUS MEMBER000000FEBRUARI 202000000                                                                             
17685051231                        00000000001651289.00A YUDI JAYA MUSRADHY P                                                                   BONUS MEMBER      FEBRUARI 2020                       014
13880409866                        00000000000108005.00ACHMAD YUSUF DR SPKK                                                                     BONUS MEMBER      FEBRUARI 2020                       014
17735399888                        00000000000128812.00ADHI WIRYA YADHISNA                                                                      BONUS MEMBER      FEBRUARI 2020                       014
17910573050                        00000000001153781.00ADRYAN FRISTIOHADI MSC-A                                                                 BONUS MEMBER      FEBRUARI 2020                       014
17360166532                        00000000000635782.00AGUS RINI SULISTIOWATY                                                                   BONUS MEMBER      FEBRUARI 2020                       014
17400957996                        00000000000111400.00AGUSNA                                                                                   BONUS MEMBER      FEBRUARI 2020                       014
14582204377                        00000000001150983.00ALDO LAMMY                                                                               BONUS MEMBER      FEBRUARI 2020                       014
12581605007                        00000000000162810.00ALFRYATI VENTHY SANDA SAU TAN                                                            BONUS MEMBER      FEBRUARI 2020                       014
10120423045                        00000000001224853.00ALIYA NAINAWA ZAINAL ARIFIN                                                              BONUS MEMBER      FEBRUARI 2020                       014
16720438061                        00000000000121536.00ANASTASIA VANIA SEPUTRA                                                                  BONUS MEMBER      FEBRUARI 2020                       014
17890103213                        00000000000257967.00ANDI SUGIRATU LA TINRO                                                                   BONUS MEMBER      FEBRUARI 2020                       014
16720068379                        00000000000101797.00ANNA TRISULA AL LO TJIOE                                                                 BONUS MEMBER      FEBRUARI 2020                       014
10255775125                        00000000000664998.00APRIYANTO LIFANDY                                                                        BONUS MEMBER      FEBRUARI 2020                       014
14690111948                        00000000001010192.00ARIE YUNITAWATI SUHARSON                                                                 BONUS MEMBER      FEBRUARI 2020                       014
14551169540                        00000000000058050.00ARIF SALEHUDIN                                                                           BONUS MEMBER      FEBRUARI 2020                       014
16495090608                        00000000000102331.00ARMAN                                                                                    BONUS MEMBER      FEBRUARI 2020                       014
15210146387                        00000000002599246.00BUNNAWATI                                                                                BONUS MEMBER      FEBRUARI 2020                       014
10103448899                        00000000000176099.00CALVIN ALEXANDER EFANS J                                                                 BONUS MEMBER      FEBRUARI 2020                       014
10931230921                        00000000000075020.00CANDRA WIJAYA                                                                            BONUS MEMBER      FEBRUARI 2020                       014
10657787888                        00000000000101797.00CASANDRA MARTA                                                                           BONUS MEMBER      FEBRUARI 2020                       014
13691033021                        00000000002036666.00CHARLIE BUDIMAN SH                                                                       BONUS MEMBER      FEBRUARI 2020                       014
14710032497                        00000000002464935.00CHARLOTHA PUTRI SHARON                                                                   BONUS MEMBER      FEBRUARI 2020                       014
10255687382                        00000000000232820.00CHATERINE LIFANDY                                                                        BONUS MEMBER      FEBRUARI 2020                       014
12211205123                        00000000000106938.00CITRA HALIM                                                                              BONUS MEMBER      FEBRUARI 2020                       014
18050030734                        00000000000051357.00CORNELIA CHANDRA BSC                                                                     BONUS MEMBER      FEBRUARI 2020                       014
10430970968                        00000000002030632.00CUT ZAKIA PUTRI FANDANI                                                                  BONUS MEMBER      FEBRUARI 2020                       014
18585131683                        00000000000050775.00DAMARIS TIKU                                                                             BONUS MEMBER      FEBRUARI 2020                       014
11630357205                        00000000000272517.00DARMAWAN TEDJA                                                                           BONUS MEMBER      FEBRUARI 2020                       014
17920315482                        00000000000790432.00DARUSMAN M LAMANGKAU SE                                                                  BONUS MEMBER      FEBRUARI 2020                       014
17025018966                        00000000000101086.00DELLY MULIARIADI                                                                         BONUS MEMBER      FEBRUARI 2020                       014
11192097287                        00000000012632548.00DELVIRA                                                                                  BONUS MEMBER      FEBRUARI 2020                       014
18205033315                        00000000000395174.00DERMAWATI TURNIP                                                                         BONUS MEMBER      FEBRUARI 2020                       014
18780045141                        00000000000137396.00DESSY ARISTIA                                                                            BONUS MEMBER      FEBRUARI 2020                       014
16070317069                        00000000000156748.00DESSY NATALIA MANOPPO                                                                    BONUS MEMBER      FEBRUARI 2020                       014
17865207891                        00000000000060281.00DEWI SARTIKA                                                                             BONUS MEMBER      FEBRUARI 2020                       014
17920178531                        00000000001495930.00DIONISIUS RORI PARENGKUA                                                                 BONUS MEMBER      FEBRUARI 2020                       014
14730197280                        00000000000061445.00DJOHAN BUNAWAN GANI                                                                      BONUS MEMBER      FEBRUARI 2020                       014
17890877596                        00000000000412730.00DRG ULFAH CHAERANI SAPUT                                                                 BONUS MEMBER      FEBRUARI 2020                       014
10241104175                        00000000000050290.00EDELTRUDIS RAHAYU WAHYU                                                                  BONUS MEMBER      FEBRUARI 2020                       014
14641259572                        00000000000053200.00EDI TRIYENTO                                                                             BONUS MEMBER      FEBRUARI 2020                       014
11191809942                        00000000000319150.00EKA YULI ASTUTI                                                                          BONUS MEMBER      FEBRUARI 2020                       014
10021223785                        00000000000164055.00ELLYJATY SALIM                                                                           BONUS MEMBER      FEBRUARI 2020                       014
15725014063                        00000000000314615.00ELVIE DJ BANGUN                                                                          BONUS MEMBER      FEBRUARI 2020                       014
12581563851                        00000000003725724.00EMMY INDRIATY                                                                            BONUS MEMBER      FEBRUARI 2020                       014
15415035435                        00000000001168079.00ENDY MUHARDIN MOEGNI DR                                                                  BONUS MEMBER      FEBRUARI 2020                       014
10183675131                        00000000000101797.00ERVINA SUHENDRO                                                                          BONUS MEMBER      FEBRUARI 2020                       014
11084639977                        00000000000152868.00ERWAN HERLAMBANG                                                                         BONUS MEMBER      FEBRUARI 2020                       014
12881053146                        00000000000102960.00ESTER JUNINGSIH SUDIONO                                                                  BONUS MEMBER      FEBRUARI 2020                       014
16155020567                        00000000000155196.00ESTER TJENDRAWATI                                                                        BONUS MEMBER      FEBRUARI 2020                       014
17970231026                        00000000000072600.00FAHIDAH FAISAL                                                                           BONUS MEMBER      FEBRUARI 2020                       014
13422364673                        00000000000096414.00FERNANDI DR                                                                              BONUS MEMBER      FEBRUARI 2020                       014
17970003651                        00000000003752342.00FITRIYANTI RASYID                                                                        BONUS MEMBER      FEBRUARI 2020                       014
10491569688                        00000000010033028.00FRANSISKUS YANNO SOERATMAN                                                               BONUS MEMBER      FEBRUARI 2020                       014
16280144396                        00000000000101700.00GO ARIESTA NUGROHO                                                                       BONUS MEMBER      FEBRUARI 2020                       014
11710933029                        00000000000101797.00GOLDINA PRITI PINTARTI C                                                                 BONUS MEMBER      FEBRUARI 2020                       014
17670410468                        00000000000155098.00HALARI INSAN IHSANI                                                                      BONUS MEMBER      FEBRUARI 2020                       014
13900389212                        00000000002449634.00HAMSIAH SANGKALA                                                                         BONUS MEMBER      FEBRUARI 2020                       014
17920451742                        00000000000728797.00HANIFA                                                                                   BONUS MEMBER      FEBRUARI 2020                       014
12903013885                        00000000000102670.00HARTATI                                                                                  BONUS MEMBER      FEBRUARI 2020                       014
17795019669                        00000000002371005.00HARUN DALING TUMBUAN                                                                     BONUS MEMBER      FEBRUARI 2020                       014
17685089955                        00000000000637658.00HASNIH S                                                                                 BONUS MEMBER      FEBRUARI 2020                       014
18285021444                        00000000000102403.00HASYIM SINAGA                                                                            BONUS MEMBER      FEBRUARI 2020                       014
10272616980                        00000000000143410.00HELEN TANSIL                                                                             BONUS MEMBER      FEBRUARI 2020                       014
10880652192                        00000000000528694.00HERLIN YUNARA                                                                            BONUS MEMBER      FEBRUARI 2020                       014
10940750938                        00000000000404582.00HJ LILY IRIANA                                                                           BONUS MEMBER      FEBRUARI 2020                       014
17920383445                        00000000000052958.00HJ MAYA MALANIA NOOR-IR-                                                                 BONUS MEMBER      FEBRUARI 2020                       014
17160038327                        00000000002181526.00HJ. NETTY NASIR                                                                          BONUS MEMBER      FEBRUARI 2020                       014
16805111503                        00000000000062221.00HJALMAR SIHOMBING DRS                                                                    BONUS MEMBER      FEBRUARI 2020                       014
16871442204                        00000000000101797.00IDA GUSDIARNI                                                                            BONUS MEMBER      FEBRUARI 2020                       014
17920869704                        00000000000102185.00IDHAM CHALIQ                                                                             BONUS MEMBER      FEBRUARI 2020                       014
10661064721                        00000000001370994.00IGNATIUS BAMBANG BROTOSA                                                                 BONUS MEMBER      FEBRUARI 2020                       014
17155019841                        00000000000072600.00IIN PURNAMASARI                                                                          BONUS MEMBER      FEBRUARI 2020                       014
10291362418                        00000000008702419.00IMACULATA KORNIA                                                                         BONUS MEMBER      FEBRUARI 2020                       014
11981615498                        00000000000538394.00IMANUEL ADAM                                                                             BONUS MEMBER      FEBRUARI 2020                       014
11440327261                        00000000000052472.00IMELDA ESTER MARLINDA S                                                                  BONUS MEMBER      FEBRUARI 2020                       014
12460330001                        00000000000422964.00INAVIANTI WINARTO                                                                        BONUS MEMBER      FEBRUARI 2020                       014
10141007881                        00000000000102961.00INDAH SUTJIATI WAHONO                                                                    BONUS MEMBER      FEBRUARI 2020                       014
13890358038                        00000000000101603.00INDIRA YANA SRI DARMA PUTRA                                                              BONUS MEMBER      FEBRUARI 2020                       014
15880209959                        00000000012262104.00INDRIYATI SALIM                                                                          BONUS MEMBER      FEBRUARI 2020                       014
14260366811                        00000000000155147.00INGE H S / THEO A D                                                                      BONUS MEMBER      FEBRUARI 2020                       014
10884771397                        00000000000104610.00INGGRIATI DJOJOSEPUTRO D                                                                 BONUS MEMBER      FEBRUARI 2020                       014
12440015231                        00000000000117850.00INNEKE KUSUMO                                                                            BONUS MEMBER      FEBRUARI 2020                       014
16380003447                        00000000000058584.00IR. SOEBIJANTO TRIWIBOWO                                                                 BONUS MEMBER      FEBRUARI 2020                       014
13111128616                        00000000000050775.00IRAWATI                                                                                  BONUS MEMBER      FEBRUARI 2020                       014
16290301562                        00000000000083998.00IRMA PUSPITA                                                                             BONUS MEMBER      FEBRUARI 2020                       014
13140202303                        00000000000053200.00IRWANTO CAHYADI                                                                          BONUS MEMBER      FEBRUARI 2020                       014
12903891939                        00000000000101700.00IRWANTO IE                                                                               BONUS MEMBER      FEBRUARI 2020                       014
17685039869                        00000000000155147.00ISAEL PAULL HARYONO                                                                      BONUS MEMBER      FEBRUARI 2020                       014
11520657777                        00000000000150976.00JEFFRY TANUGRAHA                                                                         BONUS MEMBER      FEBRUARI 2020                       014
17680362585                        00000000000053976.00JEVON TANUGRAHA                                                                          BONUS MEMBER      FEBRUARI 2020                       014
10181090234                        00000000001311387.00JOHANES PUTRA MAYNINEDO                                                                  BONUS MEMBER      FEBRUARI 2020                       014
11781176392                        00000000002116064.00JOUSJE ADAM                                                                              BONUS MEMBER      FEBRUARI 2020                       014
11681694248                        00000000000698590.00JUANITA ICHSANI                                                                          BONUS MEMBER      FEBRUARI 2020                       014
11400444796                        00000000000050775.00JULI HENDRAYANI                                                                          BONUS MEMBER      FEBRUARI 2020                       014
10885727030                        00000000000107180.00KALEB YEREMIA YUNIOR KOR                                                                 BONUS MEMBER      FEBRUARI 2020                       014
12900146208                        00000000000101797.00KARMILA MUSIDAR                                                                          BONUS MEMBER      FEBRUARI 2020                       014
14770035509                        00000000000129345.00KARTIKA LESMANA                                                                          BONUS MEMBER      FEBRUARI 2020                       014
10051024086                        00000000000100972.00KARWITA NURLAELASARI                                                                     BONUS MEMBER      FEBRUARI 2020                       014
10420075537                        00000000000068720.00KASIM ISHAK                                                                              BONUS MEMBER      FEBRUARI 2020                       014
11710507968                        00000000000102234.00KATHARINA LIES SPD                                                                       BONUS MEMBER      FEBRUARI 2020                       014
10710040915                        00000000001963141.00KENNETH RAY VICI LENGKON                                                                 BONUS MEMBER      FEBRUARI 2020                       014
14970573513                        00000000000101603.00KIEMI MANALU                                                                             BONUS MEMBER      FEBRUARI 2020                       014
12620007202                        00000000000324897.00KIKIE HARDI                                                                              BONUS MEMBER      FEBRUARI 2020                       014
12850039910                        00000000000395658.00KOE HOENG WHENG                                                                          BONUS MEMBER      FEBRUARI 2020                       014
12211227763                        00000000000431088.00KONNI M TAMBUNAN                                                                         BONUS MEMBER      FEBRUARI 2020                       014
14131012939                        00000000000061494.00LANNY SANTOSO                                                                            BONUS MEMBER      FEBRUARI 2020                       014
11051407763                        00000000000211940.00LANNY SULAIMAN                                                                           BONUS MEMBER      FEBRUARI 2020                       014
11521037909                        00000000000102912.00LAURENSIA SUSAN                                                                          BONUS MEMBER      FEBRUARI 2020                       014
13971165357                        00000000000051260.00LIAN BIE HUI                                                                             BONUS MEMBER      FEBRUARI 2020                       014
17920702494                        00000000000192444.00LIDYA ARMA                                                                               BONUS MEMBER      FEBRUARI 2020                       014
15060026981                        00000000000154856.00LIE AY HWA                                                                               BONUS MEMBER      FEBRUARI 2020                       014
10880370006                        00000000000102960.00LIEM LINDAWATI MASAJU                                                                    BONUS MEMBER      FEBRUARI 2020                       014
17540460269                        00000000000208594.00LILIANY WIJAYA                                                                           BONUS MEMBER      FEBRUARI 2020                       014
12762222222                        00000000001192671.00LILY NGADIMAN                                                                            BONUS MEMBER      FEBRUARI 2020                       014
12211076871                        00000000000101797.00LINA HALIM THE                                                                           BONUS MEMBER      FEBRUARI 2020                       014
17795143955                        00000000004381046.00LINDA                                                                                    BONUS MEMBER      FEBRUARI 2020                       014
10272058839                        00000000000060960.00LINDA WATI TAMBERIN                                                                      BONUS MEMBER      FEBRUARI 2020                       014
17955171314                        00000000000587912.00LISDA TUNILAN                                                                            BONUS MEMBER      FEBRUARI 2020                       014
16280639999                        00000000000051260.00LUSIA RUDIASWORO                                                                         BONUS MEMBER      FEBRUARI 2020                       014
18620235661                        00000000000485335.00LYDIANA DEWI EFFENDY                                                                     BONUS MEMBER      FEBRUARI 2020                       014
11500446303                        00000000001370470.00M ASYIQ SUKOCO                                                                           BONUS MEMBER      FEBRUARI 2020                       014
10480732537                        00000000000050775.00MARGARETA YUNIARTI                                                                       BONUS MEMBER      FEBRUARI 2020                       014
10260829971                        00000000002800541.00MARIA BEATRIX LUNTUNGAN                                                                  BONUS MEMBER      FEBRUARI 2020                       014
16840153876                        00000000002340044.00MARIANCE                                                                                 BONUS MEMBER      FEBRUARI 2020                       014
10292155075                        00000000000325916.00MARISA CAROLINA TEDJA                                                                    BONUS MEMBER      FEBRUARI 2020                       014
14650268356                        00000000008150614.00MARSUDI                                                                                  BONUS MEMBER      FEBRUARI 2020                       014
11520325049                        00000000000540436.00MARTHEN CAREL KORWA                                                                      BONUS MEMBER      FEBRUARI 2020                       014
17795044337                        00000000000675544.00MARWAN AMIR                                                                              BONUS MEMBER      FEBRUARI 2020                       014
10640167297                        00000000000477769.00MEDYAWATI LIMANTARA DRG                                                                  BONUS MEMBER      FEBRUARI 2020                       014
11190435969                        00000000000100924.00MEGAWATI EMERENTIANA OH                                                                  BONUS MEMBER      FEBRUARI 2020                       014
17160069281                        00000000005938278.00MELAWATY ABYANI                                                                          BONUS MEMBER      FEBRUARI 2020                       014
10883225888                        00000000000058680.00MELI WIDJAJA                                                                             BONUS MEMBER      FEBRUARI 2020                       014
13053007500                        00000000002846194.00MEYLIA                                                                                   BONUS MEMBER      FEBRUARI 2020                       014
11100221515                        00000000000102476.00MILDA PRATIWI MUSIDAR                                                                    BONUS MEMBER      FEBRUARI 2020                       014
12741034559                        00000000005195949.00MIRA REBEKA SANI                                                                         BONUS MEMBER      FEBRUARI 2020                       014
10255460574                        00000000000531685.00MUH. KADIR                                                                               BONUS MEMBER      FEBRUARI 2020                       014
17920781742                        00000000000223253.00MUHAMMAD HILMI MARWAN                                                                    BONUS MEMBER      FEBRUARI 2020                       014
18460218447                        00000000000121148.00MUSLIHUL HANAS                                                                           BONUS MEMBER      FEBRUARI 2020                       014
13101077452                        00000000000155196.00NANNY DARMAWAN                                                                           BONUS MEMBER      FEBRUARI 2020                       014
10560789939                        00000000000111400.00NI NYOMAN NGURAH ASTUTI                                                                  BONUS MEMBER      FEBRUARI 2020                       014
17920826401                        00000000000274942.00NI WAYAN SUARNI                                                                          BONUS MEMBER      FEBRUARI 2020                       014
10653453890                        00000000000206800.00NILAWATI"BDN RATU PRATIW                                                                 BONUS MEMBER      FEBRUARI 2020                       014
18290171513                        00000000000318446.00NINIK ELSAWATIE                                                                          BONUS MEMBER      FEBRUARI 2020                       014
10067888883                        00000000000102960.00NITRA TIARA                                                                              BONUS MEMBER      FEBRUARI 2020                       014
18680552801                        00000000000100730.00NONSI MARIANA                                                                            BONUS MEMBER      FEBRUARI 2020                       014
15210742605                        00000000001984712.00NOVI HANDAYANI                                                                           BONUS MEMBER      FEBRUARI 2020                       014
18140393399                        00000000000613860.00NOVIKA LOUDERS ROSELLINI                                                                 BONUS MEMBER      FEBRUARI 2020                       014
13900376251                        00000000000750582.00NUR NIKMA ANUGRAWATI                                                                     BONUS MEMBER      FEBRUARI 2020                       014
10272541255                        00000000000165720.00NURAENI                                                                                  BONUS MEMBER      FEBRUARI 2020                       014
11199004598                        00000000000263302.00NURHASANAH HS                                                                            BONUS MEMBER      FEBRUARI 2020                       014
12481579793                        00000000000121100.00NURJANAH S                                                                               BONUS MEMBER      FEBRUARI 2020                       014
10255830223                        00000000000053200.00NURJAYA SH                                                                               BONUS MEMBER      FEBRUARI 2020                       014
10550699893                        00000000000104368.00NURKHASANAH                                                                              BONUS MEMBER      FEBRUARI 2020                       014
10251641519                        00000000000072600.00NURUL AZIZA                                                                              BONUS MEMBER      FEBRUARI 2020                       014
17640857212                        00000000001211817.00NURUL AZIZAH                                                                             BONUS MEMBER      FEBRUARI 2020                       014
10353041450                        00000000000102960.00OSBORN BUDIMAN                                                                           BONUS MEMBER      FEBRUARI 2020                       014
15390484234                        00000000000203671.00PAULINA TJHIN                                                                            BONUS MEMBER      FEBRUARI 2020                       014
11691938561                        00000000001500702.00PONCO HANDAYAWATI                                                                        BONUS MEMBER      FEBRUARI 2020                       014
14681270978                        00000000000101991.00PRASTI ADHI DHARMASANTI DR                                                               BONUS MEMBER      FEBRUARI 2020                       014
17800213392                        00000000000123855.00PREISY ANGEL MARIA GOLIO                                                                 BONUS MEMBER      FEBRUARI 2020                       014
18830376781                        00000000000113388.00PUDJAWATI                                                                                BONUS MEMBER      FEBRUARI 2020                       014
11060060106                        00000000000208448.00R. PENYSARI TRISNOWATI                                                                   BONUS MEMBER      FEBRUARI 2020                       014
17890006471                        00000000000261896.00RATNA WIJAYA                                                                             BONUS MEMBER      FEBRUARI 2020                       014
12741009970                        00000000000873311.00RAY LAMMY                                                                                BONUS MEMBER      FEBRUARI 2020                       014
12533098011                        00000000000102960.00RIA JUWITA                                                                               BONUS MEMBER      FEBRUARI 2020                       014
10255755531                        00000000000559348.00RICHARD LIFANDY                                                                          BONUS MEMBER      FEBRUARI 2020                       014
17920717351                        00000000001271959.00RISDIYANTO                                                                               BONUS MEMBER      FEBRUARI 2020                       014
17060095269                        00000000000873092.00ROBERT DEDE BANGUN                                                                       BONUS MEMBER      FEBRUARI 2020                       014
17920441119                        00000000005513959.00ROBERTH PARENGKUAN                                                                       BONUS MEMBER      FEBRUARI 2020                       014
11683399977                        00000000002040003.00RULLY ARISCHANDRA                                                                        BONUS MEMBER      FEBRUARI 2020                       014
16665050541                        00000000022097605.00RUSIANI                                                                                  BONUS MEMBER      FEBRUARI 2020                       014
11410324047                        00000000004698622.00RUTH HANDAYANI DARMAWAN                                                                  BONUS MEMBER      FEBRUARI 2020                       014
12581015901                        00000000002260066.00SALIM                                                                                    BONUS MEMBER      FEBRUARI 2020                       014
17910170583                        00000000039162958.00SALMIA RODHIYA HUSAINY                                                                   BONUS MEMBER      FEBRUARI 2020                       014
13010007355                        00000000000101797.00SANTI VERONICA SIAGIAN                                                                   BONUS MEMBER      FEBRUARI 2020                       014
18375052136                        00000000001820104.00SARAH ATTHAHIRAH                                                                         BONUS MEMBER      FEBRUARI 2020                       014
10040049177                        00000000000190794.00SARAH AYUDA                                                                              BONUS MEMBER      FEBRUARI 2020                       014
18200654570                        00000000002061007.00SARMED IDA RISAN NABABAN                                                                 BONUS MEMBER      FEBRUARI 2020                       014
16370116677                        00000000000093552.00SATIADI SUTISNA                                                                          BONUS MEMBER      FEBRUARI 2020                       014
14450280378                        00000000000053200.00SATRIYO DJOKO PAMBAGYO. ST                                                               BONUS MEMBER      FEBRUARI 2020                       014
16795700777                        00000000000052715.00SELVI BAROLEH                                                                            BONUS MEMBER      FEBRUARI 2020                       014
10350814710                        00000000000375046.00SETIAWATI MARAMIS                                                                        BONUS MEMBER      FEBRUARI 2020                       014
11010200209                        00000000001210706.00SETYOTUHU TATIK                                                                          BONUS MEMBER      FEBRUARI 2020                       014
17955222211                        00000000000557600.00SRI MULIADEWI GUNARTO                                                                    BONUS MEMBER      FEBRUARI 2020                       014
14520006091                        00000000000052327.00SRI REJEKI                                                                               BONUS MEMBER      FEBRUARI 2020                       014
18020384591                        00000000005595217.00ST BALQIS NURCAHYANI AM                                                                  BONUS MEMBER      FEBRUARI 2020                       014
12533338585                        00000000049253496.00STEVIE LENGKONG                                                                          BONUS MEMBER      FEBRUARI 2020                       014
17401245719                        00000000000500128.00SUCIPTO                                                                                  BONUS MEMBER      FEBRUARI 2020                       014
12750167091                        00000000001843626.00SUDI WARSITO                                                                             BONUS MEMBER      FEBRUARI 2020                       014
13911006471                        00000000000149327.00SUHERMAN                                                                                 BONUS MEMBER      FEBRUARI 2020                       014
17910249091                        00000000009109274.00SULEMAN MILE                                                                             BONUS MEMBER      FEBRUARI 2020                       014
12861012044                        00000000000269025.00SULHANA ARMAINI                                                                          BONUS MEMBER      FEBRUARI 2020                       014
12540333371                        00000000000609040.00SUSANTI OEY                                                                              BONUS MEMBER      FEBRUARI 2020                       014
10711328652                        00000000000050775.00SUSIE KOSASIH                                                                            BONUS MEMBER      FEBRUARI 2020                       014
11410476271                        00000000004704700.00SUZANNA ELLY SENTOSA                                                                     BONUS MEMBER      FEBRUARI 2020                       014
11530064758                        00000000000101021.00TAMIN KOSASIH                                                                            BONUS MEMBER      FEBRUARI 2020                       014
13080072162                        00000000003471571.00TEDDY WIJAYAPUTRA                                                                        BONUS MEMBER      FEBRUARI 2020                       014
10010455375                        00000000000101991.00TEGUH RIYADI                                                                             BONUS MEMBER      FEBRUARI 2020                       014
11520385858                        00000000000268928.00THE THETY MEYCIYANA SUEL                                                                 BONUS MEMBER      FEBRUARI 2020                       014
12851058062                        00000000000053200.00THEN PIN NGIAN                                                                           BONUS MEMBER      FEBRUARI 2020                       014
12771387774                        00000000000102217.00TINNA INDAH YANTI                                                                        BONUS MEMBER      FEBRUARI 2020                       014
10031705486                        00000000000053200.00TIO TJEN AI                                                                              BONUS MEMBER      FEBRUARI 2020                       014
17540888889                        00000000000100512.00TJHIEN FIE WOEN                                                                          BONUS MEMBER      FEBRUARI 2020                       014
14010253123                        00000000000155195.00TJUNG ENG HUA                                                                            BONUS MEMBER      FEBRUARI 2020                       014
18000515184                        00000000000331154.00TONGAM F SILABAN                                                                         BONUS MEMBER      FEBRUARI 2020                       014
11710553897                        00000000000300598.00TRI PUJI ASTUTI                                                                          BONUS MEMBER      FEBRUARI 2020                       014
12903024461                        00000000000101797.00UMMU CALSUM KADIR                                                                        BONUS MEMBER      FEBRUARI 2020                       014
16070096151                        00000000000156844.00UTING ROCHIMA                                                                            BONUS MEMBER      FEBRUARI 2020                       014
17920788712                        00000000000329548.00WAFIQAH AMIRAH MARWAN                                                                    BONUS MEMBER      FEBRUARI 2020                       014
16010017074                        00000000000209030.00WANDA MARIA NADIYENSI                                                                    BONUS MEMBER      FEBRUARI 2020                       014
15085723160                        00000000000102960.00WARAS                                                                                    BONUS MEMBER      FEBRUARI 2020                       014
13191467131                        00000000000116832.00WELLA SOLIHIN                                                                            BONUS MEMBER      FEBRUARI 2020                       014
11410592998                        00000000000765883.00WELLY JUNAIDI LEE                                                                        BONUS MEMBER      FEBRUARI 2020                       014
11410658999                        00000000001159555.00XANDRAMELA LIMALA ALICYA                                                                 BONUS MEMBER      FEBRUARI 2020                       014
13880501223                        00000000000092000.00YAP TIN TJOE                                                                             BONUS MEMBER      FEBRUARI 2020                       014
11520368066                        00000000001686612.00YAYUK RIWAYATI                                                                           BONUS MEMBER      FEBRUARI 2020                       014
17990807692                        00000000000259616.00YOHANIS BARA PADANG                                                                      BONUS MEMBER      FEBRUARI 2020                       014
17925086223                        00000000000184344.00YOSIANTO                                                                                 BONUS MEMBER      FEBRUARI 2020                       014
10261879157                        00000000000156359.00YUDIN IBRAHIM                                                                            BONUS MEMBER      FEBRUARI 2020                       014
12872372513                        00000000010679646.00YULIANTI LIAN                                                                            BONUS MEMBER      FEBRUARI 2020                       014
10255823073                        00000000000274845.00YULITA PANGGALO                                                                          BONUS MEMBER      FEBRUARI 2020                       014
10120280899                        00000000002878183.00ZAINAL ARIFIN                                                                            BONUS MEMBER      FEBRUARI 2020                       014
10280110752                        00000000000101797.00ZIRA ENDYANA NURSYAHBANI                                                                 BONUS MEMBER      FEBRUARI 2020                       014
