FK;KD_JENIS_TRANSAKSI;FG_PENGGANTI;NOMOR_FAKTUR;MASA_PAJAK;TAHUN_PAJAK;TANGGAL_FAKTUR;NPWP;NAMA;ALAMAT_LENGKAP;JUMLAH_DPP;JUMLAH_PPN;JUMLAH_PPNBM;ID_KETERANGAN_TAMBAHAN;FP_UANG_MUKA;UANG_MUKA_DPP;UANG_MUKA_PPN;UANG_MUKA_PPNBM;REFERENSI
LT;NPWP;NAMA;JALAN;BLOK;NOMOR;RT;RW;KECAMATAN;KELURAHAN;KABUPATEN;PROPINSI;KODE_POS;NOMOR_TELEPON
OF;KODE_OBJEK;NAMA;HARGA_SATUAN;JUMLAH_BARANG;HARGA_TOTAL;DISKON;DPP;PPN;TARIF_PPNBM;PPNBM
FK;01;0;0001862577327;1;2018;05/01/2018;672354446619000;"Surjana Dewi Effendy";"JL. Manyar Tirtoyoso Selatan 4 no. 11 RT 007 RW 005 Manyarsabrangan Mulyorejo surabaya";801818;80182;0;0;0;0;0;0;36136
LT;672354446619000;"Surjana Dewi Effendy";-;-;-;0;0;-;-;-;-;-;-
OF;PP0254;"TOP UP Loyalty 2 Calcium with Vit. D";49000;18;882000;0;801818;80182;0;0
FK;01;0;0001862577329;1;2018;05/01/2018;061106084008000;"Mira Rebeka Sani";"Jl. Kesenian Blok O 1/12 Rt.016 Rw.009 Duren Sawit Jakarta Timur";8884474;888446;0;0;0;0;0;0;36138
LT;061106084008000;"Mira Rebeka Sani";-;-;-;0;0;-;-;-;-;-;-
OF;MT0159;"Catalog Vol.1 th 2018 (20 pcs)";130000;1;130000;0;118182;11818;0;0
OF;HF060007;"HF Bee Propolis Liquid";280120;1;280120;0;254655;25465;0;0
OF;PP080124;"Magozai Promo (Buy 3 Get 1)";562120;15;8431800;0;7665273;766527;0;0
OF;PP0254;"TOP UP Loyalty 2 Calcium with Vit. D";49000;19;931000;0;846364;84636;0;0
FK;01;0;0001862577332;1;2018;05/01/2018;061106084008000;"Mira Rebeka Sani";"Jl. Kesenian Blok O 1/12 Rt.016 Rw.009 Duren Sawit Jakarta Timur";577673;57767;0;0;0;0;0;0;36141
LT;061106084008000;"Mira Rebeka Sani";-;-;-;0;0;-;-;-;-;-;-
OF;SL0002;"Calorease 30s (1 Box)";158860;4;635440;0;577673;57767;0;0
FK;01;0;0001862577345;1;2018;06/01/2018;061106084008000;"Mira Rebeka Sani";"Jl. Kesenian Blok O 1/12 Rt.016 Rw.009 Duren Sawit Jakarta Timur";4605437;460543;0;0;0;0;0;0;36152
LT;061106084008000;"Mira Rebeka Sani";-;-;-;0;0;-;-;-;-;-;-
OF;PP080124;"Magozai Promo (Buy 3 Get 1)";562120;9;5059080;0;4599164;459916;0;0
OF;MT0158;"Catalog Vol.1 th 2018";6900;1;6900;0;6273;627;0;0
FK;01;0;0001862577350;1;2018;06/01/2018;594682387037000;"Zainal Arifin.";"Jl. Thalib II No.5 Krukut - Tamansari Jakarta Barat";31364;3136;0;0;0;0;0;0;36156
LT;594682387037000;"Zainal Arifin.";-;-;-;0;0;-;-;-;-;-;-
OF;MT0158;"Catalog Vol.1 th 2018";6900;5;34500;0;31364;3136;0;0
FK;01;0;0001862577360;1;2018;08/01/2018;061106084008000;"Mira Rebeka Sani";"Jl. Kesenian Blok O 1/12 Rt.016 Rw.009 Duren Sawit Jakarta Timur";1913037;191303;0;0;0;0;0;0;36165
LT;061106084008000;"Mira Rebeka Sani";-;-;-;0;0;-;-;-;-;-;-
OF;PP080124;"Magozai Promo (Buy 3 Get 1)";562120;3;1686360;0;1533055;153305;0;0
OF;NT020010;Ginsana;312080;1;312080;0;283709;28371;0;0
OF;MT0158;"Catalog Vol.1 th 2018";6900;1;6900;0;6273;627;0;0
OF;SK0054;"Starter Kit Jan 2018";99000;1;99000;0;90000;9000;0;0
FK;01;0;0001862577362;1;2018;08/01/2018;061106084008000;"Mira Rebeka Sani";"Jl. Kesenian Blok O 1/12 Rt.016 Rw.009 Duren Sawit Jakarta Timur";1623055;162305;0;0;0;0;0;0;36167
LT;061106084008000;"Mira Rebeka Sani";-;-;-;0;0;-;-;-;-;-;-
OF;PP080124;"Magozai Promo (Buy 3 Get 1)";562120;3;1686360;0;1533055;153305;0;0
OF;SK0054;"Starter Kit Jan 2018";99000;1;99000;0;90000;9000;0;0
FK;01;0;0001862577370;1;2018;08/01/2018;672354446619000;"Surjana Dewi Effendy";"JL. Manyar Tirtoyoso Selatan 4 no. 11 RT 007 RW 005 Manyarsabrangan Mulyorejo surabaya";6174472;617447;0;0;0;0;0;0;36174
LT;672354446619000;"Surjana Dewi Effendy";-;-;-;0;0;-;-;-;-;-;-
OF;NT020011;Asta-Gen;253800;5;1269000;0;1153636;115364;0;0
OF;MT0161;"Catalog Vol.1 th 2018 (100 pcs)";590000;2;1180000;0;1072727;107273;0;0
OF;HF060010;"HF Salmon Oil 90s";282000;1;282000;0;256364;25636;0;0
OF;NT020001;Legres;125020;20;2500400;0;2273091;227309;0;0
OF;NT020003;"Magozai 750ml";562120;2;1124240;0;1022036;102204;0;0
OF;NT020013;Vegefrut;193640;2;387280;0;352073;35207;0;0
OF;PP0254;"TOP UP Loyalty 2 Calcium with Vit. D";49000;1;49000;0;44545;4454;0;0
FK;01;0;0001862577437;1;2018;10/01/2018;061106084008000;"Mira Rebeka Sani";"Jl. Kesenian Blok O 1/12 Rt.016 Rw.009 Duren Sawit Jakarta Timur";4717346;471734;0;0;0;0;0;0;36222
LT;061106084008000;"Mira Rebeka Sani";-;-;-;0;0;-;-;-;-;-;-
OF;PP080124;"Magozai Promo (Buy 3 Get 1)";562120;9;5059080;0;4599164;459916;0;0
OF;MT0159;"Catalog Vol.1 th 2018 (20 pcs)";130000;1;130000;0;118182;11818;0;0
FK;01;0;0001862577451;1;2018;10/01/2018;672354446619000;"Surjana Dewi Effendy";"JL. Manyar Tirtoyoso Selatan 4 no. 11 RT 007 RW 005 Manyarsabrangan Mulyorejo surabaya";3302818;330281;0;0;0;0;0;0;36234
LT;672354446619000;"Surjana Dewi Effendy";-;-;-;0;0;-;-;-;-;-;-
OF;SL0002;"Calorease 30s (1 Box)";158860;15;2382900;0;2166273;216627;0;0
OF;NT020001;Legres;125020;10;1250200;0;1136545;113654;0;0
FK;01;0;0001862577466;1;2018;11/01/2018;059461533732001;"Ir.HJ.Hayatun Fardah";"Jl. Garuda No.81 
Kel. Komet Kec. Banjar Baru Utara Kab Banjarbaru -  Kalimantan Selatan
";454618;45462;0;0;0;0;0;0;36248
LT;059461533732001;"Ir.HJ.Hayatun Fardah";-;-;-;0;0;-;-;-;-;-;-
OF;NT020001;Legres;125020;4;500080;0;454618;45462;0;0
FK;01;0;0001862577472;1;2018;11/01/2018;061106084008000;"Mira Rebeka Sani";"Jl. Kesenian Blok O 1/12 Rt.016 Rw.009 Duren Sawit Jakarta Timur";4388945;438895;0;0;0;0;0;0;36253
LT;061106084008000;"Mira Rebeka Sani";-;-;-;0;0;-;-;-;-;-;-
OF;PP0245;"U-Claire BI2 Set Promo Disc 40%";485040;3;1455120;0;1322836;132284;0;0
OF;PP080124;"Magozai Promo (Buy 3 Get 1)";562120;6;3372720;0;3066109;306611;0;0
FK;01;0;0001862577474;1;2018;11/01/2018;061106084008000;"Mira Rebeka Sani";"Jl. Kesenian Blok O 1/12 Rt.016 Rw.009 Duren Sawit Jakarta Timur";90000;9000;0;0;0;0;0;0;36255
LT;061106084008000;"Mira Rebeka Sani";-;-;-;0;0;-;-;-;-;-;-
OF;SK0054;"Starter Kit Jan 2018";99000;1;99000;0;90000;9000;0;0
FK;01;0;0001862577476;1;2018;11/01/2018;059461533732001;"Ir.HJ.Hayatun Fardah";"Jl. Garuda No.81 
Kel. Komet Kec. Banjar Baru Utara Kab Banjarbaru -  Kalimantan Selatan
";9360055;936004;0;0;0;0;0;0;36257
LT;059461533732001;"Ir.HJ.Hayatun Fardah";-;-;-;0;0;-;-;-;-;-;-
OF;NT020001;Legres;125020;15;1875300;0;1704818;170482;0;0
OF;SL0002;"Calorease 30s (1 Box)";158860;10;1588600;0;1444182;144418;0;0
OF;PP0244;"Magozai 375ml Promo (Buy 3 Get 1)";343100;6;2058600;0;1871455;187145;0;0
OF;PP080124;"Magozai Promo (Buy 3 Get 1)";562120;6;3372720;0;3066109;306611;0;0
OF;PP0245;"U-Claire BI2 Set Promo Disc 40%";485040;1;485040;0;440945;44094;0;0
OF;MT0158;"Catalog Vol.1 th 2018";6900;12;82800;0;75273;7527;0;0
OF;PP0254;"TOP UP Loyalty 2 Calcium with Vit. D";49000;17;833000;0;757273;75727;0;0
FK;01;0;0001862577482;1;2018;11/01/2018;059461533732001;"Ir.HJ.Hayatun Fardah";"Jl. Garuda No.81 
Kel. Komet Kec. Banjar Baru Utara Kab Banjarbaru -  Kalimantan Selatan
";1335809;133581;0;0;0;0;0;0;36261
LT;059461533732001;"Ir.HJ.Hayatun Fardah";-;-;-;0;0;-;-;-;-;-;-
OF;NT020003;"Magozai 750ml";562120;1;562120;0;511018;51102;0;0
OF;PP0250;"Magozai Fruity Promo Disc 25%";240640;2;481280;0;437527;43753;0;0
OF;PP0243;"HF Joint Booster 60s Promo +89rb Dapat 2";425990;1;425990;0;387264;38726;0;0
FK;01;0;0001862577494;1;2018;12/01/2018;698090388822000;"Lutfia Y.K. Nasib Alamri, SE";"DISNAKERTRANS PROP. GORONTALO / JL AGUS SALIM RT 001 RW 001 DULALOWO KEC KOTA TENGAH KOTA GORONTALO";18314435;1831444;0;0;0;0;0;0;36272
LT;698090388822000;"Lutfia Y.K. Nasib Alamri, SE";-;-;-;0;0;-;-;-;-;-;-
OF;PP0241;"Curcomplex-95 Promo +89rb Dapat Magozai 375ml";629500;3;1888500;0;1716818;171682;0;0
OF;PP080124;"Magozai Promo (Buy 3 Get 1)";562120;24;13490880;0;12264436;1226444;0;0
OF;PP0250;"Magozai Fruity Promo Disc 25%";240640;10;2406400;0;2187636;218764;0;0
OF;PP0237;"Asta-Gen (Buy 3 Get 1)";253800;9;2284200;0;2076545;207654;0;0
OF;MT0158;"Catalog Vol.1 th 2018";6900;11;75900;0;69000;6900;0;0
FK;01;0;0001862577520;1;2018;13/01/2018;061106084008000;"Mira Rebeka Sani";"Jl. Kesenian Blok O 1/12 Rt.016 Rw.009 Duren Sawit Jakarta Timur";1144545;114454;0;0;0;0;0;0;36296
LT;061106084008000;"Mira Rebeka Sani";-;-;-;0;0;-;-;-;-;-;-
OF;PP0241;"Curcomplex-95 Promo +89rb Dapat Magozai 375ml";629500;2;1259000;0;1144545;114454;0;0
FK;01;0;0001862577532;1;2018;15/01/2018;082738550831000;"Harun D. Tumbuan";"Komplek RSD Madani No.19 Kota Palu Sualwesi Tengah";22832456;2283244;0;0;0;0;0;0;36304
LT;082738550831000;"Harun D. Tumbuan";-;-;-;0;0;-;-;-;-;-;-
OF;NT020008;Biorate;246750;4;987000;0;897273;89727;0;0
OF;SL0002;"Calorease 30s (1 Box)";158860;20;3177200;0;2888364;288836;0;0
OF;MT0161;"Catalog Vol.1 th 2018 (100 pcs)";590000;1;590000;0;536364;53636;0;0
OF;PP0241;"Curcomplex-95 Promo +89rb Dapat Magozai 375ml";629500;6;3777000;0;3433636;343364;0;0
OF;HF060006;"HF Bee Propolis 30s";204920;4;819680;0;745164;74516;0;0
OF;HF060003;"HF Bee Propolis 90s";512300;4;2049200;0;1862909;186291;0;0
OF;PP0240;"HF Coformula 60s Promo +89rb Dapat Magozai 375ml";629500;4;2518000;0;2289091;228909;0;0
OF;HF060012;"HF Glucosefit";346860;6;2081160;0;1891964;189196;0;0
OF;PP0243;"HF Joint Booster 60s Promo +89rb Dapat 2";425990;2;851980;0;774527;77453;0;0
OF;HF060010;"HF Salmon Oil 90s";282000;6;1692000;0;1538182;153818;0;0
OF;NT020001;Legres;125020;8;1000160;0;909236;90924;0;0
OF;PP080124;"Magozai Promo (Buy 3 Get 1)";562120;9;5059080;0;4599164;459916;0;0
OF;NT020007;Sistocare;256620;2;513240;0;466582;46658;0;0
FK;01;0;0001862577533;1;2018;15/01/2018;082738550831000;"Harun D. Tumbuan";"Komplek RSD Madani No.19 Kota Palu Sualwesi Tengah";1533055;153305;0;0;0;0;0;0;36305
LT;082738550831000;"Harun D. Tumbuan";-;-;-;0;0;-;-;-;-;-;-
OF;PP080124;"Magozai Promo (Buy 3 Get 1)";562120;3;1686360;0;1533055;153305;0;0
FK;01;0;0001862577535;1;2018;15/01/2018;082738550831000;"Harun D. Tumbuan";"Komplek RSD Madani No.19 Kota Palu Sualwesi Tengah";445455;44545;0;0;0;0;0;0;36307
LT;082738550831000;"Harun D. Tumbuan";-;-;-;0;0;-;-;-;-;-;-
OF;PP0254;"TOP UP Loyalty 2 Calcium with Vit. D";49000;10;490000;0;445455;44545;0;0
FK;01;0;0001862577536;1;2018;15/01/2018;061106084008000;"Mira Rebeka Sani";"Jl. Kesenian Blok O 1/12 Rt.016 Rw.009 Duren Sawit Jakarta Timur";44545;4454;0;0;0;0;0;0;36308
LT;061106084008000;"Mira Rebeka Sani";-;-;-;0;0;-;-;-;-;-;-
OF;PP0254;"TOP UP Loyalty 2 Calcium with Vit. D";49000;1;49000;0;44545;4454;0;0
FK;01;0;0001862577548;1;2018;15/01/2018;594682387037000;"Zainal Arifin.";"Jl. Thalib II No.5 Krukut - Tamansari Jakarta Barat";405209;40521;0;0;0;0;0;0;36317
LT;594682387037000;"Zainal Arifin.";-;-;-;0;0;-;-;-;-;-;-
OF;PP0246;"U-Claire Day&Night; Cream Promo +89rb Dapat 2";445730;1;445730;0;405209;40521;0;0
FK;01;0;0001862577557;1;2018;15/01/2018;674087382114000;"IDA FENNY ELYSA";"JL. DEBLOD SUNDORO NO. 41 LK. II";24385492;2438547;0;0;0;0;0;0;36323
LT;674087382114000;"IDA FENNY ELYSA";-;-;-;0;0;-;-;-;-;-;-
OF;PP0237;"Asta-Gen (Buy 3 Get 1)";253800;9;2284200;0;2076545;207654;0;0
OF;PP0239;"Calway-C Jr Promo +89rb Dapat 2";332460;3;997380;0;906709;90671;0;0
OF;PP0241;"Curcomplex-95 Promo +89rb Dapat Magozai 375ml";629500;8;5036000;0;4578182;457818;0;0
OF;HF060003;"HF Bee Propolis 90s";512300;2;1024600;0;931455;93145;0;0
OF;HF060007;"HF Bee Propolis Liquid";280120;4;1120480;0;1018618;101862;0;0
OF;PP0240;"HF Coformula 60s Promo +89rb Dapat Magozai 375ml";629500;4;2518000;0;2289091;228909;0;0
OF;HF060010;"HF Salmon Oil 90s";282000;6;1692000;0;1538182;153818;0;0
OF;NT020001;Legres;125020;30;3750600;0;3409636;340964;0;0
OF;PP0244;"Magozai 375ml Promo (Buy 3 Get 1)";343100;6;2058600;0;1871455;187145;0;0
OF;PP080124;"Magozai Promo (Buy 3 Get 1)";562120;9;5059080;0;4599164;459916;0;0
OF;NT020007;Sistocare;256620;5;1283100;0;1166455;116645;0;0
FK;01;0;0001862577559;1;2018;15/01/2018;674087382114000;"IDA FENNY ELYSA";"JL. DEBLOD SUNDORO NO. 41 LK. II";1202727;120273;0;0;0;0;0;0;36325
LT;674087382114000;"IDA FENNY ELYSA";-;-;-;0;0;-;-;-;-;-;-
OF;PP0254;"TOP UP Loyalty 2 Calcium with Vit. D";49000;27;1323000;0;1202727;120273;0;0
FK;01;0;0001862577566;1;2018;15/01/2018;594682387037000;"Zainal Arifin.";"Jl. Thalib II No.5 Krukut - Tamansari Jakarta Barat";2480782;248078;0;0;0;0;0;0;36332
LT;594682387037000;"Zainal Arifin.";-;-;-;0;0;-;-;-;-;-;-
OF;HF060007;"HF Bee Propolis Liquid";280120;3;840360;0;763964;76396;0;0
OF;PP0240;"HF Coformula 60s Promo +89rb Dapat Magozai 375ml";629500;3;1888500;0;1716818;171682;0;0
FK;01;0;0001862577570;1;2018;15/01/2018;478640824626000;"Anang Purwito";"Jl.SLAMET RIYADI GANG CENTRAL KAV 7 JEMBER 68112";1630363;163035;0;0;0;0;0;0;36336
LT;478640824626000;"Anang Purwito";-;-;-;0;0;-;-;-;-;-;-
OF;NT0022;"Calcium with Vitamin D";280280;1;280280;0;254800;25480;0;0
OF;NT020001;Legres;130340;3;391020;0;355473;35547;0;0
OF;PP0254;"TOP UP Loyalty 2 Calcium with Vit. D";49000;1;49000;0;44545;4454;0;0
OF;PP0244;"Magozai 375ml Promo (Buy 3 Get 1)";357700;3;1073100;0;975545;97554;0;0
FK;01;0;0001862577606;1;2018;17/01/2018;145772877711000;"Yesoa Amd.Pd";"Jl. Pangkalima Kapang, Anjir Kalampan KM 1200 Rt. 002 No. 07 Kapuas Kalimantan Tengah 73552";7513437;751343;0;0;0;0;0;0;36367
LT;145772877711000;"Yesoa Amd.Pd";-;-;-;0;0;-;-;-;-;-;-
OF;PP080124;"Magozai Promo (Buy 3 Get 1)";562120;9;5059080;0;4599164;459916;0;0
OF;HF060010;"HF Salmon Oil 90s";282000;1;282000;0;256364;25636;0;0
OF;NT020001;Legres;125020;3;375060;0;340964;34096;0;0
OF;NT020007;Sistocare;256620;3;769860;0;699873;69987;0;0
OF;NT020009;Gravica;246750;2;493500;0;448636;44864;0;0
OF;PP0250;"Magozai Fruity Promo Disc 25%";240640;2;481280;0;437527;43753;0;0
OF;PP0254;"TOP UP Loyalty 2 Calcium with Vit. D";49000;2;98000;0;89091;8909;0;0
OF;SK0054;"Starter Kit Jan 2018";99000;4;396000;0;360000;36000;0;0
OF;MT0160;"Catalog Vol.1 th 2018 (50 pcs)";310000;1;310000;0;281818;28182;0;0
FK;01;0;0001862577616;1;2018;17/01/2018;061106084008000;"Mira Rebeka Sani";"Jl. Kesenian Blok O 1/12 Rt.016 Rw.009 Duren Sawit Jakarta Timur";101636;10163;0;0;0;0;0;0;36376
LT;061106084008000;"Mira Rebeka Sani";-;-;-;0;0;-;-;-;-;-;-
OF;PP0254;"TOP UP Loyalty 2 Calcium with Vit. D";49000;2;98000;0;89091;8909;0;0
OF;MT0158;"Catalog Vol.1 th 2018";6900;2;13800;0;12545;1254;0;0
FK;01;0;0001862577625;1;2018;17/01/2018;594682387037000;"Zainal Arifin.";"Jl. Thalib II No.5 Krukut - Tamansari Jakarta Barat";572273;57227;0;0;0;0;0;0;36384
LT;594682387037000;"Zainal Arifin.";-;-;-;0;0;-;-;-;-;-;-
OF;PP0240;"HF Coformula 60s Promo +89rb Dapat Magozai 375ml";629500;1;629500;0;572273;57227;0;0
FK;01;0;0001862577634;1;2018;17/01/2018;594682387037000;"Zainal Arifin.";"Jl. Thalib II No.5 Krukut - Tamansari Jakarta Barat";254655;25465;0;0;0;0;0;0;36390
LT;594682387037000;"Zainal Arifin.";-;-;-;0;0;-;-;-;-;-;-
OF;HF060007;"HF Bee Propolis Liquid";280120;1;280120;0;254655;25465;0;0
FK;01;0;0001862577683;1;2018;19/01/2018;061106084008000;"Mira Rebeka Sani";"Jl. Kesenian Blok O 1/12 Rt.016 Rw.009 Duren Sawit Jakarta Timur";881328;88132;0;0;0;0;0;0;36423
LT;061106084008000;"Mira Rebeka Sani";-;-;-;0;0;-;-;-;-;-;-
OF;PP0250;"Magozai Fruity Promo Disc 25%";240640;4;962560;0;875055;87505;0;0
OF;MT0158;"Catalog Vol.1 th 2018";6900;1;6900;0;6273;627;0;0
FK;01;0;0001862577699;1;2018;19/01/2018;672354446619000;"Surjana Dewi Effendy";"JL. Manyar Tirtoyoso Selatan 4 no. 11 RT 007 RW 005 Manyarsabrangan Mulyorejo surabaya";2407973;240797;0;0;0;0;0;0;36437
LT;672354446619000;"Surjana Dewi Effendy";-;-;-;0;0;-;-;-;-;-;-
OF;NT020019;"Renewskin 30";216670;1;216670;0;196973;19697;0;0
OF;PP0245;"U-Claire BI2 Set Promo Disc 40%";485040;5;2425200;0;2204727;220473;0;0
OF;MT0158;"Catalog Vol.1 th 2018";6900;1;6900;0;6273;627;0;0
FK;01;0;0001862577761;1;2018;22/01/2018;073245110047000;"Inneke Kusumo";"Jl.Pluit sakti raya no.143 Rt:09 Rw:07 Pluit Penjaringan Jakarta Utara";1637182;163718;0;0;0;0;0;0;271615
LT;073245110047000;"Inneke Kusumo";-;-;-;0;0;-;-;-;-;-;-
OF;PP080124;"Magozai Promo (Buy 3 Get 1)";598000;3;1794000;0;1630909;163091;0;0
OF;MT0158;"Catalog Vol.1 th 2018";6900;1;6900;0;6273;627;0;0
FK;01;0;0001862577863;1;2018;25/01/2018;082738550831000;"Harun D. Tumbuan";"Komplek RSD Madani No.19 Kota Palu Sualwesi Tengah";11170073;1117006;0;0;0;0;0;0;36571
LT;082738550831000;"Harun D. Tumbuan";-;-;-;0;0;-;-;-;-;-;-
OF;PP0237;"Asta-Gen (Buy 3 Get 1)";253800;3;761400;0;692182;69218;0;0
OF;PP0188;"Care for Cancer Plus Promo (Gratis Magozai 750 ml)";1349370;2;2698740;0;2453400;245340;0;0
OF;PP0177;"Cerebro Health Promo (Gratis Magozai 750 ml)";1357360;1;1357360;0;1233964;123396;0;0
OF;PP0247;"Diabetic Pack Promo Gratis Glucosefit";1137400;1;1137400;0;1034000;103400;0;0
OF;NT020006;"Echina-C Plus";154160;2;308320;0;280291;28029;0;0
OF;HF060003;"HF Bee Propolis 90s";512300;2;1024600;0;931455;93145;0;0
OF;PP0240;"HF Coformula 60s Promo +89rb Dapat Magozai 375ml";629500;2;1259000;0;1144545;114454;0;0
OF;HF060010;"HF Salmon Oil 90s";282000;5;1410000;0;1281818;128182;0;0
OF;NT020001;Legres;125020;7;875140;0;795582;79558;0;0
OF;PP0245;"U-Claire BI2 Set Promo Disc 40%";485040;3;1455120;0;1322836;132284;0;0
FK;01;0;0001862577875;1;2018;25/01/2018;082738550831000;"Harun D. Tumbuan";"Komplek RSD Madani No.19 Kota Palu Sualwesi Tengah";1232182;123218;0;0;0;0;0;0;36582
LT;082738550831000;"Harun D. Tumbuan";-;-;-;0;0;-;-;-;-;-;-
OF;SK0054;"Starter Kit Jan 2018";99000;6;594000;0;540000;54000;0;0
OF;PP0237;"Asta-Gen (Buy 3 Get 1)";253800;3;761400;0;692182;69218;0;0
FK;01;0;0001862577879;1;2018;25/01/2018;579473596823000;"Supantia Saleh";"Jl. Bitung Tengah RT.010 Rw.004. Bitung Tengah - Maesa Bitung";281818;28182;0;0;0;0;0;0;36584
LT;579473596823000;"Supantia Saleh";-;-;-;0;0;-;-;-;-;-;-
OF;MT0160;"Catalog Vol.1 th 2018 (50 pcs)";310000;1;310000;0;281818;28182;0;0
FK;01;0;0001862577928;1;2018;27/01/2018;594682387037000;"Zainal Arifin.";"Jl. Thalib II No.5 Krukut - Tamansari Jakarta Barat";2992618;299261;0;0;0;0;0;0;36622
LT;594682387037000;"Zainal Arifin.";-;-;-;0;0;-;-;-;-;-;-
OF;HF060007;"HF Bee Propolis Liquid";280120;4;1120480;0;1018618;101862;0;0
OF;PP0245;"U-Claire BI2 Set Promo Disc 40%";485040;1;485040;0;440945;44094;0;0
OF;PP080124;"Magozai Promo (Buy 3 Get 1)";562120;3;1686360;0;1533055;153305;0;0
FK;01;0;0001862577930;1;2018;27/01/2018;061106084008000;"Mira Rebeka Sani";"Jl. Kesenian Blok O 1/12 Rt.016 Rw.009 Duren Sawit Jakarta Timur";5351164;535115;0;0;0;0;0;0;36624
LT;061106084008000;"Mira Rebeka Sani";-;-;-;0;0;-;-;-;-;-;-
OF;PP080124;"Magozai Promo (Buy 3 Get 1)";562120;9;5059080;0;4599164;459916;0;0
OF;PP0245;"U-Claire BI2 Set Promo Disc 40%";485040;1;485040;0;440945;44094;0;0
OF;SK0054;"Starter Kit Jan 2018";99000;1;99000;0;90000;9000;0;0
OF;PP0242;"Echina-C Plus Promo +89rb Dapat 2";243160;1;243160;0;221055;22105;0;0
FK;01;0;0001862577957;1;2018;29/01/2018;082738550831000;"Harun D. Tumbuan";"Komplek RSD Madani No.19 Kota Palu Sualwesi Tengah";4098163;409815;0;0;0;0;0;0;36642
LT;082738550831000;"Harun D. Tumbuan";-;-;-;0;0;-;-;-;-;-;-
OF;PP0241;"Curcomplex-95 Promo +89rb Dapat Magozai 375ml";629500;2;1259000;0;1144545;114454;0;0
OF;PP0242;"Echina-C Plus Promo +89rb Dapat 2";243160;2;486320;0;442109;44211;0;0
OF;HF060007;"HF Bee Propolis Liquid";280120;3;840360;0;763964;76396;0;0
OF;NT020012;Legalon;336050;2;672100;0;611000;61100;0;0
OF;NT020001;Legres;125020;10;1250200;0;1136545;113654;0;0
FK;01;0;0001862578001;1;2018;29/01/2018;061106084008000;"Mira Rebeka Sani";"Jl. Kesenian Blok O 1/12 Rt.016 Rw.009 Duren Sawit Jakarta Timur";1533055;153305;0;0;0;0;0;0;36679
LT;061106084008000;"Mira Rebeka Sani";-;-;-;0;0;-;-;-;-;-;-
OF;PP080124;"Magozai Promo (Buy 3 Get 1)";562120;3;1686360;0;1533055;153305;0;0
FK;01;0;0001862578005;1;2018;29/01/2018;082738550831000;"Harun D. Tumbuan";"Komplek RSD Madani No.19 Kota Palu Sualwesi Tengah";90000;9000;0;0;0;0;0;0;36683
LT;082738550831000;"Harun D. Tumbuan";-;-;-;0;0;-;-;-;-;-;-
OF;SK0054;"Starter Kit Jan 2018";99000;1;99000;0;90000;9000;0;0
FK;01;0;0001862578024;1;2018;30/01/2018;594682387037000;"Zainal Arifin.";"Jl. Thalib II No.5 Krukut - Tamansari Jakarta Barat";14321091;1432109;0;0;0;0;0;0;36701
LT;594682387037000;"Zainal Arifin.";-;-;-;0;0;-;-;-;-;-;-
OF;SL0002;"Calorease 30s (1 Box)";158860;4;635440;0;577673;57767;0;0
OF;PP0239;"Calway-C Jr Promo +89rb Dapat 2";332460;3;997380;0;906709;90671;0;0
OF;PP0241;"Curcomplex-95 Promo +89rb Dapat Magozai 375ml";629500;1;629500;0;572273;57227;0;0
OF;PP080124;"Magozai Promo (Buy 3 Get 1)";562120;24;13490880;0;12264436;1226444;0;0
FK;01;0;0001862578033;1;2018;30/01/2018;674087382114000;"IDA FENNY ELYSA";"JL. DEBLOD SUNDORO NO. 41 LK. II";14620237;1462023;0;0;0;0;0;0;36709
LT;674087382114000;"IDA FENNY ELYSA";-;-;-;0;0;-;-;-;-;-;-
OF;NT020008;Biorate;246750;4;987000;0;897273;89727;0;0
OF;SL0002;"Calorease 30s (1 Box)";158860;10;1588600;0;1444182;144418;0;0
OF;HF0013;"HF Joint Booster 30s";202570;6;1215420;0;1104927;110493;0;0
OF;HF060010;"HF Salmon Oil 90s";282000;6;1692000;0;1538182;153818;0;0
OF;NT020012;Legalon;336050;2;672100;0;611000;61100;0;0
OF;NT020001;Legres;125020;25;3125500;0;2841364;284136;0;0
OF;PP0250;"Magozai Fruity Promo Disc 25%";240640;10;2406400;0;2187636;218764;0;0
OF;SK0054;"Starter Kit Jan 2018";99000;15;1485000;0;1350000;135000;0;0
OF;PP0245;"U-Claire BI2 Set Promo Disc 40%";485040;6;2910240;0;2645673;264567;0;0
FK;01;0;0001862578045;1;2018;30/01/2018;594682387037000;"Zainal Arifin.";"Jl. Thalib II No.5 Krukut - Tamansari Jakarta Barat";4599164;459916;0;0;0;0;0;0;36720
LT;594682387037000;"Zainal Arifin.";-;-;-;0;0;-;-;-;-;-;-
OF;PP080124;"Magozai Promo (Buy 3 Get 1)";562120;9;5059080;0;4599164;459916;0;0
FK;01;0;0001862578053;1;2018;30/01/2018;594682387037000;"Zainal Arifin.";"Jl. Thalib II No.5 Krukut - Tamansari Jakarta Barat";5194936;519493;0;0;0;0;0;0;36728
LT;594682387037000;"Zainal Arifin.";-;-;-;0;0;-;-;-;-;-;-
OF;PP080124;"Magozai Promo (Buy 3 Get 1)";562120;6;3372720;0;3066109;306611;0;0
OF;PP0245;"U-Claire BI2 Set Promo Disc 40%";485040;1;485040;0;440945;44094;0;0
OF;PP0197;"Anti-Aging 50+ Promo (Disc 25%)";800880;1;800880;0;728073;72807;0;0
OF;NT020013;Vegefrut;193640;2;387280;0;352073;35207;0;0
OF;NT020012;Legalon;336050;1;336050;0;305500;30550;0;0
OF;PP0239;"Calway-C Jr Promo +89rb Dapat 2";332460;1;332460;0;302236;30224;0;0
FK;01;0;0001862578057;1;2018;30/01/2018;061106084008000;"Mira Rebeka Sani";"Jl. Kesenian Blok O 1/12 Rt.016 Rw.009 Duren Sawit Jakarta Timur";1533055;153305;0;0;0;0;0;0;36732
LT;061106084008000;"Mira Rebeka Sani";-;-;-;0;0;-;-;-;-;-;-
OF;PP080124;"Magozai Promo (Buy 3 Get 1)";562120;3;1686360;0;1533055;153305;0;0
FK;01;0;0001862578139;1;2018;31/01/2018;594682387037000;"Zainal Arifin.";"Jl. Thalib II No.5 Krukut - Tamansari Jakarta Barat";4578381;457838;0;0;0;0;0;0;36802
LT;594682387037000;"Zainal Arifin.";-;-;-;0;0;-;-;-;-;-;-
OF;PP080124;"Magozai Promo (Buy 3 Get 1)";562120;6;3372720;0;3066109;306611;0;0
OF;PP0245;"U-Claire BI2 Set Promo Disc 40%";485040;1;485040;0;440945;44094;0;0
OF;HF060010;"HF Salmon Oil 90s";282000;3;846000;0;769091;76909;0;0
OF;PP0239;"Calway-C Jr Promo +89rb Dapat 2";332460;1;332460;0;302236;30224;0;0
FK;01;0;0001862578160;1;2018;31/01/2018;061106084008000;"Mira Rebeka Sani";"Jl. Kesenian Blok O 1/12 Rt.016 Rw.009 Duren Sawit Jakarta Timur";1533055;153305;0;0;0;0;0;0;36822
LT;061106084008000;"Mira Rebeka Sani";-;-;-;0;0;-;-;-;-;-;-
OF;PP080124;"Magozai Promo (Buy 3 Get 1)";562120;3;1686360;0;1533055;153305;0;0
FK;01;0;0001862578161;1;2018;31/01/2018;061106084008000;"Mira Rebeka Sani";"Jl. Kesenian Blok O 1/12 Rt.016 Rw.009 Duren Sawit Jakarta Timur";356364;35636;0;0;0;0;0;0;36823
LT;061106084008000;"Mira Rebeka Sani";-;-;-;0;0;-;-;-;-;-;-
OF;PP0254;"TOP UP Loyalty 2 Calcium with Vit. D";49000;8;392000;0;356364;35636;0;0
FK;01;0;0001862578170;1;2018;31/01/2018;594682387037000;"Zainal Arifin.";"Jl. Thalib II No.5 Krukut - Tamansari Jakarta Barat";4360917;436091;0;0;0;0;0;0;36832
LT;594682387037000;"Zainal Arifin.";-;-;-;0;0;-;-;-;-;-;-
OF;PP0245;"U-Claire BI2 Set Promo Disc 40%";533544;2;1067088;0;970080;97008;0;0
OF;PP0248;"Royal Skin Promo Disc 20%";825320;1;825320;0;750291;75029;0;0
OF;PP080124;"Magozai Promo (Buy 3 Get 1)";618520;3;1855560;0;1686873;168687;0;0
OF;SL0002;"Calorease 30s (1 Box)";174840;6;1049040;0;953673;95367;0;0
FK;01;0;0001862578188;1;2018;31/01/2018;082738550831000;"Harun D. Tumbuan";"Komplek RSD Madani No.19 Kota Palu Sualwesi Tengah";1336364;133636;0;0;0;0;0;0;36849
LT;082738550831000;"Harun D. Tumbuan";-;-;-;0;0;-;-;-;-;-;-
OF;PP0254;"TOP UP Loyalty 2 Calcium with Vit. D";49000;30;1470000;0;1336364;133636;0;0
FK;01;0;0001862578243;1;2018;31/01/2018;698090388822000;"Lutfia Y.K. Nasib Alamri, SE";"DISNAKERTRANS PROP. GORONTALO / JL AGUS SALIM RT 001 RW 001 DULALOWO KEC KOTA TENGAH KOTA GORONTALO";13637418;1363742;0;0;0;0;0;0;36903
LT;698090388822000;"Lutfia Y.K. Nasib Alamri, SE";-;-;-;0;0;-;-;-;-;-;-
OF;PP080124;"Magozai Promo (Buy 3 Get 1)";562120;12;6745440;0;6132218;613222;0;0
OF;NT020001;Legres;125020;61;7626220;0;6932927;693293;0;0
OF;PP0241;"Curcomplex-95 Promo +89rb Dapat Magozai 375ml";629500;1;629500;0;572273;57227;0;0
FK;01;0;0001862578273;1;2018;31/01/2018;082738550831000;"Harun D. Tumbuan";"Komplek RSD Madani No.19 Kota Palu Sualwesi Tengah";720000;72000;0;0;0;0;0;0;36933
LT;082738550831000;"Harun D. Tumbuan";-;-;-;0;0;-;-;-;-;-;-
OF;SK0054;"Starter Kit Jan 2018";99000;8;792000;0;720000;72000;0;0
