0SP201904090033059008 00030331               00000000460934557.0000395BCA               BONUS MEMBER000000MARET 201900000000                                                                             
13422880868                        00000000000243562.00A TENRI NOLA UPA                                                                         BONUS MEMBER      MARET 2019                          014
17685051231                        00000000006565874.00A YUDI JAYA MUSRADHY P                                                                   BONUS MEMBER      MARET 2019                          014
17920665068                        00000000000101393.00ABDUL FARIS                                                                              BONUS MEMBER      MARET 2019                          014
13880409866                        00000000000103677.00ACHMAD YUSUF DR SPKK                                                                     BONUS MEMBER      MARET 2019                          014
17910573050                        00000000001232496.00ADRYAN FRISTIOHADI MSC-A                                                                 BONUS MEMBER      MARET 2019                          014
18140224457                        00000000000052308.00AFRIAN NURCAHYO SALEH                                                                    BONUS MEMBER      MARET 2019                          014
17360166532                        00000000000727510.00AGUS RINI SULISTIOWATY                                                                   BONUS MEMBER      MARET 2019                          014
16665052579                        00000000000102044.00AGUSTINA EKA BUDI                                                                        BONUS MEMBER      MARET 2019                          014
10540962600                        00000000000236034.00ALAN DWILANGGA                                                                           BONUS MEMBER      MARET 2019                          014
18140203620                        00000000000163901.00ALBERT LENGKONG                                                                          BONUS MEMBER      MARET 2019                          014
14582204377                        00000000000663055.00ALDO LAMMY                                                                               BONUS MEMBER      MARET 2019                          014
12581605007                        00000000000216059.00ALFRYATI VENTHY SANDA SAU TAN                                                            BONUS MEMBER      MARET 2019                          014
12200053624                        00000000000107989.00AMAN YULIUS                                                                              BONUS MEMBER      MARET 2019                          014
12851104242                        00000000000342260.00AMIN SUMA                                                                                BONUS MEMBER      MARET 2019                          014
16265019343                        00000000000050290.00ANA SUSILOWATI SE                                                                        BONUS MEMBER      MARET 2019                          014
18160188708                        00000000000050290.00ANASTASIA PRASASTI ANGGRAINI                                                             BONUS MEMBER      MARET 2019                          014
16720438061                        00000000000051260.00ANASTASIA VANIA SEPUTRA                                                                  BONUS MEMBER      MARET 2019                          014
17890745534                        00000000000217184.00ANDI FAUZIAH                                                                             BONUS MEMBER      MARET 2019                          014
10270948880                        00000000000052472.00ANDRE ABENG                                                                              BONUS MEMBER      MARET 2019                          014
11821922238                        00000000000233862.00ANG MARINA ARYATI S                                                                      BONUS MEMBER      MARET 2019                          014
17910710600                        00000000000206460.00ANGELA WILDA GEODELITA ZALUCHU                                                           BONUS MEMBER      MARET 2019                          014
18690593301                        00000000000152140.00ANITA JAMALUDIN SE                                                                       BONUS MEMBER      MARET 2019                          014
10940643180                        00000000000150200.00ANNA LUCKY MERIDIANA Z, ST                                                               BONUS MEMBER      MARET 2019                          014
16720068379                        00000000000221010.00ANNA TRISULA AL LO TJIOE                                                                 BONUS MEMBER      MARET 2019                          014
10320912555                        00000000000202580.00ANTONY FIRGO IR                                                                          BONUS MEMBER      MARET 2019                          014
18295031677                        00000000000310182.00ARTHER SONLY LEMBONG                                                                     BONUS MEMBER      MARET 2019                          014
17870484423                        00000000000052634.00ASMANI                                                                                   BONUS MEMBER      MARET 2019                          014
11773086592                        00000000000163536.00BABANG SOETRISNO                                                                         BONUS MEMBER      MARET 2019                          014
13909519772                        00000000000300650.00BASRI                                                                                    BONUS MEMBER      MARET 2019                          014
16730262564                        00000000000111400.00BASUKI SISWANTA                                                                          BONUS MEMBER      MARET 2019                          014
12671571195                        00000000000051502.00BAYU ADHI KURNIAWAN                                                                      BONUS MEMBER      MARET 2019                          014
15660270860                        00000000000063186.00BERNADETHA MARIES PRANAN                                                                 BONUS MEMBER      MARET 2019                          014
10292392931                        00000000000283258.00BOYDO IMMANUEL SARAGIH                                                                   BONUS MEMBER      MARET 2019                          014
15060095398                        00000000000163539.00BUDHY SUTANTO.IR                                                                         BONUS MEMBER      MARET 2019                          014
14641121589                        00000000000103640.00BUDI HARTONO                                                                             BONUS MEMBER      MARET 2019                          014
14212295292                        00000000000308820.00BUDI RAHARDJO                                                                            BONUS MEMBER      MARET 2019                          014
10103448899                        00000000000223338.00CALVIN ALEXANDER EFANS J                                                                 BONUS MEMBER      MARET 2019                          014
10095158779                        00000000000053200.00CATHARINA ARIANI WAHYUNINGSIH                                                            BONUS MEMBER      MARET 2019                          014
13691033021                        00000000002334276.00CHARLIE BUDIMAN SH                                                                       BONUS MEMBER      MARET 2019                          014
14710032497                        00000000003175295.00CHARLOTHA PUTRI SHARON                                                                   BONUS MEMBER      MARET 2019                          014
10262469075                        00000000000215110.00CHINTYA SALU                                                                             BONUS MEMBER      MARET 2019                          014
10690308983                        00000000000053200.00CHRISELDA TANTRA                                                                         BONUS MEMBER      MARET 2019                          014
11700200953                        00000000000256912.00CHRISTIE MONINGKEY                                                                       BONUS MEMBER      MARET 2019                          014
11192151575                        00000000000072600.00CINDRA WATI JAP                                                                          BONUS MEMBER      MARET 2019                          014
12211205123                        00000000000092000.00CITRA HALIM                                                                              BONUS MEMBER      MARET 2019                          014
16800040017                        00000000000108248.00CONNY R TOMBOKAN                                                                         BONUS MEMBER      MARET 2019                          014
12540095739                        00000000000161934.00CORINA LUCHAS                                                                            BONUS MEMBER      MARET 2019                          014
18050030734                        00000000000222226.00CORNELIA CHANDRA BSC                                                                     BONUS MEMBER      MARET 2019                          014
11710941510                        00000000000564985.00CORNELLYA KANDARY                                                                        BONUS MEMBER      MARET 2019                          014
16270081434                        00000000000101685.00CURDI SOPANDI                                                                            BONUS MEMBER      MARET 2019                          014
10430970968                        00000000002673861.00CUT ZAKIA PUTRI FANDANI                                                                  BONUS MEMBER      MARET 2019                          014
17895400173                        00000000000313713.00CYINTIA DEVI ARINDA PUTRI                                                                BONUS MEMBER      MARET 2019                          014
11910414859                        00000000000050048.00D MARLANELLY P. N. NERWAN ST. MT                                                         BONUS MEMBER      MARET 2019                          014
18585131683                        00000000001199958.00DAMARIS TIKU                                                                             BONUS MEMBER      MARET 2019                          014
13451721435                        00000000000053200.00DAMAYANTI                                                                                BONUS MEMBER      MARET 2019                          014
11630357205                        00000000000792788.00DARMAWAN TEDJA                                                                           BONUS MEMBER      MARET 2019                          014
17920315482                        00000000000889698.00DARUSMAN M LAMANGKAU SE                                                                  BONUS MEMBER      MARET 2019                          014
12710645542                        00000000000053200.00DEASY FIRDANINGSIH                                                                       BONUS MEMBER      MARET 2019                          014
17935339907                        00000000000071845.00DEBI HOTMARIA SILALAHI                                                                   BONUS MEMBER      MARET 2019                          014
17025018966                        00000000000053200.00DELLY MULIARIADI                                                                         BONUS MEMBER      MARET 2019                          014
11192097287                        00000000012423479.00DELVIRA                                                                                  BONUS MEMBER      MARET 2019                          014
15120478330                        00000000000050290.00DENNY CHRISTUPEL TUPAMAHU                                                                BONUS MEMBER      MARET 2019                          014
18205033315                        00000000001089046.00DERMAWATI TURNIP                                                                         BONUS MEMBER      MARET 2019                          014
10041619898                        00000000000255930.00DESY MARIANI                                                                             BONUS MEMBER      MARET 2019                          014
17880492262                        00000000000107618.00DEWI HESTYANA                                                                            BONUS MEMBER      MARET 2019                          014
11285783614                        00000000000153505.00DHARMA SALIM                                                                             BONUS MEMBER      MARET 2019                          014
11302095897                        00000000000169600.00DIAN TJAHYARINA                                                                          BONUS MEMBER      MARET 2019                          014
17920178531                        00000000001682010.00DIONISIUS RORI PARENGKUA                                                                 BONUS MEMBER      MARET 2019                          014
16050168288                        00000000000072600.00DONIH                                                                                    BONUS MEMBER      MARET 2019                          014
10102196773                        00000000000053200.00DR ESTHER MAGDALENA RUMONDOR                                                             BONUS MEMBER      MARET 2019                          014
12150181073                        00000000000103269.00DR JOHAN PRASETYO, SP KFR                                                                BONUS MEMBER      MARET 2019                          014
10871081637                        00000000000101892.00DR RUDY SPOG                                                                             BONUS MEMBER      MARET 2019                          014
10323801476                        00000000000072600.00DR WIDYARMAN                                                                             BONUS MEMBER      MARET 2019                          014
11710163681                        00000000000072600.00DR. SAUKANI HALIM, SP.OG                                                                 BONUS MEMBER      MARET 2019                          014
10292110772                        00000000000072600.00EDISON P SARAGIH SP                                                                      BONUS MEMBER      MARET 2019                          014
13091172451                        00000000000111400.00ELKE SALIM                                                                               BONUS MEMBER      MARET 2019                          014
10021223785                        00000000000456560.00ELLYJATY SALIM                                                                           BONUS MEMBER      MARET 2019                          014
16610439592                        00000000000101588.00ELYEZER SAMPE                                                                            BONUS MEMBER      MARET 2019                          014
16041046721                        00000000000053200.00EMILY HAPPYWISE                                                                          BONUS MEMBER      MARET 2019                          014
12581563851                        00000000007452981.00EMMY INDRIATY                                                                            BONUS MEMBER      MARET 2019                          014
17830196981                        00000000000050468.00EMMYLIA SUTEDJA                                                                          BONUS MEMBER      MARET 2019                          014
12731381820                        00000000000089672.00ENDAH DWIYARTI                                                                           BONUS MEMBER      MARET 2019                          014
11230359667                        00000000000099760.00ENDANG DWI ASTUTIK                                                                       BONUS MEMBER      MARET 2019                          014
15415035435                        00000000001201885.00ENDY MUHARDIN MOEGNI DR                                                                  BONUS MEMBER      MARET 2019                          014
15065069935                        00000000002225607.00ENI SUHARTATIK                                                                           BONUS MEMBER      MARET 2019                          014
15730249294                        00000000000522935.00ERNA AGUSTIN S                                                                           BONUS MEMBER      MARET 2019                          014
15210127188                        00000000000102040.00ERNA SUKDJIOWATI                                                                         BONUS MEMBER      MARET 2019                          014
18600271122                        00000000000216730.00ESLYN R. JABAR                                                                           BONUS MEMBER      MARET 2019                          014
10281796967                        00000000000266600.00ESTER JULIATI SUSANTO                                                                    BONUS MEMBER      MARET 2019                          014
14650374903                        00000000000105629.00ESTER PAULINA KUSLOSARIR                                                                 BONUS MEMBER      MARET 2019                          014
16975522222                        00000000000072600.00ESTER SETIAWATI                                                                          BONUS MEMBER      MARET 2019                          014
16155020567                        00000000000106948.00ESTER TJENDRAWATI                                                                        BONUS MEMBER      MARET 2019                          014
10430004239                        00000000000101200.00EVARIAMI                                                                                 BONUS MEMBER      MARET 2019                          014
15050232478                        00000000000104432.00FAIZAH HAFSA                                                                             BONUS MEMBER      MARET 2019                          014
12582164542                        00000000000160870.00FEBRIAN DWI LAKSONO                                                                      BONUS MEMBER      MARET 2019                          014
10060230340                        00000000000261265.00FERDYNANDS SAMPE                                                                         BONUS MEMBER      MARET 2019                          014
10292188739                        00000000000156250.00FHOBIE CLAUDIA                                                                           BONUS MEMBER      MARET 2019                          014
17970003651                        00000000002221103.00FITRIYANTI RASYID                                                                        BONUS MEMBER      MARET 2019                          014
11601111891                        00000000000227800.00FLORENCE VALENTIA                                                                        BONUS MEMBER      MARET 2019                          014
18140330559                        00000000000055358.00FOLISTINA                                                                                BONUS MEMBER      MARET 2019                          014
10491569688                        00000000005762613.00FRANSISKUS YANNO SOERATMAN                                                               BONUS MEMBER      MARET 2019                          014
10110909039                        00000000000185585.00FREDDY SEMBIRING                                                                         BONUS MEMBER      MARET 2019                          014
18585001577                        00000000000803741.00FUJIOKO FAUNA                                                                            BONUS MEMBER      MARET 2019                          014
10255875375                        00000000002165295.00GEMA TAKBIR MUH. SURYA T, SE                                                             BONUS MEMBER      MARET 2019                          014
11710933029                        00000000000305400.00GOLDINA PRITI PINTARTI C                                                                 BONUS MEMBER      MARET 2019                          014
10108377888                        00000000000116558.00GRESCE KATALINA                                                                          BONUS MEMBER      MARET 2019                          014
12600020938                        00000000000130800.00GRETHANIE SENNA LESMANA                                                                  BONUS MEMBER      MARET 2019                          014
17245011369                        00000000000269547.00GUSTI SETIAWAN HAFID                                                                     BONUS MEMBER      MARET 2019                          014
10651929724                        00000000000072600.00H JURMANSYAH KAOEM                                                                       BONUS MEMBER      MARET 2019                          014
15610136615                        00000000000056110.00H SUBKHAN DRS                                                                            BONUS MEMBER      MARET 2019                          014
17670410468                        00000000000113237.00HALARI INSAN IHSANI                                                                      BONUS MEMBER      MARET 2019                          014
13900389212                        00000000001681292.00HAMSIAH SANGKALA                                                                         BONUS MEMBER      MARET 2019                          014
15370095665                        00000000000092000.00HANDONO RISETO                                                                           BONUS MEMBER      MARET 2019                          014
17920451742                        00000000000719561.00HANIFA                                                                                   BONUS MEMBER      MARET 2019                          014
17570037697                        00000000000458660.00HANNA KUSNADI                                                                            BONUS MEMBER      MARET 2019                          014
10262244251                        00000000000731052.00HANNA SILVANNA MANONGKO                                                                  BONUS MEMBER      MARET 2019                          014
10312348720                        00000000000051502.00HANS HANANTO ANDREAS                                                                     BONUS MEMBER      MARET 2019                          014
11451329036                        00000000000163780.00HAPPY SIRINGORINGO                                                                       BONUS MEMBER      MARET 2019                          014
17955187806                        00000000000436065.00HARDIANTI MANOPPO                                                                        BONUS MEMBER      MARET 2019                          014
10291799719                        00000000000187933.00HARI LIEWARNATA IR MM                                                                    BONUS MEMBER      MARET 2019                          014
11410453394                        00000000000053200.00HARTOYO                                                                                  BONUS MEMBER      MARET 2019                          014
17795019669                        00000000009583208.00HARUN D. TUMBUAN                                                                         BONUS MEMBER      MARET 2019                          014
15930411967                        00000000000372330.00HASAN                                                                                    BONUS MEMBER      MARET 2019                          014
17870016845                        00000000000538812.00HASNAH                                                                                   BONUS MEMBER      MARET 2019                          014
17685089955                        00000000001622477.00HASNIH S                                                                                 BONUS MEMBER      MARET 2019                          014
18320091552                        00000000000100730.00HELEN ALPRIDA LIMBONG                                                                    BONUS MEMBER      MARET 2019                          014
10272616980                        00000000000104852.00HELEN TANSIL                                                                             BONUS MEMBER      MARET 2019                          014
10281733167                        00000000000084094.00HELENA WIDJAJA                                                                           BONUS MEMBER      MARET 2019                          014
10210293884                        00000000000537278.00HENDARTO SANTOSO                                                                         BONUS MEMBER      MARET 2019                          014
16830502546                        00000000000283430.00HENNY                                                                                    BONUS MEMBER      MARET 2019                          014
15110144468                        00000000002112382.00HENNY JUARIA                                                                             BONUS MEMBER      MARET 2019                          014
16140200440                        00000000000050872.00HENNY PUSPAWATI SE                                                                       BONUS MEMBER      MARET 2019                          014
15830269039                        00000000000102739.00HENNY SANTOSO                                                                            BONUS MEMBER      MARET 2019                          014
17925295591                        00000000000060718.00HENNY SUSANTI                                                                            BONUS MEMBER      MARET 2019                          014
12930371222                        00000000000053200.00HENSILYANA BERTHY ST                                                                     BONUS MEMBER      MARET 2019                          014
14720195645                        00000000000102360.00HENY IRAWATI                                                                             BONUS MEMBER      MARET 2019                          014
18585064722                        00000000000129345.00HERIYANE YANCAR ARUS                                                                     BONUS MEMBER      MARET 2019                          014
10880652192                        00000000001346203.00HERLIN YUNARA                                                                            BONUS MEMBER      MARET 2019                          014
13650261258                        00000000000225901.00HERLINA H.                                                                               BONUS MEMBER      MARET 2019                          014
17155046929                        00000000000053200.00HERMAHNIAR P                                                                             BONUS MEMBER      MARET 2019                          014
12903845619                        00000000000100901.00HERMAN AMIL S HUT                                                                        BONUS MEMBER      MARET 2019                          014
10650239687                        00000000000053200.00HERU SARWONO                                                                             BONUS MEMBER      MARET 2019                          014
17920383445                        00000000000103508.00HJ MAYA MALANIA NOOR-IR-                                                                 BONUS MEMBER      MARET 2019                          014
15790142553                        00000000000122118.00HJ. ANDI NURUL ASKIN, SH, MH                                                             BONUS MEMBER      MARET 2019                          014
17160038327                        00000000001349471.00HJ. NETTY NASIR                                                                          BONUS MEMBER      MARET 2019                          014
10210694960                        00000000000273438.00HUDIJAH                                                                                  BONUS MEMBER      MARET 2019                          014
10291362418                        00000000011634769.00IMACULATA KORNIA                                                                         BONUS MEMBER      MARET 2019                          014
11990862482                        00000000000080966.00IMELDA LILYANA LOLON                                                                     BONUS MEMBER      MARET 2019                          014
10870989547                        00000000000562008.00IMRAN                                                                                    BONUS MEMBER      MARET 2019                          014
12460330001                        00000000001595840.00INAVIANTI WINARTO                                                                        BONUS MEMBER      MARET 2019                          014
12560098696                        00000000000552613.00INDAH CITRA DEWI SUCITRO                                                                 BONUS MEMBER      MARET 2019                          014
14540284551                        00000000000050290.00INDANIARTI RAMBU                                                                         BONUS MEMBER      MARET 2019                          014
13890358038                        00000000000100992.00INDIRA YANA SRI DARMA PUTRA                                                              BONUS MEMBER      MARET 2019                          014
15880209959                        00000000018500232.00INDRIYATI SALIM                                                                          BONUS MEMBER      MARET 2019                          014
10050412822                        00000000000099760.00INE DEWI ANDRIANI                                                                        BONUS MEMBER      MARET 2019                          014
14260366811                        00000000000620174.00INGE H S / THEO A D                                                                      BONUS MEMBER      MARET 2019                          014
12440015231                        00000000000073000.00INNEKE KUSUMO                                                                            BONUS MEMBER      MARET 2019                          014
16380003447                        00000000000145900.00IR. SOEBIJANTO TRIWIBOWO                                                                 BONUS MEMBER      MARET 2019                          014
11340719227                        00000000000105580.00IRAWAN                                                                                   BONUS MEMBER      MARET 2019                          014
15270747762                        00000000000074140.00IRENE KARYADI                                                                            BONUS MEMBER      MARET 2019                          014
14643157040                        00000000000165155.00IRUM SPRM DR                                                                             BONUS MEMBER      MARET 2019                          014
16465093840                        00000000000270432.00IRWAN HARIYADI                                                                           BONUS MEMBER      MARET 2019                          014
18630026653                        00000000000061332.00IVANA WIJAYA                                                                             BONUS MEMBER      MARET 2019                          014
15000013562                        00000000000423340.00JANTI NGADIMAN                                                                           BONUS MEMBER      MARET 2019                          014
10030200101                        00000000000398360.00JANTI W                                                                                  BONUS MEMBER      MARET 2019                          014
10181090234                        00000000016592886.00JOHANES PUTRA MAYNINEDO                                                                  BONUS MEMBER      MARET 2019                          014
12670094408                        00000000000117767.00JOHANNA FRANSISCA MAILO\`OL                                                              BONUS MEMBER      MARET 2019                          014
11191496111                        00000000000102120.00JON TOMI                                                                                 BONUS MEMBER      MARET 2019                          014
11781176392                        00000000002145548.00JOUSJE ADAM                                                                              BONUS MEMBER      MARET 2019                          014
16600278027                        00000000000072600.00JOVITA KARTIKASARI                                                                       BONUS MEMBER      MARET 2019                          014
11681694248                        00000000000627677.00JUANITA ICHSANI                                                                          BONUS MEMBER      MARET 2019                          014
10010554322                        00000000000072600.00JUKILAWATI                                                                               BONUS MEMBER      MARET 2019                          014
12411120211                        00000000000119463.00JULIANA                                                                                  BONUS MEMBER      MARET 2019                          014
10016099168                        00000000000111400.00JULIANA TJONDRO                                                                          BONUS MEMBER      MARET 2019                          014
10870842562                        00000000000162844.00JUNI PANTJAWATI SUTANTO                                                                  BONUS MEMBER      MARET 2019                          014
10885727030                        00000000000443029.00KALEB YEREMIA YUNIOR KOR                                                                 BONUS MEMBER      MARET 2019                          014
15125109711                        00000000000283084.00KARTILAH                                                                                 BONUS MEMBER      MARET 2019                          014
14970573513                        00000000000152566.00KIEMI MANALU                                                                             BONUS MEMBER      MARET 2019                          014
12620007202                        00000000000305400.00KIKIE HARDI                                                                              BONUS MEMBER      MARET 2019                          014
12211227763                        00000000000320435.00KONNI M TAMBUNAN                                                                         BONUS MEMBER      MARET 2019                          014
17855044188                        00000000000152140.00KRISTIN SUSILOWATI IKWAN                                                                 BONUS MEMBER      MARET 2019                          014
10400668710                        00000000000189000.00KUMALA WIDODO                                                                            BONUS MEMBER      MARET 2019                          014
17540409956                        00000000000208400.00LEONY JOSNITA HANDJAJA                                                                   BONUS MEMBER      MARET 2019                          014
13971165357                        00000000000227800.00LIAN BIE HUI                                                                             BONUS MEMBER      MARET 2019                          014
12871470865                        00000000000072600.00LIAN BIE KIEM                                                                            BONUS MEMBER      MARET 2019                          014
15060026981                        00000000000499663.00LIE AY HWA                                                                               BONUS MEMBER      MARET 2019                          014
10090888919                        00000000000229740.00LIEM ENG MEI                                                                             BONUS MEMBER      MARET 2019                          014
11710479824                        00000000000162033.00LILIK YUNIATI                                                                            BONUS MEMBER      MARET 2019                          014
12762222222                        00000000007154276.00LILY NGADIMAN                                                                            BONUS MEMBER      MARET 2019                          014
10420199104                        00000000000102960.00LIM KIM LIEN                                                                             BONUS MEMBER      MARET 2019                          014
17820060894                        00000000000125550.00LINAWATI SH                                                                              BONUS MEMBER      MARET 2019                          014
17795143955                        00000000000733020.00LINDA                                                                                    BONUS MEMBER      MARET 2019                          014
11990853688                        00000000000102511.00LINDA PATRISTIANI                                                                        BONUS MEMBER      MARET 2019                          014
10490010009                        00000000000053200.00LINDA PUSPA DEWI                                                                         BONUS MEMBER      MARET 2019                          014
17830557878                        00000000000072600.00LIONG SIOE GIE                                                                           BONUS MEMBER      MARET 2019                          014
10281828478                        00000000000066612.00LOLITA PATRICIA CHANDRA                                                                  BONUS MEMBER      MARET 2019                          014
17570069858                        00000000000072600.00LOUISA SUSIANA HAKIM                                                                     BONUS MEMBER      MARET 2019                          014
16750173762                        00000000000051502.00LUSI SUSILO                                                                              BONUS MEMBER      MARET 2019                          014
16280639999                        00000000000134971.00LUSIA RUDIHASWORO                                                                        BONUS MEMBER      MARET 2019                          014
17975271188                        00000000000097162.00LUTFIA Y. K. NASIB ALAMR                                                                 BONUS MEMBER      MARET 2019                          014
18620235661                        00000000000558003.00LYDIANA DEWI EFFENDY                                                                     BONUS MEMBER      MARET 2019                          014
16252763836                        00000000000211936.00M JABIDI YUSUF                                                                           BONUS MEMBER      MARET 2019                          014
18160408007                        00000000000403284.00MAGDALANI SANTOSO                                                                        BONUS MEMBER      MARET 2019                          014
14281621569                        00000000000516860.00MAGDALENA KUSNADI                                                                        BONUS MEMBER      MARET 2019                          014
11410251236                        00000000000156257.00MAGDALENA NANIK S                                                                        BONUS MEMBER      MARET 2019                          014
18190339344                        00000000000652708.00MANUELLA ARTAWATY PURBA                                                                  BONUS MEMBER      MARET 2019                          014
15680526020                        00000000000212711.00MARGARETA MARIA                                                                          BONUS MEMBER      MARET 2019                          014
12851153031                        00000000000314130.00MARGARETH STEFANNY WINAT                                                                 BONUS MEMBER      MARET 2019                          014
10260829971                        00000000005637276.00MARIA BEATRIX LUNTUNGAN                                                                  BONUS MEMBER      MARET 2019                          014
10251360129                        00000000000051502.00MARIA ROSALINA TANNUS                                                                    BONUS MEMBER      MARET 2019                          014
10031555999                        00000000000362751.00MARIO RENDY NGADIMAN                                                                     BONUS MEMBER      MARET 2019                          014
10292155075                        00000000001150318.00MARISA CAROLINA TEDJA                                                                    BONUS MEMBER      MARET 2019                          014
14650268356                        00000000049115458.00MARSUDI                                                                                  BONUS MEMBER      MARET 2019                          014
11520325049                        00000000001114260.00MARTHEN CAREL KORWA                                                                      BONUS MEMBER      MARET 2019                          014
16705015990                        00000000000156602.00MARTINA TJITRADY                                                                         BONUS MEMBER      MARET 2019                          014
16610493350                        00000000000154759.00MARTINUS B. PALAMBA                                                                      BONUS MEMBER      MARET 2019                          014
17795044337                        00000000000665983.00MARWAN AMIR                                                                              BONUS MEMBER      MARET 2019                          014
14870038254                        00000000000072600.00MARYANA                                                                                  BONUS MEMBER      MARET 2019                          014
11910801674                        00000000000072600.00MAX LEVI BOHAM                                                                           BONUS MEMBER      MARET 2019                          014
10640167297                        00000000001701393.00MEDYAWATI LIMANTARA DRG                                                                  BONUS MEMBER      MARET 2019                          014
17019193739                        00000000000301270.00MEGAWATY KAMIR SE                                                                        BONUS MEMBER      MARET 2019                          014
16225011140                        00000000000244145.00MEIDARI UTAMI                                                                            BONUS MEMBER      MARET 2019                          014
17955008405                        00000000000396371.00MEITY S PAAT                                                                             BONUS MEMBER      MARET 2019                          014
17160069281                        00000000009318958.00MELAWATY ABYANI                                                                          BONUS MEMBER      MARET 2019                          014
10884820207                        00000000001436228.00MELYSA YULIANA                                                                           BONUS MEMBER      MARET 2019                          014
14411287399                        00000000000101506.00MERIAM SELONITA SAMBO                                                                    BONUS MEMBER      MARET 2019                          014
11510310442                        00000000000051502.00MERIYANTI                                                                                BONUS MEMBER      MARET 2019                          014
10210293175                        00000000000483928.00METRY WIDJAJA KOHAR                                                                      BONUS MEMBER      MARET 2019                          014
13053007500                        00000000002345495.00MEYLIA                                                                                   BONUS MEMBER      MARET 2019                          014
12741034559                        00000000004865672.00MIRA REBEKA SANI                                                                         BONUS MEMBER      MARET 2019                          014
12308061090                        00000000001606494.00MIRNA SAMPE                                                                              BONUS MEMBER      MARET 2019                          014
14010273841                        00000000000072600.00MODESTA SANTI DEVIYANTI                                                                  BONUS MEMBER      MARET 2019                          014
17920345365                        00000000000082088.00MOH YAKUB KARAENG MATASA                                                                 BONUS MEMBER      MARET 2019                          014
17955199677                        00000000000051182.00MOHAMAD AL AMIN                                                                          BONUS MEMBER      MARET 2019                          014
18140254534                        00000000000137978.00MONNY SABACHTANI MAYOR S                                                                 BONUS MEMBER      MARET 2019                          014
17970228947                        00000000000643106.00MUFTIHATURRAHMAH BURHAMZ                                                                 BONUS MEMBER      MARET 2019                          014
17245083980                        00000000000050290.00MUH ALFI R                                                                               BONUS MEMBER      MARET 2019                          014
17910535905                        00000000000054958.00MUH BASYARAH RACHMAN                                                                     BONUS MEMBER      MARET 2019                          014
10255460574                        00000000000997355.00MUH. KADIR                                                                               BONUS MEMBER      MARET 2019                          014
17920781742                        00000000000282541.00MUHAMMAD HILMI MARWAN                                                                    BONUS MEMBER      MARET 2019                          014
16340111913                        00000000000052958.00MUJI LESTARI                                                                             BONUS MEMBER      MARET 2019                          014
12940047318                        00000000000247200.00MUKLAM                                                                                   BONUS MEMBER      MARET 2019                          014
13860011858                        00000000000092000.00MULIANA                                                                                  BONUS MEMBER      MARET 2019                          014
10250248121                        00000000000640178.00MULIAWATI MUHIDDIN                                                                       BONUS MEMBER      MARET 2019                          014
16320228075                        00000000000051956.00NANIK AQUARIUS DWI LESTARI                                                               BONUS MEMBER      MARET 2019                          014
14960003646                        00000000000105966.00NENSIH BH MOCH. AMSOR                                                                    BONUS MEMBER      MARET 2019                          014
18530066534                        00000000000058535.00NETI ZAHARA                                                                              BONUS MEMBER      MARET 2019                          014
10653453890                        00000000000179754.00NILAWATI"BDN RATU PRATIW                                                                 BONUS MEMBER      MARET 2019                          014
18290171513                        00000000000495045.00NINIK ELSAWATIE                                                                          BONUS MEMBER      MARET 2019                          014
16871347155                        00000000000053200.00NINIK SUWARTINI                                                                          BONUS MEMBER      MARET 2019                          014
10262097011                        00000000000259973.00NONTJE TANGAHU                                                                           BONUS MEMBER      MARET 2019                          014
18585146125                        00000000000109581.00NOOR LAILY                                                                               BONUS MEMBER      MARET 2019                          014
15210742605                        00000000000154856.00NOVI HANDAYANI                                                                           BONUS MEMBER      MARET 2019                          014
10511559323                        00000000000107520.00NOVITA MURSALIM                                                                          BONUS MEMBER      MARET 2019                          014
14620445342                        00000000000050620.00NOVITA SUSANTO                                                                           BONUS MEMBER      MARET 2019                          014
11240154532                        00000000000050290.00NUNUK HIDA SULISTIYOWATI                                                                 BONUS MEMBER      MARET 2019                          014
10881452595                        00000000000053200.00NUR RACHMAWATI                                                                           BONUS MEMBER      MARET 2019                          014
17990798600                        00000000000093236.00NURAENI MUSRADHY PAKI                                                                    BONUS MEMBER      MARET 2019                          014
17920488344                        00000000000101118.00NURAENI S. LADJIDJI                                                                      BONUS MEMBER      MARET 2019                          014
11199004598                        00000000000384289.00NURHASANAH HS                                                                            BONUS MEMBER      MARET 2019                          014
10255830223                        00000000000858563.00NURJAYA SH                                                                               BONUS MEMBER      MARET 2019                          014
12850039910                        00000000000100330.00NURLAELA JUMIATI                                                                         BONUS MEMBER      MARET 2019                          014
17640857212                        00000000000448249.00NURUL AZIZAH                                                                             BONUS MEMBER      MARET 2019                          014
15740065124                        00000000000072600.00NY THERESIANA SANTI                                                                      BONUS MEMBER      MARET 2019                          014
17920439246                        00000000000106647.00OCTAVIA NOVA DALY                                                                        BONUS MEMBER      MARET 2019                          014
12853001911                        00000000000472822.00OEI IRENE ANGELINE WIJAY                                                                 BONUS MEMBER      MARET 2019                          014
10884819781                        00000000000102008.00OENTOENG POEDJERAHARDJO                                                                  BONUS MEMBER      MARET 2019                          014
11822211288                        00000000000323990.00OEY GIOK HWA                                                                             BONUS MEMBER      MARET 2019                          014
13290127296                        00000000000053200.00OEY INGGRID INDRAWATI WI                                                                 BONUS MEMBER      MARET 2019                          014
10353041450                        00000000000072600.00OSBORN BUDIMAN                                                                           BONUS MEMBER      MARET 2019                          014
10320899222                        00000000000072600.00OTTO BERINA IR                                                                           BONUS MEMBER      MARET 2019                          014
17800213392                        00000000000101378.00PREISY ANGEL M GOLIOTH S                                                                 BONUS MEMBER      MARET 2019                          014
10590511561                        00000000000072600.00PURNAMA RIYANTI                                                                          BONUS MEMBER      MARET 2019                          014
12300840631                        00000000000050387.00RAHAYU GUNAWAN                                                                           BONUS MEMBER      MARET 2019                          014
17970160625                        00000000001123632.00RAHMITA BURHAMZAH                                                                        BONUS MEMBER      MARET 2019                          014
11070504312                        00000000000053200.00RAMA DHANI KUSUMA                                                                        BONUS MEMBER      MARET 2019                          014
18585016191                        00000000000395321.00RAMAYDA                                                                                  BONUS MEMBER      MARET 2019                          014
17910772435                        00000000000103240.00RANI ANGGRAENI R                                                                         BONUS MEMBER      MARET 2019                          014
11821231235                        00000000000188502.00RATNA DEWI                                                                               BONUS MEMBER      MARET 2019                          014
18585004134                        00000000000782473.00RATNA RAHAYUNI                                                                           BONUS MEMBER      MARET 2019                          014
12741009970                        00000000000532396.00RAY LAMMY                                                                                BONUS MEMBER      MARET 2019                          014
18275283882                        00000000000095410.00RENI JAYANTI ANGGRAINI                                                                   BONUS MEMBER      MARET 2019                          014
10130398782                        00000000000078420.00RENO KAILOLA                                                                             BONUS MEMBER      MARET 2019                          014
11191896063                        00000000000101735.00RETNO ENDAH SUSANTI                                                                      BONUS MEMBER      MARET 2019                          014
17910371635                        00000000000754474.00REZKY ULFA RAHMADANI-R                                                                   BONUS MEMBER      MARET 2019                          014
10321937313                        00000000000119451.00RIA SILVIA                                                                               BONUS MEMBER      MARET 2019                          014
11391712064                        00000000000053200.00RIA SUHARTI                                                                              BONUS MEMBER      MARET 2019                          014
14970191921                        00000000000209491.00RIKA                                                                                     BONUS MEMBER      MARET 2019                          014
13051019898                        00000000000110430.00RINIWATY DARYANTO                                                                        BONUS MEMBER      MARET 2019                          014
17920717351                        00000000003314348.00RISDIYANTO                                                                               BONUS MEMBER      MARET 2019                          014
17920441119                        00000000010750984.00ROBERTH PARENGKUAN                                                                       BONUS MEMBER      MARET 2019                          014
18665037157                        00000000000050290.00ROSALIA TRI SUPRANTI                                                                     BONUS MEMBER      MARET 2019                          014
18705168993                        00000000000072600.00ROSITA NATADARMA DJAJA                                                                   BONUS MEMBER      MARET 2019                          014
13490863159                        00000000000054655.00ROSMENTINA GIRSANG                                                                       BONUS MEMBER      MARET 2019                          014
12281140151                        00000000000142622.00ROSNIATI                                                                                 BONUS MEMBER      MARET 2019                          014
14970287464                        00000000000107084.00RR WIDIASRI PUJI APHINI                                                                  BONUS MEMBER      MARET 2019                          014
11410577344                        00000000000631417.00RUDI SANTOSO                                                                             BONUS MEMBER      MARET 2019                          014
12881095361                        00000000000050484.00RULLY ARISCHANDRA                                                                        BONUS MEMBER      MARET 2019                          014
16665050541                        00000000031434251.00RUSIANI                                                                                  BONUS MEMBER      MARET 2019                          014
11410324047                        00000000004503054.00RUTH HANDAYANI DARMAWAN                                                                  BONUS MEMBER      MARET 2019                          014
12581015901                        00000000004214438.00SALIM                                                                                    BONUS MEMBER      MARET 2019                          014
16270097543                        00000000000211766.00SALMA LUBIS                                                                              BONUS MEMBER      MARET 2019                          014
17910170583                        00000000029641775.00SALMIA RODHIYA HUSAINY                                                                   BONUS MEMBER      MARET 2019                          014
10613336092                        00000000000053200.00SATUI                                                                                    BONUS MEMBER      MARET 2019                          014
16795700777                        00000000000099760.00SELVI BAROLEH                                                                            BONUS MEMBER      MARET 2019                          014
10510697898                        00000000000160628.00SESELIA LISNA                                                                            BONUS MEMBER      MARET 2019                          014
14700218665                        00000000000107634.00SESILIA MADE LENY YUNIARTY                                                               BONUS MEMBER      MARET 2019                          014
18985132778                        00000000000054313.00SETIYOWATI DARSONO                                                                       BONUS MEMBER      MARET 2019                          014
11010200209                        00000000008932700.00SETYOTUHU TATIK                                                                          BONUS MEMBER      MARET 2019                          014
15660023307                        00000000000072600.00SHELLY                                                                                   BONUS MEMBER      MARET 2019                          014
12290005101                        00000000000286000.00SHIRLY SANTOSO                                                                           BONUS MEMBER      MARET 2019                          014
13981074465                        00000000000053200.00SILVIA                                                                                   BONUS MEMBER      MARET 2019                          014
10350602739                        00000000000108830.00SITI MARIYAM                                                                             BONUS MEMBER      MARET 2019                          014
14681155656                        00000000000072600.00SOEWITO ISMAWAN                                                                          BONUS MEMBER      MARET 2019                          014
18810104431                        00000000000072600.00SRI WAGIARTI                                                                             BONUS MEMBER      MARET 2019                          014
14361496102                        00000000000051502.00SRIANA ANGGREINI                                                                         BONUS MEMBER      MARET 2019                          014
17920883006                        00000000000134316.00STEFANI BEATRIX                                                                          BONUS MEMBER      MARET 2019                          014
17820054088                        00000000000051502.00STEVEN SETIAWAN                                                                          BONUS MEMBER      MARET 2019                          014
12533338585                        00000000009493410.00STEVIE LENGKONG                                                                          BONUS MEMBER      MARET 2019                          014
13530096458                        00000000000050290.00SUBIANTO HARSOJO                                                                         BONUS MEMBER      MARET 2019                          014
11010613635                        00000000000104756.00SUHARTI                                                                                  BONUS MEMBER      MARET 2019                          014
14281731054                        00000000000317325.00SUHENJANTI SOLAIMAN                                                                      BONUS MEMBER      MARET 2019                          014
10081835956                        00000000000071691.00SUJOKO AH.T                                                                              BONUS MEMBER      MARET 2019                          014
17685098881                        00000000000362102.00SUKRAWAN                                                                                 BONUS MEMBER      MARET 2019                          014
17910249091                        00000000010408952.00SULEMAN MILE                                                                             BONUS MEMBER      MARET 2019                          014
12861012044                        00000000003853467.00SULHANA ARMAINI                                                                          BONUS MEMBER      MARET 2019                          014
11651999214                        00000000000102185.00SUMAJIANTO                                                                               BONUS MEMBER      MARET 2019                          014
11280189983                        00000000000103640.00SUNDARI                                                                                  BONUS MEMBER      MARET 2019                          014
10921317271                        00000000000103604.00SUPRI YANTO                                                                              BONUS MEMBER      MARET 2019                          014
10192243131                        00000000000271127.00SUPRIJANTO                                                                               BONUS MEMBER      MARET 2019                          014
15710085015                        00000000000072600.00SUSAN KARTAWIDJAJA                                                                       BONUS MEMBER      MARET 2019                          014
12540333371                        00000000001881368.00SUSANTI OEY                                                                              BONUS MEMBER      MARET 2019                          014
10291671861                        00000000000483699.00SUSANTI SE                                                                               BONUS MEMBER      MARET 2019                          014
16860004001                        00000000000122187.00SUSANTY WIJAYA                                                                           BONUS MEMBER      MARET 2019                          014
12171014010                        00000000000105580.00SUZANNA ARRYANI                                                                          BONUS MEMBER      MARET 2019                          014
11410476271                        00000000004447685.00SUZANNA ELLY SENTOSA                                                                     BONUS MEMBER      MARET 2019                          014
10320979889                        00000000000123719.00SUZUKI                                                                                   BONUS MEMBER      MARET 2019                          014
10341981041                        00000000000051260.00SYAFRIDA HANUM                                                                           BONUS MEMBER      MARET 2019                          014
14361242143                        00000000000507624.00SYAFRINA                                                                                 BONUS MEMBER      MARET 2019                          014
16155200786                        00000000000050445.00SYLVIA CHRISTINA                                                                         BONUS MEMBER      MARET 2019                          014
13080072162                        00000000006992738.00TEDDY WIJAYAPUTRA                                                                        BONUS MEMBER      MARET 2019                          014
10010455375                        00000000000056094.00TEGUH RIYADI                                                                             BONUS MEMBER      MARET 2019                          014
17815002628                        00000000000105798.00THEN MARYAWATI                                                                           BONUS MEMBER      MARET 2019                          014
12465106911                        00000000000232102.00THEO ADHITYA DARMAWAN                                                                    BONUS MEMBER      MARET 2019                          014
13191614168                        00000000000051163.00THEOLA ZERLINA ICHSANI                                                                   BONUS MEMBER      MARET 2019                          014
12370130909                        00000000000072600.00THERESIA INDRAWATI                                                                       BONUS MEMBER      MARET 2019                          014
10841132423                        00000000000072600.00THERESIA LIANTO                                                                          BONUS MEMBER      MARET 2019                          014
10261634499                        00000000000092824.00THREISYE VONNY SUMUAL                                                                    BONUS MEMBER      MARET 2019                          014
17815095600                        00000000000469585.00TINI HARTANTO                                                                            BONUS MEMBER      MARET 2019                          014
10031705486                        00000000000072600.00TIO TJEN AI                                                                              BONUS MEMBER      MARET 2019                          014
17140106253                        00000000000072600.00TJEUW TRISNAWATI SUSANTO                                                                 BONUS MEMBER      MARET 2019                          014
17050073038                        00000000000072600.00TJIANG TJI PENG                                                                          BONUS MEMBER      MARET 2019                          014
15650009853                        00000000001478054.00TJOA MIN NIO                                                                             BONUS MEMBER      MARET 2019                          014
11650279782                        00000000000073570.00TOMMY ADHA HARSONO                                                                       BONUS MEMBER      MARET 2019                          014
18000515184                        00000000006468417.00TONGAM F SILABAN                                                                         BONUS MEMBER      MARET 2019                          014
11196004352                        00000000000212694.00TONGON SARIHON SITORUS                                                                   BONUS MEMBER      MARET 2019                          014
15165101089                        00000000000150200.00TRI MILIK PUSPAWATI DR                                                                   BONUS MEMBER      MARET 2019                          014
11710553897                        00000000001733480.00TRI PUJI ASTUTI                                                                          BONUS MEMBER      MARET 2019                          014
10931005927                        00000000000051502.00TRISILO WURYATI NINGSIH                                                                  BONUS MEMBER      MARET 2019                          014
15060080005                        00000000000050049.00TRISNORINI                                                                               BONUS MEMBER      MARET 2019                          014
17445049760                        00000000000575315.00TV TRISNA HARTATI                                                                        BONUS MEMBER      MARET 2019                          014
17910493684                        00000000000158542.00USMAN                                                                                    BONUS MEMBER      MARET 2019                          014
13422776271                        00000000000160482.00VANNY VIDYA HEUMASSE APT                                                                 BONUS MEMBER      MARET 2019                          014
12851193156                        00000000000284060.00VANYA UTAMI SUMA                                                                         BONUS MEMBER      MARET 2019                          014
14280024983                        00000000000225860.00VELDA DWITAMI SUMA                                                                       BONUS MEMBER      MARET 2019                          014
11192006621                        00000000000101734.00VENI KENNIS                                                                              BONUS MEMBER      MARET 2019                          014
10511220971                        00000000000092000.00VERTA DWI REKASANDI                                                                      BONUS MEMBER      MARET 2019                          014
17955103505                        00000000000052991.00VEYBIE S LUMAPOW                                                                         BONUS MEMBER      MARET 2019                          014
17835097536                        00000000000274166.00VICTORIA NURHAYATI                                                                       BONUS MEMBER      MARET 2019                          014
17795121986                        00000000000197186.00VIENA VICTORIA MENGKO                                                                    BONUS MEMBER      MARET 2019                          014
10292178172                        00000000000103931.00VINCENT                                                                                  BONUS MEMBER      MARET 2019                          014
17920788712                        00000000000335859.00WAFIQAH AMIRAH MARWAN                                                                    BONUS MEMBER      MARET 2019                          014
10255695245                        00000000000578937.00WAHYU SETIAWAN                                                                           BONUS MEMBER      MARET 2019                          014
16010017074                        00000000000157073.00WANDA MARIA NADIYENSI                                                                    BONUS MEMBER      MARET 2019                          014
15085723160                        00000000000051502.00WARAS                                                                                    BONUS MEMBER      MARET 2019                          014
11410592998                        00000000000333050.00WELLY DJUNAIDI                                                                           BONUS MEMBER      MARET 2019                          014
12046377777                        00000000000227800.00WEN GI WIDJAJA                                                                           BONUS MEMBER      MARET 2019                          014
10440875149                        00000000000050290.00WINARSIH                                                                                 BONUS MEMBER      MARET 2019                          014
10120213237                        00000000000483800.00WINARTI                                                                                  BONUS MEMBER      MARET 2019                          014
16750306002                        00000000000451870.00WOLTER CHRISTIAN JUSHARD                                                                 BONUS MEMBER      MARET 2019                          014
16240123931                        00000000000072600.00YATI KUMALA                                                                              BONUS MEMBER      MARET 2019                          014
11520368066                        00000000006024775.00YAYUK RIWAYATI                                                                           BONUS MEMBER      MARET 2019                          014
16440521442                        00000000000072600.00YENNY TANUWIJAYA                                                                         BONUS MEMBER      MARET 2019                          014
10321109364                        00000000000357780.00YENYTA FIRGO                                                                             BONUS MEMBER      MARET 2019                          014
17990807682                        00000000000057132.00YOHANNES BARA\`PADANG                                                                    BONUS MEMBER      MARET 2019                          014
10510781431                        00000000000266600.00YOONYS ANDRAY                                                                            BONUS MEMBER      MARET 2019                          014
17925086223                        00000000001132598.00YOSIANTO                                                                                 BONUS MEMBER      MARET 2019                          014
14290532944                        00000000000481637.00YOYOK DWI HIMALAYA                                                                       BONUS MEMBER      MARET 2019                          014
10261879157                        00000000001113713.00YUDIN IBRAHIM                                                                            BONUS MEMBER      MARET 2019                          014
12872372513                        00000000034975284.00YULIANTI LIAN                                                                            BONUS MEMBER      MARET 2019                          014
10350555935                        00000000000101894.00YULIDA                                                                                   BONUS MEMBER      MARET 2019                          014
17700211783                        00000000000171437.00YULITA YOHANA TUNGA                                                                      BONUS MEMBER      MARET 2019                          014
18665004194                        00000000000063385.00ZAINAL                                                                                   BONUS MEMBER      MARET 2019                          014
10120280899                        00000000003114562.00ZAINAL ARIFIN                                                                            BONUS MEMBER      MARET 2019                          014
10280110752                        00000000000289254.00ZIRA ENDYANA NURSYAHBANI                                                                 BONUS MEMBER      MARET 2019                          014
