0SP201908090033059008 00030331               00000000452141843.0000336BCA               BONUS MEMBER000000JULI 2019000000000                                                                             
17685051231                        00000000006467751.00A YUDI JAYA MUSRADHY P                                                                   BONUS MEMBER      JULI 2019                           014
17795105522                        00000000000051616.00A. MAI HAYATI                                                                            BONUS MEMBER      JULI 2019                           014
10665045078                        00000000000067265.00A.B. YULIANTO SUHARTONO                                                                  BONUS MEMBER      JULI 2019                           014
13880409866                        00000000000208740.00ACHMAD YUSUF DR SPKK                                                                     BONUS MEMBER      JULI 2019                           014
11750534542                        00000000000050532.00ADDIEN FAHMI                                                                             BONUS MEMBER      JULI 2019                           014
10292324969                        00000000000161404.00ADRIANNA GIOVANNI CLARISSA                                                               BONUS MEMBER      JULI 2019                           014
17910573050                        00000000002256499.00ADRYAN FRISTIOHADI MSC-A                                                                 BONUS MEMBER      JULI 2019                           014
12160019363                        00000000000939354.00AGNES MAGDALENA EFFENDY                                                                  BONUS MEMBER      JULI 2019                           014
17360166532                        00000000000950717.00AGUS RINI SULISTIOWATY                                                                   BONUS MEMBER      JULI 2019                           014
12581467780                        00000000000052691.00AGUS TOHPALA                                                                             BONUS MEMBER      JULI 2019                           014
16795046589                        00000000000051018.00AGUSTINA                                                                                 BONUS MEMBER      JULI 2019                           014
10290244889                        00000000000466130.00ALBERT THERIONO.LIM                                                                      BONUS MEMBER      JULI 2019                           014
14582204377                        00000000000693400.00ALDO LAMMY                                                                               BONUS MEMBER      JULI 2019                           014
12581605007                        00000000000323200.00ALFRYATI VENTHY SANDA SAU TAN                                                            BONUS MEMBER      JULI 2019                           014
14130329727                        00000000000099760.00AMELIA TEDDY                                                                             BONUS MEMBER      JULI 2019                           014
16265019343                        00000000000105532.00ANA SUSILOWATI SE                                                                        BONUS MEMBER      JULI 2019                           014
16720438061                        00000000000099760.00ANASTASIA VANIA SEPUTRA                                                                  BONUS MEMBER      JULI 2019                           014
17910323428                        00000000000053200.00ANDI SUSIWATI SE                                                                         BONUS MEMBER      JULI 2019                           014
16120114211                        00000000000270965.00ANDREAS NATA SUPU                                                                        BONUS MEMBER      JULI 2019                           014
17910710600                        00000000000053200.00ANGELA WILDA GEODELITA Z                                                                 BONUS MEMBER      JULI 2019                           014
17640372391                        00000000000101021.00ANIE NJOMIN                                                                              BONUS MEMBER      JULI 2019                           014
10900725272                        00000000000110112.00ANIS WATUL KHOIROH                                                                       BONUS MEMBER      JULI 2019                           014
16720068379                        00000000000124980.00ANNA TRISULA AL LO TJIOE                                                                 BONUS MEMBER      JULI 2019                           014
18530033633                        00000000000213711.00ANNA YANI                                                                                BONUS MEMBER      JULI 2019                           014
14641310063                        00000000000053200.00ANUGRAH DIANFITRIANI                                                                     BONUS MEMBER      JULI 2019                           014
11970182825                        00000000000106259.00ARIANNY BUDIMAN SH                                                                       BONUS MEMBER      JULI 2019                           014
18295031677                        00000000000102589.00ARTHER SONLY LEMBONG                                                                     BONUS MEMBER      JULI 2019                           014
11191565792                        00000000000104013.00ASRIL                                                                                    BONUS MEMBER      JULI 2019                           014
18600373529                        00000000000053200.00BAMBANG A. BAHAN                                                                         BONUS MEMBER      JULI 2019                           014
18870273500                        00000000000111400.00BAMBANG PERMANTORO                                                                       BONUS MEMBER      JULI 2019                           014
18220368964                        00000000000050242.00BAMBANG SOERIPNO                                                                         BONUS MEMBER      JULI 2019                           014
18665061783                        00000000000053200.00BENNY KUSNIAR                                                                            BONUS MEMBER      JULI 2019                           014
12533226078                        00000000000053200.00BENYAMIN RAHAYU                                                                          BONUS MEMBER      JULI 2019                           014
18195071981                        00000000000111982.00BERLYANTO MALAU                                                                          BONUS MEMBER      JULI 2019                           014
14641121589                        00000000000105580.00BUDI HARTONO                                                                             BONUS MEMBER      JULI 2019                           014
14212295292                        00000000000436350.00BUDI RAHARDJO                                                                            BONUS MEMBER      JULI 2019                           014
10931230921                        00000000000053200.00CANDRA WIJAYA                                                                            BONUS MEMBER      JULI 2019                           014
18585073888                        00000000000271935.00CATHERINE DANICA DAMIANA                                                                 BONUS MEMBER      JULI 2019                           014
13691033021                        00000000002303878.00CHARLIE BUDIMAN SH                                                                       BONUS MEMBER      JULI 2019                           014
14710032497                        00000000002821597.00CHARLOTHA PUTRI SHARON                                                                   BONUS MEMBER      JULI 2019                           014
11211755755                        00000000000107132.00CHRISTINE SHIRLEY ABIDIN                                                                 BONUS MEMBER      JULI 2019                           014
12211205123                        00000000000101003.00CITRA HALIM                                                                              BONUS MEMBER      JULI 2019                           014
18050030734                        00000000000156820.00CORNELIA CHANDRA BSC                                                                     BONUS MEMBER      JULI 2019                           014
10430970968                        00000000003686986.00CUT ZAKIA PUTRI FANDANI                                                                  BONUS MEMBER      JULI 2019                           014
15750355252                        00000000000882246.00CYNTHIA GEERTRUIDA                                                                       BONUS MEMBER      JULI 2019                           014
18585131683                        00000000000053200.00DAMARIS TIKU                                                                             BONUS MEMBER      JULI 2019                           014
11630357205                        00000000000164071.00DARMAWAN TEDJA                                                                           BONUS MEMBER      JULI 2019                           014
17920315482                        00000000000986785.00DARUSMAN M LAMANGKAU SE                                                                  BONUS MEMBER      JULI 2019                           014
10530160718                        00000000000311632.00DEAN HARRIYANTO SALEH                                                                    BONUS MEMBER      JULI 2019                           014
17910669383                        00000000000912084.00DEDENG DESRIADI AMIRUDIN                                                                 BONUS MEMBER      JULI 2019                           014
11192097287                        00000000012073366.00DELVIRA                                                                                  BONUS MEMBER      JULI 2019                           014
18205033315                        00000000002475210.00DERMAWATI TURNIP                                                                         BONUS MEMBER      JULI 2019                           014
18780045141                        00000000000146838.00DESSY ARISTIA                                                                            BONUS MEMBER      JULI 2019                           014
16070317069                        00000000000385953.00DESSY NATALIA MANOPPO                                                                    BONUS MEMBER      JULI 2019                           014
18695086365                        00000000011872392.00DESTRINAWATI                                                                             BONUS MEMBER      JULI 2019                           014
10292176781                        00000000000053200.00DEVI MELLYANTI                                                                           BONUS MEMBER      JULI 2019                           014
17880492262                        00000000000125485.00DEWI HESTYANA                                                                            BONUS MEMBER      JULI 2019                           014
10094714423                        00000000000052472.00DIAN INDRIHAPSARI HALIM                                                                  BONUS MEMBER      JULI 2019                           014
11302095897                        00000000000326255.00DIAN TJAHYARINA                                                                          BONUS MEMBER      JULI 2019                           014
10350929797                        00000000000053200.00DIDY HARDJOKO                                                                            BONUS MEMBER      JULI 2019                           014
12910283858                        00000000000102258.00DIMAS TEGUH PRAKOSA                                                                      BONUS MEMBER      JULI 2019                           014
17920178531                        00000000001886273.00DIONISIUS RORI PARENGKUA                                                                 BONUS MEMBER      JULI 2019                           014
14001657199                        00000000000053200.00DONI WAHYUDI                                                                             BONUS MEMBER      JULI 2019                           014
18295144994                        00000000000051018.00DR. SYSILIA M.N. KARINDA                                                                 BONUS MEMBER      JULI 2019                           014
17890877596                        00000000000107762.00DRG.ULFAH CHAERANI SAPUTRI                                                               BONUS MEMBER      JULI 2019                           014
10241104175                        00000000000114692.00EDELTRUDIS RAHAYU WAHYU                                                                  BONUS MEMBER      JULI 2019                           014
10110566182                        00000000000050090.00EDISON PN TOBING                                                                         BONUS MEMBER      JULI 2019                           014
18535226802                        00000000000072600.00EFRIDA YULITA MEO SR CLA                                                                 BONUS MEMBER      JULI 2019                           014
11191809942                        00000000000208982.00EKA YULI ASTUTI                                                                          BONUS MEMBER      JULI 2019                           014
15370199461                        00000000000064840.00EKO PANCE CHRISTIAN P                                                                    BONUS MEMBER      JULI 2019                           014
10262183856                        00000000000051260.00ELISABETH MAKPAL                                                                         BONUS MEMBER      JULI 2019                           014
12331649033                        00000000000358265.00ELLYANY SUGIAMAN                                                                         BONUS MEMBER      JULI 2019                           014
10021223785                        00000000000350424.00ELLYJATY SALIM                                                                           BONUS MEMBER      JULI 2019                           014
18140021777                        00000000000106550.00EMILIA ARYANTI                                                                           BONUS MEMBER      JULI 2019                           014
12581563851                        00000000009400513.00EMMY INDRIATY                                                                            BONUS MEMBER      JULI 2019                           014
12731381820                        00000000000157960.00ENDAH DWIYARTI                                                                           BONUS MEMBER      JULI 2019                           014
15415035435                        00000000001380422.00ENDY MUHARDIN MOEGNI DR                                                                  BONUS MEMBER      JULI 2019                           014
15065069935                        00000000003031794.00ENI SUHARTATIK                                                                           BONUS MEMBER      JULI 2019                           014
18780162610                        00000000000053200.00ERAWITA ENDY M DR                                                                        BONUS MEMBER      JULI 2019                           014
10270316000                        00000000000103543.00ERNA JULIANA                                                                             BONUS MEMBER      JULI 2019                           014
12410029416                        00000000000111400.00ERNI ANGGRAENI                                                                           BONUS MEMBER      JULI 2019                           014
18600271122                        00000000000374076.00ESLYN R. JABAR                                                                           BONUS MEMBER      JULI 2019                           014
10281796967                        00000000000111400.00ESTER JULIATI SUSANTO                                                                    BONUS MEMBER      JULI 2019                           014
12881053146                        00000000000053200.00ESTER JUNINGSIH SUDIONO                                                                  BONUS MEMBER      JULI 2019                           014
16155020567                        00000000000230225.00ESTER TJENDRAWATI                                                                        BONUS MEMBER      JULI 2019                           014
14650047368                        00000000000069690.00ESTHER RATNAWATI                                                                         BONUS MEMBER      JULI 2019                           014
15740054777                        00000000000073332.00ESTHER SETIAWATY HALIM                                                                   BONUS MEMBER      JULI 2019                           014
12581684861                        00000000000105580.00EVIE MARIA                                                                               BONUS MEMBER      JULI 2019                           014
15095097437                        00000000000103300.00FANNIE SCHELAG IMELDA                                                                    BONUS MEMBER      JULI 2019                           014
10035555566                        00000000000111400.00FELIX FEBRIAN                                                                            BONUS MEMBER      JULI 2019                           014
10060230340                        00000000000260585.00FERDYNANDS SAMPE                                                                         BONUS MEMBER      JULI 2019                           014
13422364673                        00000000000053200.00FERNANDI DR                                                                              BONUS MEMBER      JULI 2019                           014
10350812971                        00000000000072600.00FERNANDO IDON NANGIN                                                                     BONUS MEMBER      JULI 2019                           014
17800256814                        00000000000149036.00FERRA FENNY LOING                                                                        BONUS MEMBER      JULI 2019                           014
18295037861                        00000000001839019.00FILLY LADY DIANE FRANCES                                                                 BONUS MEMBER      JULI 2019                           014
17970003651                        00000000005788763.00FITRIYANTI RASYID                                                                        BONUS MEMBER      JULI 2019                           014
18585051302                        00000000000053200.00FRANSISCA FRENELIN                                                                       BONUS MEMBER      JULI 2019                           014
10491569688                        00000000006505642.00FRANSISKUS YANNO SOERATMAN                                                               BONUS MEMBER      JULI 2019                           014
10331665532                        00000000000104562.00GIMBARANIS                                                                               BONUS MEMBER      JULI 2019                           014
11710933029                        00000000000169600.00GOLDINA PRITI PINTARTI C                                                                 BONUS MEMBER      JULI 2019                           014
17245011369                        00000000000050290.00GUSTI SETIAWAN HAFID                                                                     BONUS MEMBER      JULI 2019                           014
15610136615                        00000000000489166.00H SUBKHAN DRS                                                                            BONUS MEMBER      JULI 2019                           014
17260909546                        00000000001306913.00HADI SOEDJAJA PRAMONO                                                                    BONUS MEMBER      JULI 2019                           014
17670410468                        00000000000219070.00HALARI INSAN IHSANI                                                                      BONUS MEMBER      JULI 2019                           014
13900389212                        00000000000907064.00HAMSIAH SANGKALA                                                                         BONUS MEMBER      JULI 2019                           014
17920451742                        00000000000331710.00HANIFA                                                                                   BONUS MEMBER      JULI 2019                           014
10262244251                        00000000002467212.00HANNA SILVANNA MANONGKO                                                                  BONUS MEMBER      JULI 2019                           014
10312348720                        00000000000053200.00HANS HANANTO ANDREAS                                                                     BONUS MEMBER      JULI 2019                           014
11451329036                        00000000000053200.00HAPPY SIRINGORINGO                                                                       BONUS MEMBER      JULI 2019                           014
17955187806                        00000000000224439.00HARDIYANTI MANOPPO                                                                       BONUS MEMBER      JULI 2019                           014
18221041275                        00000000000050290.00HARI PRASETYO                                                                            BONUS MEMBER      JULI 2019                           014
17770306536                        00000000000217130.00HAROLD EKA ATMAJA                                                                        BONUS MEMBER      JULI 2019                           014
17795019669                        00000000006267278.00HARUN DALING TUMBUAN                                                                     BONUS MEMBER      JULI 2019                           014
10221692241                        00000000000106550.00HASAN                                                                                    BONUS MEMBER      JULI 2019                           014
17920475943                        00000000000104529.00HASNIAH SYAH,DR                                                                          BONUS MEMBER      JULI 2019                           014
17685089955                        00000000001076196.00HASNIH S                                                                                 BONUS MEMBER      JULI 2019                           014
10272616980                        00000000000103925.00HELEN TANSIL                                                                             BONUS MEMBER      JULI 2019                           014
10281733167                        00000000000053200.00HELENA WIDJAJA                                                                           BONUS MEMBER      JULI 2019                           014
10210293884                        00000000000102767.00HENDARTO SANTOSO                                                                         BONUS MEMBER      JULI 2019                           014
15110144468                        00000000001010364.00HENNY JUARIA                                                                             BONUS MEMBER      JULI 2019                           014
11140254629                        00000000000053200.00HERAWATI                                                                                 BONUS MEMBER      JULI 2019                           014
10421011388                        00000000000165380.00HERAWATY                                                                                 BONUS MEMBER      JULI 2019                           014
10880652192                        00000000001002992.00HERLIN YUNARA                                                                            BONUS MEMBER      JULI 2019                           014
13650261258                        00000000000222465.00HERLINA H.                                                                               BONUS MEMBER      JULI 2019                           014
12903845619                        00000000000099760.00HERMAN AMIL S HUT                                                                        BONUS MEMBER      JULI 2019                           014
11410472844                        00000000000051502.00HERNI NELYANA                                                                            BONUS MEMBER      JULI 2019                           014
10650239687                        00000000000053200.00HERU SARWONO                                                                             BONUS MEMBER      JULI 2019                           014
17160038327                        00000000001670418.00HJ. NETTY NASIR                                                                          BONUS MEMBER      JULI 2019                           014
10502062296                        00000000000053200.00HM HENDRO ANUGRAH SM                                                                     BONUS MEMBER      JULI 2019                           014
14820187488                        00000000000099760.00IKE DIANITA                                                                              BONUS MEMBER      JULI 2019                           014
10291362418                        00000000010844238.00IMACULATA KORNIA                                                                         BONUS MEMBER      JULI 2019                           014
11981615498                        00000000000445565.00IMANUEL ADAM                                                                             BONUS MEMBER      JULI 2019                           014
11440327261                        00000000000051745.00IMELDA ESTER MARLINDA S                                                                  BONUS MEMBER      JULI 2019                           014
12460330001                        00000000001265203.00INAVIANTI WINARTO                                                                        BONUS MEMBER      JULI 2019                           014
12560098696                        00000000000399510.00INDAH CITRA DEWI SUCITRO                                                                 BONUS MEMBER      JULI 2019                           014
10272112299                        00000000000062997.00INDRAWATY JUNITA H.                                                                      BONUS MEMBER      JULI 2019                           014
15880209959                        00000000023863591.00INDRIYATI SALIM                                                                          BONUS MEMBER      JULI 2019                           014
14260366811                        00000000000388820.00INGE H S / THEO A D                                                                      BONUS MEMBER      JULI 2019                           014
18035179999                        00000000000053200.00INGGRIANI WINARTO                                                                        BONUS MEMBER      JULI 2019                           014
16380003447                        00000000000084240.00IR. SOEBIJANTO TRIWIBOWO                                                                 BONUS MEMBER      JULI 2019                           014
10222086661                        00000000000069690.00IRAWATI NASUTION                                                                         BONUS MEMBER      JULI 2019                           014
15270747762                        00000000000053200.00IRENE KARYADI                                                                            BONUS MEMBER      JULI 2019                           014
17890669560                        00000000000216160.00IRMAWATI                                                                                 BONUS MEMBER      JULI 2019                           014
14643157040                        00000000000154856.00IRUM SPRM DR                                                                             BONUS MEMBER      JULI 2019                           014
10030200101                        00000000000297268.00JANTI W                                                                                  BONUS MEMBER      JULI 2019                           014
13570208569                        00000000000053200.00JOENG CHINTYA DEWI                                                                       BONUS MEMBER      JULI 2019                           014
10181090234                        00000000003192120.00JOHANES PUTRA MAYNINEDO                                                                  BONUS MEMBER      JULI 2019                           014
17910981123                        00000000000433773.00JONI                                                                                     BONUS MEMBER      JULI 2019                           014
11781176392                        00000000002441628.00JOUSJE ADAM                                                                              BONUS MEMBER      JULI 2019                           014
11681694248                        00000000000620165.00JUANITA ICHSANI                                                                          BONUS MEMBER      JULI 2019                           014
12411120211                        00000000000103882.00JULIANA                                                                                  BONUS MEMBER      JULI 2019                           014
12910359331                        00000000000106823.00JULIANA KULLIT                                                                           BONUS MEMBER      JULI 2019                           014
11025616215                        00000000000101215.00JULISA WIPASOBYA                                                                         BONUS MEMBER      JULI 2019                           014
10530077110                        00000000003151348.00JULIUS BERNHARD WARELLA                                                                  BONUS MEMBER      JULI 2019                           014
10885727030                        00000000000579716.00KALEB YEREMIA YUNIOR KOR                                                                 BONUS MEMBER      JULI 2019                           014
10051024086                        00000000000100730.00KARWITA NURLAELASARI                                                                     BONUS MEMBER      JULI 2019                           014
10420075537                        00000000000103155.00KASIM ISHAK                                                                              BONUS MEMBER      JULI 2019                           014
17325151099                        00000000000053685.00KASMAN                                                                                   BONUS MEMBER      JULI 2019                           014
10710040915                        00000000004041433.00KENNETH RAY VICI LENGKON                                                                 BONUS MEMBER      JULI 2019                           014
18375032844                        00000000000104448.00KHAIRINA                                                                                 BONUS MEMBER      JULI 2019                           014
14970573513                        00000000000154137.00KIEMI MANALU                                                                             BONUS MEMBER      JULI 2019                           014
12620007202                        00000000000169600.00KIKIE HARDI                                                                              BONUS MEMBER      JULI 2019                           014
12211227763                        00000000000286000.00KONNI M TAMBUNAN                                                                         BONUS MEMBER      JULI 2019                           014
11700304082                        00000000000050048.00KRISTIAN MERUNTU SPD                                                                     BONUS MEMBER      JULI 2019                           014
17920002140                        00000000000110915.00LAUW SIE LING                                                                            BONUS MEMBER      JULI 2019                           014
10410949768                        00000000000320435.00LELI MARULISARI                                                                          BONUS MEMBER      JULI 2019                           014
14411013850                        00000000000053200.00LENNI TJAHJADI                                                                           BONUS MEMBER      JULI 2019                           014
18140000168                        00000000000555515.00LENNY SETYAWATI LIEM                                                                     BONUS MEMBER      JULI 2019                           014
18855061178                        00000000000056595.00LIA DWIYASARI                                                                            BONUS MEMBER      JULI 2019                           014
13971165357                        00000000000053200.00LIAN BIE HUI                                                                             BONUS MEMBER      JULI 2019                           014
15060026981                        00000000000347130.00LIE AY HWA                                                                               BONUS MEMBER      JULI 2019                           014
18290666580                        00000000000109702.00LIE VENNY RUSLI                                                                          BONUS MEMBER      JULI 2019                           014
10090888919                        00000000000053200.00LIEM ENG MEI                                                                             BONUS MEMBER      JULI 2019                           014
10880370006                        00000000000059166.00LIEM LINDAWATI MASAJU                                                                    BONUS MEMBER      JULI 2019                           014
17540460269                        00000000000300065.00LILIANY WIJAYA                                                                           BONUS MEMBER      JULI 2019                           014
12762222222                        00000000012917348.00LILY NGADIMAN                                                                            BONUS MEMBER      JULI 2019                           014
11087534430                        00000000000070369.00LIM PIT TJEN                                                                             BONUS MEMBER      JULI 2019                           014
16800437146                        00000000000053200.00LIN HERLINA                                                                              BONUS MEMBER      JULI 2019                           014
17795143955                        00000000006109764.00LINDA                                                                                    BONUS MEMBER      JULI 2019                           014
10490010009                        00000000000053200.00LINDA PUSPA DEWI                                                                         BONUS MEMBER      JULI 2019                           014
10272058839                        00000000000217348.00LINDA WATI TAMBERIN                                                                      BONUS MEMBER      JULI 2019                           014
17830557878                        00000000000053200.00LIONG SIOE GIE                                                                           BONUS MEMBER      JULI 2019                           014
12302337960                        00000000000273693.00LUCY VANYA LOING                                                                         BONUS MEMBER      JULI 2019                           014
18620235661                        00000000000993820.00LYDIANA DEWI EFFENDY                                                                     BONUS MEMBER      JULI 2019                           014
14281621569                        00000000000163780.00MAGDALENA KUSNADI                                                                        BONUS MEMBER      JULI 2019                           014
18190339344                        00000000000966540.00MANUELLA ARTAWATY PURBA                                                                  BONUS MEMBER      JULI 2019                           014
10260829971                        00000000003576709.00MARIA BEATRIX LUNTUNGAN                                                                  BONUS MEMBER      JULI 2019                           014
16840153876                        00000000002963394.00MARIANCE                                                                                 BONUS MEMBER      JULI 2019                           014
10031555999                        00000000000518800.00MARIO RENDY NGADIMAN                                                                     BONUS MEMBER      JULI 2019                           014
10292155075                        00000000000384819.00MARISA CAROLINA TEDJA                                                                    BONUS MEMBER      JULI 2019                           014
14650268356                        00000000027083385.00MARSUDI                                                                                  BONUS MEMBER      JULI 2019                           014
11520325049                        00000000000696116.00MARTHEN CAREL KORWA                                                                      BONUS MEMBER      JULI 2019                           014
16610493350                        00000000000154387.00MARTINUS B. PALAMBA                                                                      BONUS MEMBER      JULI 2019                           014
17795044337                        00000000000277476.00MARWAN AMIR                                                                              BONUS MEMBER      JULI 2019                           014
11910801674                        00000000000055140.00MAX LEVI BOHAM                                                                           BONUS MEMBER      JULI 2019                           014
10640167297                        00000000001189943.00MEDYAWATI LIMANTARA DRG                                                                  BONUS MEMBER      JULI 2019                           014
17160069281                        00000000003295029.00MELAWATY ABYANI                                                                          BONUS MEMBER      JULI 2019                           014
17135002399                        00000000000050290.00MELI                                                                                     BONUS MEMBER      JULI 2019                           014
10883225888                        00000000000123234.00MELI WIDJAJA                                                                             BONUS MEMBER      JULI 2019                           014
14411287399                        00000000000101247.00MERIAM SELONITA SAMBO                                                                    BONUS MEMBER      JULI 2019                           014
10292418882                        00000000002112588.00MERVYN                                                                                   BONUS MEMBER      JULI 2019                           014
13053007500                        00000000002451204.00MEYLIA                                                                                   BONUS MEMBER      JULI 2019                           014
17880158575                        00000000000216402.00MIMIK DIAH LESTARI                                                                       BONUS MEMBER      JULI 2019                           014
12741034559                        00000000007084139.00MIRA REBEKA SANI                                                                         BONUS MEMBER      JULI 2019                           014
12308061090                        00000000001571200.00MIRNA SAMPE                                                                              BONUS MEMBER      JULI 2019                           014
10201586932                        00000000000154404.00MONICA BETRYC PANGEMANAN                                                                 BONUS MEMBER      JULI 2019                           014
17970228947                        00000000000421210.00MUFTIHATURRAHMAH BURHAMZ                                                                 BONUS MEMBER      JULI 2019                           014
13900371216                        00000000000050290.00MUH ALI HUSAIN TJ                                                                        BONUS MEMBER      JULI 2019                           014
10255460574                        00000000000726138.00MUH. KADIR                                                                               BONUS MEMBER      JULI 2019                           014
12940047318                        00000000000053200.00MUKLAM                                                                                   BONUS MEMBER      JULI 2019                           014
10250248121                        00000000000105418.00MULIAWATI MUHIDDIN                                                                       BONUS MEMBER      JULI 2019                           014
18460218447                        00000000000101614.00MUSLIHUL HANAS                                                                           BONUS MEMBER      JULI 2019                           014
17820298564                        00000000000063488.00MUTIARA CITRA DEWI                                                                       BONUS MEMBER      JULI 2019                           014
16320228075                        00000000000389493.00NANIK AQUARIUS DWI LESTA                                                                 BONUS MEMBER      JULI 2019                           014
15280182526                        00000000000086083.00NANSI ARJANI HALIM                                                                       BONUS MEMBER      JULI 2019                           014
10653453890                        00000000000152140.00NILAWATI"BDN RATU PRATIW                                                                 BONUS MEMBER      JULI 2019                           014
11941174766                        00000000000111400.00NINI GUNAWAN                                                                             BONUS MEMBER      JULI 2019                           014
16871347155                        00000000000050290.00NINIEK SUWARTINI                                                                         BONUS MEMBER      JULI 2019                           014
18290171513                        00000000000659127.00NINIK ELSAWATIE                                                                          BONUS MEMBER      JULI 2019                           014
12681019121                        00000000000053200.00NOERLIANNY JAP                                                                           BONUS MEMBER      JULI 2019                           014
10262097011                        00000000000136168.00NONTJE TANGAHU                                                                           BONUS MEMBER      JULI 2019                           014
15210742605                        00000000003209822.00NOVI HANDAYANI                                                                           BONUS MEMBER      JULI 2019                           014
10221603116                        00000000026703275.00NURFAMI PUTRISARI                                                                        BONUS MEMBER      JULI 2019                           014
11199004598                        00000000000101554.00NURHASANAH HS                                                                            BONUS MEMBER      JULI 2019                           014
10255830223                        00000000000385264.00NURJAYA SH                                                                               BONUS MEMBER      JULI 2019                           014
14870657060                        00000000000111400.00NURLAELA JUMIATI                                                                         BONUS MEMBER      JULI 2019                           014
11941370727                        00000000000413500.00NURLAELA JUMIATI                                                                         BONUS MEMBER      JULI 2019                           014
17640857212                        00000000002440093.00NURUL AZIZAH                                                                             BONUS MEMBER      JULI 2019                           014
15740065124                        00000000000053200.00NY THERESIANA SANTI                                                                      BONUS MEMBER      JULI 2019                           014
12853001911                        00000000000106308.00OEI IRENE ANGELINE WIJAY                                                                 BONUS MEMBER      JULI 2019                           014
11822211288                        00000000000221495.00OEY GIOK HWA                                                                             BONUS MEMBER      JULI 2019                           014
10353041450                        00000000000053200.00OSBORN BUDIMAN                                                                           BONUS MEMBER      JULI 2019                           014
10421048583                        00000000000053540.00PARMAN                                                                                   BONUS MEMBER      JULI 2019                           014
17155072989                        00000000000159609.00PATRISIA SUPARTINA                                                                       BONUS MEMBER      JULI 2019                           014
10530210987                        00000000000069205.00PINGKAN MARIA PIJOH                                                                      BONUS MEMBER      JULI 2019                           014
11691938561                        00000000003075380.00PONCO HANDAYAWATI                                                                        BONUS MEMBER      JULI 2019                           014
17800213392                        00000000002999425.00PREISY ANGEL MARIA GOLIO                                                                 BONUS MEMBER      JULI 2019                           014
17895117285                        00000000000053200.00PRISCILLA KANOH SH                                                                       BONUS MEMBER      JULI 2019                           014
15120135106                        00000000000111158.00RAHAYU                                                                                   BONUS MEMBER      JULI 2019                           014
17970160625                        00000000000532657.00RAHMITA BURHAMZAH                                                                        BONUS MEMBER      JULI 2019                           014
11981678058                        00000000000053200.00RANIA HADINATA KHOUW                                                                     BONUS MEMBER      JULI 2019                           014
11821231235                        00000000000111400.00RATNA DEWI                                                                               BONUS MEMBER      JULI 2019                           014
12741009970                        00000000000577000.00RAY LAMMY                                                                                BONUS MEMBER      JULI 2019                           014
17915045553                        00000000000053200.00REBECCA TRISULISTIYANI                                                                   BONUS MEMBER      JULI 2019                           014
16795040068                        00000000000096365.00RENSLY SAADJAD                                                                           BONUS MEMBER      JULI 2019                           014
18600302231                        00000000000160870.00RESTUWATI                                                                                BONUS MEMBER      JULI 2019                           014
12533098011                        00000000000093455.00RIA JUWITA                                                                               BONUS MEMBER      JULI 2019                           014
11391712064                        00000000000141906.00RIA SUHARTI                                                                              BONUS MEMBER      JULI 2019                           014
17890205148                        00000000000101473.00RICKY ISKANDAR M                                                                         BONUS MEMBER      JULI 2019                           014
17910036585                        00000000000716999.00RINA ARIYANIE TAHIR-ST                                                                   BONUS MEMBER      JULI 2019                           014
17920717351                        00000000002754534.00RISDIYANTO                                                                               BONUS MEMBER      JULI 2019                           014
17920441119                        00000000030734435.00ROBERTH PARENGKUAN                                                                       BONUS MEMBER      JULI 2019                           014
18205181314                        00000000000826905.00ROLINA BAKKARA                                                                           BONUS MEMBER      JULI 2019                           014
15910096721                        00000000000053200.00RONY MANDALA                                                                             BONUS MEMBER      JULI 2019                           014
12281140151                        00000000000162810.00ROSNIATI                                                                                 BONUS MEMBER      JULI 2019                           014
11410577344                        00000000000102104.00RUDI SANTOSO                                                                             BONUS MEMBER      JULI 2019                           014
11683399977                        00000000003021206.00RULLY ARISCHANDRA                                                                        BONUS MEMBER      JULI 2019                           014
16665050541                        00000000014089237.00RUSIANI                                                                                  BONUS MEMBER      JULI 2019                           014
11410324047                        00000000005187225.00RUTH HANDAYANI DARMAWAN                                                                  BONUS MEMBER      JULI 2019                           014
17920779136                        00000000000583790.00SAHRAN                                                                                   BONUS MEMBER      JULI 2019                           014
12581015901                        00000000003510377.00SALIM                                                                                    BONUS MEMBER      JULI 2019                           014
17910170583                        00000000035236897.00SALMIA RODHIYA HUSAINY                                                                   BONUS MEMBER      JULI 2019                           014
15095083568                        00000000000102832.00SANTY KUSUMA SARI                                                                        BONUS MEMBER      JULI 2019                           014
10040049177                        00000000000202532.00SARAH AYUDA                                                                              BONUS MEMBER      JULI 2019                           014
18985132778                        00000000000111400.00SETIYOWATI DARSONO                                                                       BONUS MEMBER      JULI 2019                           014
11010200209                        00000000003313499.00SETYOTUHU TATIK                                                                          BONUS MEMBER      JULI 2019                           014
17910876711                        00000000000142052.00SHIENNY KUNCORO                                                                          BONUS MEMBER      JULI 2019                           014
12290005101                        00000000000650672.00SHIRLY SANTOSO                                                                           BONUS MEMBER      JULI 2019                           014
15200166649                        00000000000156166.00SITI AMANIYAH IRIANINGSIH                                                                BONUS MEMBER      JULI 2019                           014
17705059772                        00000000000156505.00SJERLLY LONDAH                                                                           BONUS MEMBER      JULI 2019                           014
10110468733                        00000000000104610.00SONY CHANDRASA WIDJAJA                                                                   BONUS MEMBER      JULI 2019                           014
14361496102                        00000000000102655.00SRIANA ANGGREINI                                                                         BONUS MEMBER      JULI 2019                           014
11710571313                        00000000000099760.00SRIE MAGDALENA YULIATI                                                                   BONUS MEMBER      JULI 2019                           014
16240695390                        00000000000053200.00STACIA ANGGAPUTRI                                                                        BONUS MEMBER      JULI 2019                           014
18295083863                        00000000001048420.00STANLEY ALEXANDER DORING                                                                 BONUS MEMBER      JULI 2019                           014
17920883006                        00000000000807151.00STEFANI BEATRIX                                                                          BONUS MEMBER      JULI 2019                           014
17935083991                        00000000000053200.00STEPHANIE STEPHEN GOEY                                                                   BONUS MEMBER      JULI 2019                           014
12533338585                        00000000017169344.00STEVIE LENGKONG                                                                          BONUS MEMBER      JULI 2019                           014
17910249091                        00000000012806015.00SULEMAN MILE                                                                             BONUS MEMBER      JULI 2019                           014
12861012044                        00000000000754397.00SULHANA ARMAINI                                                                          BONUS MEMBER      JULI 2019                           014
10921317271                        00000000000159740.00SUPRI YANTO                                                                              BONUS MEMBER      JULI 2019                           014
10021709335                        00000000000056595.00SUSANA.F.WAWORGA                                                                         BONUS MEMBER      JULI 2019                           014
10291671861                        00000000000395821.00SUSANTI SE                                                                               BONUS MEMBER      JULI 2019                           014
12171014010                        00000000000104125.00SUZANNA ARRYANI                                                                          BONUS MEMBER      JULI 2019                           014
11410476271                        00000000006657219.00SUZANNA ELLY SENTOSA                                                                     BONUS MEMBER      JULI 2019                           014
14361242143                        00000000000420507.00SYAFRINA                                                                                 BONUS MEMBER      JULI 2019                           014
10429945527                        00000000000079662.00SYAMSUDDIN, S.AG                                                                         BONUS MEMBER      JULI 2019                           014
16155200786                        00000000000119645.00SYLVIA CHRISTINA                                                                         BONUS MEMBER      JULI 2019                           014
13080072162                        00000000006881913.00TEDDY WIJAYAPUTRA                                                                        BONUS MEMBER      JULI 2019                           014
10010455375                        00000000000111400.00TEGUH RIYADI                                                                             BONUS MEMBER      JULI 2019                           014
12540318967                        00000000000100870.00TEGUH WAHYU ANA                                                                          BONUS MEMBER      JULI 2019                           014
12465106911                        00000000000223597.00THEO ADHITYA DARMAWAN                                                                    BONUS MEMBER      JULI 2019                           014
13191614168                        00000000000106227.00THEOLA ZERLINA ICHSANI                                                                   BONUS MEMBER      JULI 2019                           014
12370130909                        00000000000053200.00THERESIA INDRAWATI                                                                       BONUS MEMBER      JULI 2019                           014
12160521450                        00000000000100972.00THIO KIM TJU                                                                             BONUS MEMBER      JULI 2019                           014
15165085067                        00000000000051454.00TIARA TRISHNA DIO                                                                        BONUS MEMBER      JULI 2019                           014
10031705486                        00000000000053200.00TIO TJEN AI                                                                              BONUS MEMBER      JULI 2019                           014
17140106253                        00000000000053200.00TJEUW TRISNAWATI SUSANTO                                                                 BONUS MEMBER      JULI 2019                           014
17050073038                        00000000000053200.00TJIANG TJI PENG                                                                          BONUS MEMBER      JULI 2019                           014
10291825850                        00000000000053200.00TJIU HUI ALIE                                                                            BONUS MEMBER      JULI 2019                           014
18000515184                        00000000001240157.00TONGAM F SILABAN                                                                         BONUS MEMBER      JULI 2019                           014
11196004352                        00000000000102646.00TONGON SARIHON SITORUS                                                                   BONUS MEMBER      JULI 2019                           014
10140269662                        00000000000191958.00TRI JAYANI HADIWIDJAJA, SH                                                               BONUS MEMBER      JULI 2019                           014
11710553897                        00000000000156990.00TRI PUJI ASTUTI                                                                          BONUS MEMBER      JULI 2019                           014
17910677921                        00000000000100730.00TRIWULANDARI NEHRU PUTRI                                                                 BONUS MEMBER      JULI 2019                           014
15875065537                        00000000000058729.00UMANDARA                                                                                 BONUS MEMBER      JULI 2019                           014
15725019341                        00000000000053200.00VALERIE IBRAHIM DOMPAS                                                                   BONUS MEMBER      JULI 2019                           014
13422776271                        00000000000419860.00VANNY VIDYA HEUMASSE APT                                                                 BONUS MEMBER      JULI 2019                           014
10262660131                        00000000000294730.00VERA ROSALY KIROYAN                                                                      BONUS MEMBER      JULI 2019                           014
18161231835                        00000000000104723.00VIVI ARYANTI                                                                             BONUS MEMBER      JULI 2019                           014
11150555588                        00000000000380842.00VIVI DAMAYANTI                                                                           BONUS MEMBER      JULI 2019                           014
16010017074                        00000000000213686.00WANDA MARIA NADIYENSI                                                                    BONUS MEMBER      JULI 2019                           014
15085723160                        00000000000072600.00WARAS                                                                                    BONUS MEMBER      JULI 2019                           014
13191467131                        00000000000053200.00WELLA SOLIHIN                                                                            BONUS MEMBER      JULI 2019                           014
11410592998                        00000000000908085.00WELLY DJUNAIDI                                                                           BONUS MEMBER      JULI 2019                           014
12046377777                        00000000000208400.00WEN GI WIDJAJA                                                                           BONUS MEMBER      JULI 2019                           014
14350326460                        00000000000102023.00WILLIAM SEBASTIAN JESAYAWUNGKANA                                                         BONUS MEMBER      JULI 2019                           014
14010427113                        00000000000478206.00WINARTI                                                                                  BONUS MEMBER      JULI 2019                           014
14100096035                        00000000000051502.00WINNY SIWI                                                                               BONUS MEMBER      JULI 2019                           014
12450591141                        00000000000111400.00WINY ANDI PUTRO                                                                          BONUS MEMBER      JULI 2019                           014
11410658999                        00000000001405343.00XANDRAMELA LIMALA ALICYA                                                                 BONUS MEMBER      JULI 2019                           014
16240123931                        00000000000053200.00YATI KUMALA                                                                              BONUS MEMBER      JULI 2019                           014
11520368066                        00000000004173480.00YAYUK RIWAYATI                                                                           BONUS MEMBER      JULI 2019                           014
16440521442                        00000000000053200.00YENNY TANUWIJAYA                                                                         BONUS MEMBER      JULI 2019                           014
16750538990                        00000000000104610.00YEREMIA BAGUS PRATAMA                                                                    BONUS MEMBER      JULI 2019                           014
10510781431                        00000000000116502.00YOONYS ANDRAY                                                                            BONUS MEMBER      JULI 2019                           014
12710758541                        00000000000053200.00YOPIE KURNIA ERISTA HALIM                                                                BONUS MEMBER      JULI 2019                           014
17925086223                        00000000000875032.00YOSIANTO                                                                                 BONUS MEMBER      JULI 2019                           014
10261879157                        00000000000309184.00YUDIN IBRAHIM                                                                            BONUS MEMBER      JULI 2019                           014
15210665007                        00000000000053200.00YULI ASTERINA                                                                            BONUS MEMBER      JULI 2019                           014
18140305520                        00000000000100718.00YULIANA TANDIBUA                                                                         BONUS MEMBER      JULI 2019                           014
12872372513                        00000000002160894.00YULIANTI LIAN                                                                            BONUS MEMBER      JULI 2019                           014
12581763975                        00000000000105241.00ZAINAL ABIDIN                                                                            BONUS MEMBER      JULI 2019                           014
10120280899                        00000000000530876.00ZAINAL ARIFIN                                                                            BONUS MEMBER      JULI 2019                           014
18665085119                        00000000000106550.00ZAKHARIA                                                                                 BONUS MEMBER      JULI 2019                           014
10280110752                        00000000000134438.00ZIRA ENDYANA NURSYAHBANI                                                                 BONUS MEMBER      JULI 2019                           014
