FK;KD_JENIS_TRANSAKSI;FG_PENGGANTI;NOMOR_FAKTUR;MASA_PAJAK;TAHUN_PAJAK;TANGGAL_FAKTUR;NPWP;NAMA;ALAMAT_LENGKAP;JUMLAH_DPP;JUMLAH_PPN;JUMLAH_PPNBM;ID_KETERANGAN_TAMBAHAN;FP_UANG_MUKA;UANG_MUKA_DPP;UANG_MUKA_PPN;UANG_MUKA_PPNBM;REFERENSI
LT;NPWP;NAMA;JALAN;BLOK;NOMOR;RT;RW;KECAMATAN;KELURAHAN;KABUPATEN;PROPINSI;KODE_POS;NOMOR_TELEPON
OF;KODE_OBJEK;NAMA;HARGA_SATUAN;JUMLAH_BARANG;HARGA_TOTAL;DISKON;DPP;PPN;TARIF_PPNBM;PPNBM
FK;01;0;0041807547179;10;2018;02/10/2018;674087382114000;"IDA FENNY ELYSA";"JL. DEBLOD SUNDORO NO. 41 LK. II";477273;47727;0;0;0;0;0;0;44354
LT;674087382114000;"IDA FENNY ELYSA";-;-;-;0;0;-;-;-;-;-;-
OF;MT02512;"Catalog Vol.4 Th.2018 (100 pcs)";525000;1;525000;0;477273;47727;0;0
FK;01;0;0041807547193;10;2018;03/10/2018;061106084008000;"Mira Rebeka Sani";"Jl. Kesenian Blok O 1/12 Rt.016 Rw.009 Duren Sawit Jakarta Timur";122727;12273;0;0;0;0;0;0;44366
LT;061106084008000;"Mira Rebeka Sani";-;-;-;0;0;-;-;-;-;-;-
OF;MT0250;"Catalog Vol.4 Th.2018 (20 pcs)";135000;1;135000;0;122727;12273;0;0
FK;01;0;0041807547230;10;2018;06/10/2018;674087382114000;"IDA FENNY ELYSA";"JL. DEBLOD SUNDORO NO. 41 LK. II";3788364;378836;0;0;0;0;0;0;44396
LT;674087382114000;"IDA FENNY ELYSA";-;-;-;0;0;-;-;-;-;-;-
OF;PP0244;"Magozai 375 ml - (BELI 3 GRATIS 1)";343100;12;4117200;0;3742909;374291;0;0
OF;MT070022;"Flyer 100 lbr";50000;1;50000;0;45455;4545;0;0
FK;01;0;0041807547231;10;2018;06/10/2018;059461533732001;"Ir.HJ.Hayatun Fardah";"Jl. Garuda No.81 Kel. Komet Kec. Banjar Baru Utara Kab Banjarbaru -  Kalimantan Selatan";4543618;454362;0;0;0;0;0;0;44397
LT;059461533732001;"Ir.HJ.Hayatun Fardah";-;-;-;0;0;-;-;-;-;-;-
OF;PP0194;"Magozai 750 ml - (BELI 3 GRATIS 1)";562120;6;3372720;0;3066109;306611;0;0
OF;NT020001;Legres;125020;13;1625260;0;1477509;147751;0;0
FK;01;0;0041807547232;10;2018;06/10/2018;579473596823000;"Supantia Saleh";"Jl. Bitung Tengah RT.010 Rw.004. Bitung Tengah - Maesa Bitung";477273;47727;0;0;0;0;0;0;44398
LT;579473596823000;"Supantia Saleh";-;-;-;0;0;-;-;-;-;-;-
OF;MT02512;"Catalog Vol.4 Th.2018 (100 pcs)";525000;1;525000;0;477273;47727;0;0
FK;01;0;0041807547233;10;2018;06/10/2018;579473596823000;"Supantia Saleh";"Jl. Bitung Tengah RT.010 Rw.004. Bitung Tengah - Maesa Bitung";1128000;112800;0;0;0;0;0;0;44399
LT;579473596823000;"Supantia Saleh";-;-;-;0;0;-;-;-;-;-;-
OF;PP0298;"StarKidz - (Beli 1 Gratis 1)";124080;10;1240800;0;1128000;112800;0;0
FK;01;0;0041807547252;10;2018;08/10/2018;059461533732001;"Ir.HJ.Hayatun Fardah";"Jl. Garuda No.81 Kel. Komet Kec. Banjar Baru Utara Kab Banjarbaru -  Kalimantan Selatan";5451146;545114;0;0;0;0;0;0;44407
LT;059461533732001;"Ir.HJ.Hayatun Fardah";-;-;-;0;0;-;-;-;-;-;-
OF;PP0194;"Magozai 750 ml - (BELI 3 GRATIS 1)";562120;9;5059080;0;4599164;459916;0;0
OF;NT020003;"Magozai 750ml";562120;1;562120;0;511018;51102;0;0
OF;NT020001;Legres;125020;3;375060;0;340964;34096;0;0
FK;01;0;0041807547263;10;2018;08/10/2018;579473596823000;"Supantia Saleh";"Jl. Bitung Tengah RT.010 Rw.004. Bitung Tengah - Maesa Bitung";811637;81163;0;0;0;0;0;0;44416
LT;579473596823000;"Supantia Saleh";-;-;-;0;0;-;-;-;-;-;-
OF;PP0313;"Bee Propolis 90 - (Beli 2 atau Lebih Diskon 20%)";408900;2;817800;0;743455;74345;0;0
OF;MT0249;"Catalog Vol.4 Th.2018";7500;10;75000;0;68182;6818;0;0
FK;01;0;0041807547265;10;2018;08/10/2018;061106084008000;"Mira Rebeka Sani";"Jl. Kesenian Blok O 1/12 Rt.016 Rw.009 Duren Sawit Jakarta Timur";1299764;129976;0;0;0;0;0;0;44418
LT;061106084008000;"Mira Rebeka Sani";-;-;-;0;0;-;-;-;-;-;-
OF;PP0297;"FBCx 90 (Calorease) - (Beli 3 Gratis 1)";158860;9;1429740;0;1299764;129976;0;0
FK;01;0;0041807547292;10;2018;09/10/2018;059461533732001;"Ir.HJ.Hayatun Fardah";"Jl. Garuda No.81 Kel. Komet Kec. Banjar Baru Utara Kab Banjarbaru -  Kalimantan Selatan";9539291;953929;0;0;0;0;0;0;44439
LT;059461533732001;"Ir.HJ.Hayatun Fardah";-;-;-;0;0;-;-;-;-;-;-
OF;PP0194;"Magozai 750 ml - (BELI 3 GRATIS 1)";562120;18;10118160;0;9198327;919833;0;0
OF;NT020001;Legres;125020;3;375060;0;340964;34096;0;0
FK;01;0;0041807547321;10;2018;10/10/2018;061106084008000;"Mira Rebeka Sani";"Jl. Kesenian Blok O 1/12 Rt.016 Rw.009 Duren Sawit Jakarta Timur";2184455;218445;0;0;0;0;0;0;44459
LT;061106084008000;"Mira Rebeka Sani";-;-;-;0;0;-;-;-;-;-;-
OF;PP0330;"UC Synergy Eye Treat.-(Beli 2 atau Lebih Disk.30%)";126900;2;253800;0;230727;23073;0;0
OF;PP0338;"BI 2 Serum - (Diskon 40%)";114680;2;229360;0;208509;20851;0;0
OF;PP0297;"FBCx 90 (Calorease) - (Beli 3 Gratis 1)";158860;9;1429740;0;1299764;129976;0;0
OF;PP0350;"TOP UP Salmon Oil 90 49rb";49000;10;490000;0;445455;44545;0;0
FK;01;0;0041807547323;10;2018;10/10/2018;061106084008000;"Mira Rebeka Sani";"Jl. Kesenian Blok O 1/12 Rt.016 Rw.009 Duren Sawit Jakarta Timur";1533055;153305;0;0;0;0;0;0;44461
LT;061106084008000;"Mira Rebeka Sani";-;-;-;0;0;-;-;-;-;-;-
OF;PP0194;"Magozai 750 ml - (BELI 3 GRATIS 1)";562120;3;1686360;0;1533055;153305;0;0
FK;01;0;0041807547324;10;2018;10/10/2018;061106084008000;"Mira Rebeka Sani";"Jl. Kesenian Blok O 1/12 Rt.016 Rw.009 Duren Sawit Jakarta Timur";1533055;153305;0;0;0;0;0;0;44462
LT;061106084008000;"Mira Rebeka Sani";-;-;-;0;0;-;-;-;-;-;-
OF;PP0194;"Magozai 750 ml - (BELI 3 GRATIS 1)";562120;3;1686360;0;1533055;153305;0;0
FK;01;0;0041807547325;10;2018;10/10/2018;061106084008000;"Mira Rebeka Sani";"Jl. Kesenian Blok O 1/12 Rt.016 Rw.009 Duren Sawit Jakarta Timur";1533055;153305;0;0;0;0;0;0;44463
LT;061106084008000;"Mira Rebeka Sani";-;-;-;0;0;-;-;-;-;-;-
OF;PP0194;"Magozai 750 ml - (BELI 3 GRATIS 1)";562120;3;1686360;0;1533055;153305;0;0
FK;01;0;0041807547326;10;2018;10/10/2018;061106084008000;"Mira Rebeka Sani";"Jl. Kesenian Blok O 1/12 Rt.016 Rw.009 Duren Sawit Jakarta Timur";3066109;306611;0;0;0;0;0;0;44464
LT;061106084008000;"Mira Rebeka Sani";-;-;-;0;0;-;-;-;-;-;-
OF;PP0194;"Magozai 750 ml - (BELI 3 GRATIS 1)";562120;6;3372720;0;3066109;306611;0;0
FK;01;0;0041807547331;10;2018;10/10/2018;061106084008000;"Mira Rebeka Sani";"Jl. Kesenian Blok O 1/12 Rt.016 Rw.009 Duren Sawit Jakarta Timur";13636;1364;0;0;0;0;0;0;44469
LT;061106084008000;"Mira Rebeka Sani";-;-;-;0;0;-;-;-;-;-;-
OF;MT0249;"Catalog Vol.4 Th.2018";7500;2;15000;0;13636;1364;0;0
FK;01;0;0041807547333;10;2018;10/10/2018;672354446619000;"Surjana Dewi Effendy";"JL. Manyar Tirtoyoso Selatan 4 no. 11 RT 007 RW 005 Manyarsabrangan Mulyorejo surabaya";9635867;963586;0;0;0;0;0;0;44471
LT;672354446619000;"Surjana Dewi Effendy";-;-;-;0;0;-;-;-;-;-;-
OF;PP0313;"Bee Propolis 90 - (Beli 2 atau Lebih Diskon 20%)";408900;4;1635600;0;1486909;148691;0;0
OF;PP0337;"BI 2 Facial Wash - (Diskon 20%)";93060;1;93060;0;84600;8460;0;0
OF;PP0338;"BI 2 Serum - (Diskon 40%)";114680;2;229360;0;208509;20851;0;0
OF;PP0315;"Biorate - (Beli 2 atau Lebih Diskon 30%)";172960;2;345920;0;314473;31447;0;0
OF;PP0316;"Calcium with Vit. D-(Beli 2 atau Lebih Diskon 30%)";188000;2;376000;0;341818;34182;0;0
OF;PP080130;"Legres - (BELI 3 GRATIS 1)";125020;6;750120;0;681927;68193;0;0
OF;PP0325;"OsteoForte - (Beli 2 atau Lebih Special Price)";189410;6;1136460;0;1033145;103314;0;0
OF;PP0194;"Magozai 750 ml - (BELI 3 GRATIS 1)";562120;9;5059080;0;4599164;459916;0;0
OF;PP0319;"ImunoForce - (Beli 3 Gratis 1)";79618;3;238854;0;217140;21714;0;0
OF;PP0309;"TOP UP Loyalty 2 Biorate";49000;5;245000;0;222727;22273;0;0
OF;PP0350;"TOP UP Salmon Oil 90 49rb";49000;10;490000;0;445455;44545;0;0
FK;01;0;0041807547347;10;2018;10/10/2018;059461533732001;"Ir.HJ.Hayatun Fardah";"Jl. Garuda No.81 Kel. Komet Kec. Banjar Baru Utara Kab Banjarbaru -  Kalimantan Selatan";22694163;2269416;0;0;0;0;0;0;44484
LT;059461533732001;"Ir.HJ.Hayatun Fardah";-;-;-;0;0;-;-;-;-;-;-
OF;PP0194;"Magozai 750 ml - (BELI 3 GRATIS 1)";562120;24;13490880;0;12264436;1226444;0;0
OF;PP080109;"Antioxidant Life Pack";1403420;4;5613680;0;5103345;510334;0;0
OF;NT020011;Asta-Gen;279180;8;2233440;0;2030400;203040;0;0
OF;NT020001;Legres;125020;29;3625580;0;3295982;329598;0;0
FK;01;0;0041807547355;10;2018;10/10/2018;674087382114000;"IDA FENNY ELYSA";"JL. DEBLOD SUNDORO NO. 41 LK. II";16266910;1626690;0;0;0;0;0;0;44491
LT;674087382114000;"IDA FENNY ELYSA";-;-;-;0;0;-;-;-;-;-;-
OF;PP0331;"UC Day&Night; Cream-(Beli 2 atau Lebih Diskon 20%)";285290;2;570580;0;518709;51871;0;0
OF;PP0350;"TOP UP Salmon Oil 90 49rb";49000;15;735000;0;668182;66818;0;0
OF;PP0309;"TOP UP Loyalty 2 Biorate";49000;15;735000;0;668182;66818;0;0
OF;HF060006;"Bee Propolis 30";204920;5;1024600;0;931455;93145;0;0
OF;HF060011;"Salmon Oil (30)";139120;6;834720;0;758836;75884;0;0
OF;NT020015;Curcomplex-95;540500;4;2162000;0;1965455;196545;0;0
OF;PP080130;"Legres - (BELI 3 GRATIS 1)";125020;30;3750600;0;3409636;340964;0;0
OF;NT020007;Sistocare;256620;5;1283100;0;1166455;116645;0;0
OF;SK0022;"Starter Kit Oktober 2018 - 99rb";99000;6;594000;0;540000;54000;0;0
OF;PP0298;"StarKidz - (Beli 1 Gratis 1)";124080;50;6204000;0;5640000;564000;0;0
FK;01;0;0041807547402;10;2018;11/10/2018;674087382114000;"IDA FENNY ELYSA";"JL. DEBLOD SUNDORO NO. 41 LK. II";4538491;453849;0;0;0;0;0;0;44535
LT;674087382114000;"IDA FENNY ELYSA";-;-;-;0;0;-;-;-;-;-;-
OF;PP0331;"UC Day&Night; Cream-(Beli 2 atau Lebih Diskon 20%)";285290;2;570580;0;518709;51871;0;0
OF;PP0330;"UC Synergy Eye Treat.-(Beli 2 atau Lebih Disk.30%)";126900;4;507600;0;461455;46145;0;0
OF;PP0298;"StarKidz - (Beli 1 Gratis 1)";124080;11;1364880;0;1240800;124080;0;0
OF;PP02311;"SlimHealth PROMO Beli 1 Gratis 1";318660;8;2549280;0;2317527;231753;0;0
FK;01;0;0041807547403;10;2018;11/10/2018;061106084008000;"Mira Rebeka Sani";"Jl. Kesenian Blok O 1/12 Rt.016 Rw.009 Duren Sawit Jakarta Timur";534091;53409;0;0;0;0;0;0;44536
LT;061106084008000;"Mira Rebeka Sani";-;-;-;0;0;-;-;-;-;-;-
OF;PP0324;"Magozai Fruity - (Beli 2 atau Lebih Diskon 20%)";293750;2;587500;0;534091;53409;0;0
FK;01;0;0041807547428;10;2018;12/10/2018;061106084008000;"Mira Rebeka Sani";"Jl. Kesenian Blok O 1/12 Rt.016 Rw.009 Duren Sawit Jakarta Timur";1533055;153305;0;0;0;0;0;0;44545
LT;061106084008000;"Mira Rebeka Sani";-;-;-;0;0;-;-;-;-;-;-
OF;PP0194;"Magozai 750 ml - (BELI 3 GRATIS 1)";562120;3;1686360;0;1533055;153305;0;0
FK;01;0;0041807547447;10;2018;13/10/2018;059461533732001;"Ir.HJ.Hayatun Fardah";"Jl. Garuda No.81 Kel. Komet Kec. Banjar Baru Utara Kab Banjarbaru -  Kalimantan Selatan";2771889;277189;0;0;0;0;0;0;44561
LT;059461533732001;"Ir.HJ.Hayatun Fardah";-;-;-;0;0;-;-;-;-;-;-
OF;NT020003;"Magozai 750ml";562120;5;2810600;0;2555091;255509;0;0
OF;SL0002;"FBCx 90 (Calorease)";158860;1;158860;0;144418;14442;0;0
OF;NT020022;ImunoForce;79618;1;79618;0;72380;7238;0;0
FK;01;0;0041807547458;10;2018;15/10/2018;059461533732001;"Ir.HJ.Hayatun Fardah";"Jl. Garuda No.81 Kel. Komet Kec. Banjar Baru Utara Kab Banjarbaru -  Kalimantan Selatan";4862365;486235;0;0;0;0;0;0;44571
LT;059461533732001;"Ir.HJ.Hayatun Fardah";-;-;-;0;0;-;-;-;-;-;-
OF;HF060012;Glucosefit;346860;3;1040580;0;945982;94598;0;0
OF;SL0002;"FBCx 90 (Calorease)";158860;9;1429740;0;1299764;129976;0;0
OF;PP080130;"Legres - (BELI 3 GRATIS 1)";125020;9;1125180;0;1022891;102289;0;0
OF;PP02314;"Antioxidant Support Pack - (Free Magozai 750 ml)";1212600;1;1212600;0;1102364;110236;0;0
OF;NT020015;Curcomplex-95;540500;1;540500;0;491364;49136;0;0
FK;01;0;0041807547460;10;2018;15/10/2018;061106084008000;"Mira Rebeka Sani";"Jl. Kesenian Blok O 1/12 Rt.016 Rw.009 Duren Sawit Jakarta Timur";461455;46145;0;0;0;0;0;0;44573
LT;061106084008000;"Mira Rebeka Sani";-;-;-;0;0;-;-;-;-;-;-
OF;PP0330;"UC Synergy Eye Treat.-(Beli 2 atau Lebih Disk.30%)";126900;4;507600;0;461455;46145;0;0
FK;01;0;0041807547462;10;2018;15/10/2018;061106084008000;"Mira Rebeka Sani";"Jl. Kesenian Blok O 1/12 Rt.016 Rw.009 Duren Sawit Jakarta Timur";267273;26727;0;0;0;0;0;0;44575
LT;061106084008000;"Mira Rebeka Sani";-;-;-;0;0;-;-;-;-;-;-
OF;PP0309;"TOP UP Loyalty 2 Biorate";49000;6;294000;0;267273;26727;0;0
FK;01;0;0041807547470;10;2018;15/10/2018;061106084008000;"Mira Rebeka Sani";"Jl. Kesenian Blok O 1/12 Rt.016 Rw.009 Duren Sawit Jakarta Timur";89091;8909;0;0;0;0;0;0;44583
LT;061106084008000;"Mira Rebeka Sani";-;-;-;0;0;-;-;-;-;-;-
OF;PP0312;"TOP UP Loyalty 1 Calway C Jr (Change)";49000;2;98000;0;89091;8909;0;0
FK;01;0;0041807547481;10;2018;16/10/2018;061106084008000;"Mira Rebeka Sani";"Jl. Kesenian Blok O 1/12 Rt.016 Rw.009 Duren Sawit Jakarta Timur";1533055;153305;0;0;0;0;0;0;44593
LT;061106084008000;"Mira Rebeka Sani";-;-;-;0;0;-;-;-;-;-;-
OF;PP0194;"Magozai 750 ml - (BELI 3 GRATIS 1)";562120;3;1686360;0;1533055;153305;0;0
FK;01;0;0041807547482;10;2018;16/10/2018;672354446619000;"Surjana Dewi Effendy";"JL. Manyar Tirtoyoso Selatan 4 no. 11 RT 007 RW 005 Manyarsabrangan Mulyorejo surabaya";4908527;490852;0;0;0;0;0;0;44594
LT;672354446619000;"Surjana Dewi Effendy";-;-;-;0;0;-;-;-;-;-;-
OF;NT020011;Asta-Gen;279180;2;558360;0;507600;50760;0;0
OF;NT020015;Curcomplex-95;540500;1;540500;0;491364;49136;0;0
OF;NT020001;Legres;125020;20;2500400;0;2273091;227309;0;0
OF;PP080130;"Legres - (BELI 3 GRATIS 1)";125020;6;750120;0;681927;68193;0;0
OF;MT02512;"Catalog Vol.4 Th.2018 (100 pcs)";525000;2;1050000;0;954545;95454;0;0
FK;01;0;0041807547484;10;2018;16/10/2018;672354446619000;"Surjana Dewi Effendy";"JL. Manyar Tirtoyoso Selatan 4 no. 11 RT 007 RW 005 Manyarsabrangan Mulyorejo surabaya";6054600;605459;0;0;0;0;0;0;44596
LT;672354446619000;"Surjana Dewi Effendy";-;-;-;0;0;-;-;-;-;-;-
OF;NT020015;Curcomplex-95;540500;1;540500;0;491364;49136;0;0
OF;HF060009;Pureway-C;128780;2;257560;0;234145;23414;0;0
OF;PP0337;"BI 2 Facial Wash - (Diskon 20%)";93060;1;93060;0;84600;8460;0;0
OF;PP080130;"Legres - (BELI 3 GRATIS 1)";125020;6;750120;0;681927;68193;0;0
OF;PP0324;"Magozai Fruity - (Beli 2 atau Lebih Diskon 20%)";293750;2;587500;0;534091;53409;0;0
OF;PP0325;"OsteoForte - (Beli 2 atau Lebih Special Price)";189410;4;757640;0;688764;68876;0;0
OF;PP0322;"Legalon - (Beli 2 atau Lebih Special Price)";282000;2;564000;0;512727;51273;0;0
OF;PP0327;"Renewskin 30 - (Beli 2 atau Lebih Diskon 20%)";162620;2;325240;0;295673;29567;0;0
OF;PP0320;"Ginsana - (Beli 3 Gratis 1)";371300;3;1113900;0;1012636;101264;0;0
OF;PP0237;"Asta-Gen - (Beli 3 Gratis 1)";279180;3;837540;0;761400;76140;0;0
OF;PP0309;"TOP UP Loyalty 2 Biorate";49000;17;833000;0;757273;75727;0;0
FK;01;0;0041807547489;10;2018;16/10/2018;672354446619000;"Surjana Dewi Effendy";"JL. Manyar Tirtoyoso Selatan 4 no. 11 RT 007 RW 005 Manyarsabrangan Mulyorejo surabaya";1202728;120272;0;0;0;0;0;0;44601
LT;672354446619000;"Surjana Dewi Effendy";-;-;-;0;0;-;-;-;-;-;-
OF;PP0309;"TOP UP Loyalty 2 Biorate";49000;17;833000;0;757273;75727;0;0
OF;PP0347;"TOP UP Asta Spa Body Serum 49rb";49000;10;490000;0;445455;44545;0;0
FK;01;0;0041807547490;10;2018;16/10/2018;672354446619000;"Surjana Dewi Effendy";"JL. Manyar Tirtoyoso Selatan 4 no. 11 RT 007 RW 005 Manyarsabrangan Mulyorejo surabaya";445455;44545;0;0;0;0;0;0;44602
LT;672354446619000;"Surjana Dewi Effendy";-;-;-;0;0;-;-;-;-;-;-
OF;PP0347;"TOP UP Asta Spa Body Serum 49rb";49000;10;490000;0;445455;44545;0;0
FK;01;0;0041807547500;10;2018;17/10/2018;061106084008000;"Mira Rebeka Sani";"Jl. Kesenian Blok O 1/12 Rt.016 Rw.009 Duren Sawit Jakarta Timur";1533055;153305;0;0;0;0;0;0;44611
LT;061106084008000;"Mira Rebeka Sani";-;-;-;0;0;-;-;-;-;-;-
OF;PP0194;"Magozai 750 ml - (BELI 3 GRATIS 1)";562120;3;1686360;0;1533055;153305;0;0
FK;01;0;0041807547504;10;2018;17/10/2018;674087382114000;"IDA FENNY ELYSA";"JL. DEBLOD SUNDORO NO. 41 LK. II";1620218;162022;0;0;0;0;0;0;44615
LT;674087382114000;"IDA FENNY ELYSA";-;-;-;0;0;-;-;-;-;-;-
OF;PP0329;"Slim Health 90 - (Beli 2 atau Lebih Diskon 30%)";222780;8;1782240;0;1620218;162022;0;0
FK;01;0;0041807547522;10;2018;18/10/2018;061106084008000;"Mira Rebeka Sani";"Jl. Kesenian Blok O 1/12 Rt.016 Rw.009 Duren Sawit Jakarta Timur";1533055;153305;0;0;0;0;0;0;44629
LT;061106084008000;"Mira Rebeka Sani";-;-;-;0;0;-;-;-;-;-;-
OF;PP0194;"Magozai 750 ml - (BELI 3 GRATIS 1)";562120;3;1686360;0;1533055;153305;0;0
FK;01;0;0041807547524;10;2018;18/10/2018;061106084008000;"Mira Rebeka Sani";"Jl. Kesenian Blok O 1/12 Rt.016 Rw.009 Duren Sawit Jakarta Timur";44545;4454;0;0;0;0;0;0;44631
LT;061106084008000;"Mira Rebeka Sani";-;-;-;0;0;-;-;-;-;-;-
OF;PP0309;"TOP UP Loyalty 2 Biorate";49000;1;49000;0;44545;4454;0;0
FK;01;0;0041807547526;10;2018;18/10/2018;061106084008000;"Mira Rebeka Sani";"Jl. Kesenian Blok O 1/12 Rt.016 Rw.009 Duren Sawit Jakarta Timur";307636;30764;0;0;0;0;0;0;44633
LT;061106084008000;"Mira Rebeka Sani";-;-;-;0;0;-;-;-;-;-;-
OF;PP0328;"Sistocare - (Beli 2 atau Lebih Diskon 30%)";169200;2;338400;0;307636;30764;0;0
FK;01;0;0041807547536;10;2018;18/10/2018;478640824626000;"Anang Purwito";"Jl.SLAMET RIYADI GANG CENTRAL KAV 7 JEMBER 68112";1371109;137111;0;0;0;0;0;0;44638
LT;478640824626000;"Anang Purwito";-;-;-;0;0;-;-;-;-;-;-
OF;PP080173;"Calway-C Jr Promo BELI 3 GRATIS 1";253820;3;761460;0;692236;69224;0;0
OF;NT020023;OsteoForte;233240;2;466480;0;424073;42407;0;0
OF;NT0022;"Calcium with Vitamin D";280280;1;280280;0;254800;25480;0;0
FK;01;0;0041807547540;10;2018;19/10/2018;082738550831000;"Harun D. Tumbuan";"Komplek RSD Madani No.19 Kota Palu Sualwesi Tengah";4375663;437567;0;0;0;0;0;0;44640
LT;082738550831000;"Harun D. Tumbuan";-;-;-;0;0;-;-;-;-;-;-
OF;PP080130;"Legres - (BELI 3 GRATIS 1)";125020;6;750120;0;681927;68193;0;0
OF;PP02316;"Care For Cancer - (Free magozai 750 ml)";1349370;3;4048110;0;3680100;368010;0;0
OF;MT0249;"Catalog Vol.4 Th.2018";7500;2;15000;0;13636;1364;0;0
FK;01;0;0041807547554;10;2018;19/10/2018;579473596823000;"Supantia Saleh";"Jl. Bitung Tengah RT.010 Rw.004. Bitung Tengah - Maesa Bitung";842155;84215;0;0;0;0;0;0;44652
LT;579473596823000;"Supantia Saleh";-;-;-;0;0;-;-;-;-;-;-
OF;NT020017;"Magozai 375ml";343100;1;343100;0;311909;31191;0;0
OF;NT0024;"Magozai Fruity";366600;1;366600;0;333273;33327;0;0
OF;NT020019;"Renewskin 30";216670;1;216670;0;196973;19697;0;0
FK;01;0;0041807547566;10;2018;20/10/2018;082738550831000;"Harun D. Tumbuan";"Komplek RSD Madani No.19 Kota Palu Sualwesi Tengah";1580890;158089;0;0;0;0;0;0;44664
LT;082738550831000;"Harun D. Tumbuan";-;-;-;0;0;-;-;-;-;-;-
OF;PP0338;"BI 2 Serum - (Diskon 40%)";114680;6;688080;0;625527;62553;0;0
OF;PP0340;"BI 2 Night Cream - (Diskon 30%)";167790;4;671160;0;610145;61014;0;0
OF;PP0337;"BI 2 Facial Wash - (Diskon 20%)";93060;4;372240;0;338400;33840;0;0
OF;MT0249;"Catalog Vol.4 Th.2018";7500;1;7500;0;6818;682;0;0
FK;01;0;0041807547576;10;2018;20/10/2018;061106084008000;"Mira Rebeka Sani";"Jl. Kesenian Blok O 1/12 Rt.016 Rw.009 Duren Sawit Jakarta Timur";857963;85797;0;0;0;0;0;0;44672
LT;061106084008000;"Mira Rebeka Sani";-;-;-;0;0;-;-;-;-;-;-
OF;PP0338;"BI 2 Serum - (Diskon 40%)";114680;4;458720;0;417018;41702;0;0
OF;PP0330;"UC Synergy Eye Treat.-(Beli 2 atau Lebih Disk.30%)";126900;2;253800;0;230727;23073;0;0
OF;PP0333;"Asta SPA Body Shower - (Diskon 40%)";115620;2;231240;0;210218;21022;0;0
FK;01;0;0041807547579;10;2018;20/10/2018;478640824626000;"Anang Purwito";"Jl.SLAMET RIYADI GANG CENTRAL KAV 7 JEMBER 68112";692236;69224;0;0;0;0;0;0;44675
LT;478640824626000;"Anang Purwito";-;-;-;0;0;-;-;-;-;-;-
OF;NT020016;"Calway-C Junior";253820;3;761460;0;692236;69224;0;0
FK;01;0;0041807547589;10;2018;22/10/2018;061106084008000;"Mira Rebeka Sani";"Jl. Kesenian Blok O 1/12 Rt.016 Rw.009 Duren Sawit Jakarta Timur";1533055;153305;0;0;0;0;0;0;44685
LT;061106084008000;"Mira Rebeka Sani";-;-;-;0;0;-;-;-;-;-;-
OF;PP0194;"Magozai 750 ml - (BELI 3 GRATIS 1)";562120;3;1686360;0;1533055;153305;0;0
FK;01;0;0041807547595;10;2018;22/10/2018;061106084008000;"Mira Rebeka Sani";"Jl. Kesenian Blok O 1/12 Rt.016 Rw.009 Duren Sawit Jakarta Timur";341818;34182;0;0;0;0;0;0;44689
LT;061106084008000;"Mira Rebeka Sani";-;-;-;0;0;-;-;-;-;-;-
OF;PP0316;"Calcium with Vit. D-(Beli 2 atau Lebih Diskon 30%)";188000;2;376000;0;341818;34182;0;0
FK;01;0;0041807547632;10;2018;23/10/2018;672354446619000;"Surjana Dewi Effendy";"JL. Manyar Tirtoyoso Selatan 4 no. 11 RT 007 RW 005 Manyarsabrangan Mulyorejo surabaya";10427846;1042784;0;0;0;0;0;0;44721
LT;672354446619000;"Surjana Dewi Effendy";-;-;-;0;0;-;-;-;-;-;-
OF;SK0022;"Starter Kit Oktober 2018 - 99rb";99000;2;198000;0;180000;18000;0;0
OF;SK0023;"Starter Kit Oktober 2018 - 629rb";591260;3;1773780;0;1612527;161253;0;0
OF;PP080130;"Legres - (BELI 3 GRATIS 1)";125020;12;1500240;0;1363855;136385;0;0
OF;PP0328;"Sistocare - (Beli 2 atau Lebih Diskon 30%)";169200;2;338400;0;307636;30764;0;0
OF;PP02316;"Care For Cancer - (Free magozai 750 ml)";1349370;1;1349370;0;1226700;122670;0;0
OF;PP0332;"Vegefrut - (Beli 2 atau Lebih Diskon 30%)";135360;2;270720;0;246109;24611;0;0
OF;PP0194;"Magozai 750 ml - (BELI 3 GRATIS 1)";562120;9;5059080;0;4599164;459916;0;0
OF;PP0344;"TOP UP ImunoForce 49rb";49000;10;490000;0;445455;44545;0;0
OF;PP0309;"TOP UP Loyalty 2 Biorate";49000;3;147000;0;133636;13364;0;0
OF;PP0338;"BI 2 Serum - (Diskon 40%)";114680;3;344040;0;312764;31276;0;0
FK;01;0;0041807547656;10;2018;24/10/2018;061106084008000;"Mira Rebeka Sani";"Jl. Kesenian Blok O 1/12 Rt.016 Rw.009 Duren Sawit Jakarta Timur";1533055;153305;0;0;0;0;0;0;44743
LT;061106084008000;"Mira Rebeka Sani";-;-;-;0;0;-;-;-;-;-;-
OF;PP0194;"Magozai 750 ml - (BELI 3 GRATIS 1)";562120;3;1686360;0;1533055;153305;0;0
FK;01;0;0041807547664;10;2018;24/10/2018;061106084008000;"Mira Rebeka Sani";"Jl. Kesenian Blok O 1/12 Rt.016 Rw.009 Duren Sawit Jakarta Timur";1577600;157759;0;0;0;0;0;0;44750
LT;061106084008000;"Mira Rebeka Sani";-;-;-;0;0;-;-;-;-;-;-
OF;PP0194;"Magozai 750 ml - (BELI 3 GRATIS 1)";562120;3;1686360;0;1533055;153305;0;0
OF;PP0309;"TOP UP Loyalty 2 Biorate";49000;1;49000;0;44545;4454;0;0
FK;01;0;0041807547667;10;2018;24/10/2018;082738550831000;"Harun D. Tumbuan";"Komplek RSD Madani No.19 Kota Palu Sualwesi Tengah";180000;18000;0;0;0;0;0;0;44753
LT;082738550831000;"Harun D. Tumbuan";-;-;-;0;0;-;-;-;-;-;-
OF;SK0022;"Starter Kit Oktober 2018 - 99rb";99000;2;198000;0;180000;18000;0;0
FK;01;0;0041807547669;10;2018;24/10/2018;674087382114000;"IDA FENNY ELYSA";"JL. DEBLOD SUNDORO NO. 41 LK. II";10900581;1090058;0;0;0;0;0;0;44755
LT;674087382114000;"IDA FENNY ELYSA";-;-;-;0;0;-;-;-;-;-;-
OF;PP0194;"Magozai 750 ml - (BELI 3 GRATIS 1)";562120;3;1686360;0;1533055;153305;0;0
OF;PP0316;"Calcium with Vit. D-(Beli 2 atau Lebih Diskon 30%)";188000;10;1880000;0;1709091;170909;0;0
OF;NT020016;"Calway-C Junior";243460;5;1217300;0;1106636;110664;0;0
OF;HF060012;Glucosefit;346860;5;1734300;0;1576636;157664;0;0
OF;PP0322;"Legalon - (Beli 2 atau Lebih Special Price)";282000;10;2820000;0;2563636;256364;0;0
OF;NT020001;Legres;125020;1;125020;0;113655;11365;0;0
OF;PP0325;"OsteoForte - (Beli 2 atau Lebih Special Price)";189410;6;1136460;0;1033145;103314;0;0
OF;HF060011;"Salmon Oil (30)";139120;10;1391200;0;1264727;126473;0;0
FK;01;0;0041807547676;10;2018;24/10/2018;674087382114000;"IDA FENNY ELYSA";"JL. DEBLOD SUNDORO NO. 41 LK. II";10900581;1090058;0;0;0;0;0;0;44762
LT;674087382114000;"IDA FENNY ELYSA";-;-;-;0;0;-;-;-;-;-;-
OF;PP0194;"Magozai 750 ml - (BELI 3 GRATIS 1)";562120;3;1686360;0;1533055;153305;0;0
OF;PP0316;"Calcium with Vit. D-(Beli 2 atau Lebih Diskon 30%)";188000;10;1880000;0;1709091;170909;0;0
OF;NT020016;"Calway-C Junior";243460;5;1217300;0;1106636;110664;0;0
OF;HF060012;Glucosefit;346860;5;1734300;0;1576636;157664;0;0
OF;PP0322;"Legalon - (Beli 2 atau Lebih Special Price)";282000;10;2820000;0;2563636;256364;0;0
OF;NT020001;Legres;125020;1;125020;0;113655;11365;0;0
OF;PP0325;"OsteoForte - (Beli 2 atau Lebih Special Price)";189410;6;1136460;0;1033145;103314;0;0
OF;HF060011;"Salmon Oil (30)";139120;10;1391200;0;1264727;126473;0;0
FK;01;0;0041807547687;10;2018;25/10/2018;061106084008000;"Mira Rebeka Sani";"Jl. Kesenian Blok O 1/12 Rt.016 Rw.009 Duren Sawit Jakarta Timur";1533055;153305;0;0;0;0;0;0;44772
LT;061106084008000;"Mira Rebeka Sani";-;-;-;0;0;-;-;-;-;-;-
OF;PP0194;"Magozai 750 ml - (BELI 3 GRATIS 1)";562120;3;1686360;0;1533055;153305;0;0
FK;01;0;0041807547698;10;2018;25/10/2018;061106084008000;"Mira Rebeka Sani";"Jl. Kesenian Blok O 1/12 Rt.016 Rw.009 Duren Sawit Jakarta Timur";1135691;113569;0;0;0;0;0;0;44781
LT;061106084008000;"Mira Rebeka Sani";-;-;-;0;0;-;-;-;-;-;-
OF;PP02315;"Antioxidant Plus Pack - (Free Magozai 750 ml)";1249260;1;1249260;0;1135691;113569;0;0
FK;01;0;0041807547700;10;2018;25/10/2018;061106084008000;"Mira Rebeka Sani";"Jl. Kesenian Blok O 1/12 Rt.016 Rw.009 Duren Sawit Jakarta Timur";1533055;153305;0;0;0;0;0;0;44783
LT;061106084008000;"Mira Rebeka Sani";-;-;-;0;0;-;-;-;-;-;-
OF;PP0194;"Magozai 750 ml - (BELI 3 GRATIS 1)";562120;3;1686360;0;1533055;153305;0;0
FK;01;0;0041807547701;10;2018;25/10/2018;061106084008000;"Mira Rebeka Sani";"Jl. Kesenian Blok O 1/12 Rt.016 Rw.009 Duren Sawit Jakarta Timur";1533055;153305;0;0;0;0;0;0;44784
LT;061106084008000;"Mira Rebeka Sani";-;-;-;0;0;-;-;-;-;-;-
OF;PP0194;"Magozai 750 ml - (BELI 3 GRATIS 1)";562120;3;1686360;0;1533055;153305;0;0
FK;01;0;0041807547704;10;2018;25/10/2018;061106084008000;"Mira Rebeka Sani";"Jl. Kesenian Blok O 1/12 Rt.016 Rw.009 Duren Sawit Jakarta Timur";1533055;153305;0;0;0;0;0;0;44787
LT;061106084008000;"Mira Rebeka Sani";-;-;-;0;0;-;-;-;-;-;-
OF;PP0194;"Magozai 750 ml - (BELI 3 GRATIS 1)";562120;3;1686360;0;1533055;153305;0;0
FK;01;0;0041807547706;10;2018;25/10/2018;061106084008000;"Mira Rebeka Sani";"Jl. Kesenian Blok O 1/12 Rt.016 Rw.009 Duren Sawit Jakarta Timur";44545;4454;0;0;0;0;0;0;44789
LT;061106084008000;"Mira Rebeka Sani";-;-;-;0;0;-;-;-;-;-;-
OF;PP0309;"TOP UP Loyalty 2 Biorate";49000;1;49000;0;44545;4454;0;0
FK;01;0;0041807547709;10;2018;25/10/2018;082738550831000;"Harun D. Tumbuan";"Komplek RSD Madani No.19 Kota Palu Sualwesi Tengah";270000;27000;0;0;0;0;0;0;44791
LT;082738550831000;"Harun D. Tumbuan";-;-;-;0;0;-;-;-;-;-;-
OF;SK0022;"Starter Kit Oktober 2018 - 99rb";99000;3;297000;0;270000;27000;0;0
FK;01;0;0041807547722;10;2018;26/10/2018;478640824626000;"Anang Purwito";"Jl.SLAMET RIYADI GANG CENTRAL KAV 7 JEMBER 68112";710945;71094;0;0;0;0;0;0;44799
LT;478640824626000;"Anang Purwito";-;-;-;0;0;-;-;-;-;-;-
OF;PP080130;"Legres - (BELI 3 GRATIS 1)";130340;6;782040;0;710945;71094;0;0
FK;01;0;0041807547737;10;2018;26/10/2018;061106084008000;"Mira Rebeka Sani";"Jl. Kesenian Blok O 1/12 Rt.016 Rw.009 Duren Sawit Jakarta Timur";1966636;196663;0;0;0;0;0;0;44808
LT;061106084008000;"Mira Rebeka Sani";-;-;-;0;0;-;-;-;-;-;-
OF;PP0194;"Magozai 750 ml - (BELI 3 GRATIS 1)";562120;3;1686360;0;1533055;153305;0;0
OF;PP0323;"Legreskin - (Beli 2 atau Lebih Diskon 40%)";164970;2;329940;0;299945;29994;0;0
OF;PP0309;"TOP UP Loyalty 2 Biorate";49000;3;147000;0;133636;13364;0;0
FK;01;0;0041807547760;10;2018;27/10/2018;674087382114000;"IDA FENNY ELYSA";"JL. DEBLOD SUNDORO NO. 41 LK. II";13887218;1388722;0;0;0;0;0;0;44827
LT;674087382114000;"IDA FENNY ELYSA";-;-;-;0;0;-;-;-;-;-;-
OF;PP0237;"Asta-Gen - (Beli 3 Gratis 1)";279180;48;13400640;0;12182400;1218240;0;0
OF;PP080130;"Legres - (BELI 3 GRATIS 1)";125020;15;1875300;0;1704818;170482;0;0
FK;01;0;0041807547801;10;2018;29/10/2018;061106084008000;"Mira Rebeka Sani";"Jl. Kesenian Blok O 1/12 Rt.016 Rw.009 Duren Sawit Jakarta Timur";7545000;754500;0;0;0;0;0;0;44862
LT;061106084008000;"Mira Rebeka Sani";-;-;-;0;0;-;-;-;-;-;-
OF;PP0194;"Magozai 750 ml - (BELI 3 GRATIS 1)";562120;12;6745440;0;6132218;613222;0;0
OF;NT020015;Curcomplex-95;540500;2;1081000;0;982727;98273;0;0
OF;PP0309;"TOP UP Loyalty 2 Biorate";49000;2;98000;0;89091;8909;0;0
OF;PP080130;"Legres - (BELI 3 GRATIS 1)";125020;3;375060;0;340964;34096;0;0
FK;01;0;0041807547806;10;2018;29/10/2018;059461533732001;"Ir.HJ.Hayatun Fardah";"Jl. Garuda No.81 Kel. Komet Kec. Banjar Baru Utara Kab Banjarbaru -  Kalimantan Selatan";1829582;182958;0;0;0;0;0;0;44867
LT;059461533732001;"Ir.HJ.Hayatun Fardah";-;-;-;0;0;-;-;-;-;-;-
OF;PP0324;"Magozai Fruity - (Beli 2 atau Lebih Diskon 20%)";293750;4;1175000;0;1068182;106818;0;0
OF;PP080130;"Legres - (BELI 3 GRATIS 1)";125020;3;375060;0;340964;34096;0;0
OF;PP0328;"Sistocare - (Beli 2 atau Lebih Diskon 30%)";169200;2;338400;0;307636;30764;0;0
OF;PP0298;"StarKidz - (Beli 1 Gratis 1)";124080;1;124080;0;112800;11280;0;0
FK;01;0;0041807547808;10;2018;29/10/2018;059461533732001;"Ir.HJ.Hayatun Fardah";"Jl. Garuda No.81 Kel. Komet Kec. Banjar Baru Utara Kab Banjarbaru -  Kalimantan Selatan";3675109;367511;0;0;0;0;0;0;44869
LT;059461533732001;"Ir.HJ.Hayatun Fardah";-;-;-;0;0;-;-;-;-;-;-
OF;PP0194;"Magozai 750 ml - (BELI 3 GRATIS 1)";562120;6;3372720;0;3066109;306611;0;0
OF;MT0249;"Catalog Vol.4 Th.2018";7500;5;37500;0;34091;3409;0;0
OF;PP0309;"TOP UP Loyalty 2 Biorate";49000;6;294000;0;267273;26727;0;0
OF;PP0328;"Sistocare - (Beli 2 atau Lebih Diskon 30%)";169200;2;338400;0;307636;30764;0;0
FK;01;0;0041807547823;10;2018;29/10/2018;082738550831000;"Harun D. Tumbuan";"Komplek RSD Madani No.19 Kota Palu Sualwesi Tengah";10963092;1096308;0;0;0;0;0;0;44880
LT;082738550831000;"Harun D. Tumbuan";-;-;-;0;0;-;-;-;-;-;-
OF;HF060012;Glucosefit;346860;2;693720;0;630655;63065;0;0
OF;PP0316;"Calcium with Vit. D-(Beli 2 atau Lebih Diskon 30%)";188000;10;1880000;0;1709091;170909;0;0
OF;PP0325;"OsteoForte - (Beli 2 atau Lebih Special Price)";189410;10;1894100;0;1721909;172191;0;0
OF;NT020012;Legalon;336050;2;672100;0;611000;61100;0;0
OF;PP0313;"Bee Propolis 90 - (Beli 2 atau Lebih Diskon 20%)";408900;2;817800;0;743455;74345;0;0
OF;NT020010;Ginsana;371300;2;742600;0;675091;67509;0;0
OF;PP0194;"Magozai 750 ml - (BELI 3 GRATIS 1)";562120;9;5059080;0;4599164;459916;0;0
OF;MT0251;"Catalog Vol.4 Th.2018 (50 pcs)";300000;1;300000;0;272727;27273;0;0
FK;01;0;0041807547824;10;2018;29/10/2018;061106084008000;"Mira Rebeka Sani";"Jl. Kesenian Blok O 1/12 Rt.016 Rw.009 Duren Sawit Jakarta Timur";1513400;151340;0;0;0;0;0;0;44881
LT;061106084008000;"Mira Rebeka Sani";-;-;-;0;0;-;-;-;-;-;-
OF;NT020003;"Magozai 750ml";562120;2;1124240;0;1022036;102204;0;0
OF;NT020015;Curcomplex-95;540500;1;540500;0;491364;49136;0;0
FK;01;0;0041807547841;10;2018;29/10/2018;594682387037000;"Zainal Arifin.";"Jl. Thalib II No.5 Krukut - Tamansari Jakarta Barat";2348290;234829;0;0;0;0;0;0;44893
LT;594682387037000;"Zainal Arifin.";-;-;-;0;0;-;-;-;-;-;-
OF;PP02315;"Antioxidant Plus Pack - (Free Magozai 750 ml)";1249260;1;1249260;0;1135691;113569;0;0
OF;PP0330;"UC Synergy Eye Treat.-(Beli 2 atau Lebih Disk.30%)";126900;2;253800;0;230727;23073;0;0
OF;PP0323;"Legreskin - (Beli 2 atau Lebih Diskon 40%)";164970;2;329940;0;299945;29994;0;0
OF;PP080130;"Legres - (BELI 3 GRATIS 1)";125020;6;750120;0;681927;68193;0;0
FK;01;0;0041807547861;10;2018;30/10/2018;082738550831000;"Harun D. Tumbuan";"Komplek RSD Madani No.19 Kota Palu Sualwesi Tengah";7509363;750937;0;0;0;0;0;0;44908
LT;082738550831000;"Harun D. Tumbuan";-;-;-;0;0;-;-;-;-;-;-
OF;NT020015;Curcomplex-95;540500;5;2702500;0;2456818;245682;0;0
OF;HF060003;"Bee Propolis 90";512300;5;2561500;0;2328636;232864;0;0
OF;NT020012;Legalon;336050;6;2016300;0;1833000;183300;0;0
OF;PP0309;"TOP UP Loyalty 2 Biorate";49000;20;980000;0;890909;89091;0;0
FK;01;0;0041807547873;10;2018;30/10/2018;674087382114000;"IDA FENNY ELYSA";"JL. DEBLOD SUNDORO NO. 41 LK. II";986418;98642;0;0;0;0;0;0;44919
LT;674087382114000;"IDA FENNY ELYSA";-;-;-;0;0;-;-;-;-;-;-
OF;PP0331;"UC Day&Night; Cream-(Beli 2 atau Lebih Diskon 20%)";285290;2;570580;0;518709;51871;0;0
OF;PP0338;"BI 2 Serum - (Diskon 40%)";114680;2;229360;0;208509;20851;0;0
OF;PP0337;"BI 2 Facial Wash - (Diskon 20%)";93060;2;186120;0;169200;16920;0;0
OF;SK0022;"Starter Kit Oktober 2018 - 99rb";99000;1;99000;0;90000;9000;0;0
FK;01;0;0041807547876;10;2018;30/10/2018;674087382114000;"IDA FENNY ELYSA";"JL. DEBLOD SUNDORO NO. 41 LK. II";540000;54000;0;0;0;0;0;0;44921
LT;674087382114000;"IDA FENNY ELYSA";-;-;-;0;0;-;-;-;-;-;-
OF;SK0022;"Starter Kit Oktober 2018 - 99rb";99000;6;594000;0;540000;54000;0;0
FK;01;0;0041807547877;10;2018;30/10/2018;674087382114000;"IDA FENNY ELYSA";"JL. DEBLOD SUNDORO NO. 41 LK. II";6389437;638943;0;0;0;0;0;0;44922
LT;674087382114000;"IDA FENNY ELYSA";-;-;-;0;0;-;-;-;-;-;-
OF;PP080130;"Legres - (BELI 3 GRATIS 1)";125020;30;3750600;0;3409636;340964;0;0
OF;PP0194;"Magozai 750 ml - (BELI 3 GRATIS 1)";562120;3;1686360;0;1533055;153305;0;0
OF;NT0024;"Magozai Fruity";366600;4;1466400;0;1333091;133309;0;0
OF;NT020001;Legres;125020;1;125020;0;113655;11365;0;0
FK;01;0;0041807547905;10;2018;30/10/2018;594682387037000;"Zainal Arifin.";"Jl. Thalib II No.5 Krukut - Tamansari Jakarta Barat";3066109;306611;0;0;0;0;0;0;44950
LT;594682387037000;"Zainal Arifin.";-;-;-;0;0;-;-;-;-;-;-
OF;PP0194;"Magozai 750 ml - (BELI 3 GRATIS 1)";562120;6;3372720;0;3066109;306611;0;0
FK;01;0;0041807547908;10;2018;30/10/2018;672354446619000;"Surjana Dewi Effendy";"JL. Manyar Tirtoyoso Selatan 4 no. 11 RT 007 RW 005 Manyarsabrangan Mulyorejo surabaya";7582601;758259;0;0;0;0;0;0;44952
LT;672354446619000;"Surjana Dewi Effendy";-;-;-;0;0;-;-;-;-;-;-
OF;NT020011;Asta-Gen;279180;2;558360;0;507600;50760;0;0
OF;HF060008;"Coformula 60";540500;1;540500;0;491364;49136;0;0
OF;HF060011;"Salmon Oil (30)";139120;1;139120;0;126473;12647;0;0
OF;HF060010;"Salmon Oil (90)";310200;1;310200;0;282000;28200;0;0
OF;NT020001;Legres;125020;2;250040;0;227309;22731;0;0
OF;PP080130;"Legres - (BELI 3 GRATIS 1)";125020;6;750120;0;681927;68193;0;0
OF;PP0325;"OsteoForte - (Beli 2 atau Lebih Special Price)";189410;2;378820;0;344382;34438;0;0
OF;PP0194;"Magozai 750 ml - (BELI 3 GRATIS 1)";562120;9;5059080;0;4599164;459916;0;0
OF;PP0309;"TOP UP Loyalty 2 Biorate";49000;2;98000;0;89091;8909;0;0
OF;NT020007;Sistocare;256620;1;256620;0;233291;23329;0;0
FK;01;0;0041807547909;10;2018;30/10/2018;594682387037000;"Zainal Arifin.";"Jl. Thalib II No.5 Krukut - Tamansari Jakarta Barat";16863600;1686360;0;0;0;0;0;0;44953
LT;594682387037000;"Zainal Arifin.";-;-;-;0;0;-;-;-;-;-;-
OF;PP0194;"Magozai 750 ml - (BELI 3 GRATIS 1)";562120;33;18549960;0;16863600;1686360;0;0
FK;01;0;0041807547932;10;2018;31/10/2018;672354446619000;"Surjana Dewi Effendy";"JL. Manyar Tirtoyoso Selatan 4 no. 11 RT 007 RW 005 Manyarsabrangan Mulyorejo surabaya";2356408;235642;0;0;0;0;0;0;44975
LT;672354446619000;"Surjana Dewi Effendy";-;-;-;0;0;-;-;-;-;-;-
OF;NT020008;Biorate;246750;1;246750;0;224318;22432;0;0
OF;HF060012;Glucosefit;346860;1;346860;0;315327;31533;0;0
OF;NT020001;Legres;125020;6;750120;0;681927;68193;0;0
OF;NT020017;"Magozai 375ml";343100;2;686200;0;623818;62382;0;0
OF;NT020003;"Magozai 750ml";562120;1;562120;0;511018;51102;0;0
FK;01;0;0041807547968;10;2018;31/10/2018;082738550831000;"Harun D. Tumbuan";"Komplek RSD Madani No.19 Kota Palu Sualwesi Tengah";14105127;1410513;0;0;0;0;0;0;45011
LT;082738550831000;"Harun D. Tumbuan";-;-;-;0;0;-;-;-;-;-;-
OF;PP0194;"Magozai 750 ml - (BELI 3 GRATIS 1)";562120;18;10118160;0;9198327;919833;0;0
OF;PP02316;"Care For Cancer - (Free magozai 750 ml)";1349370;4;5397480;0;4906800;490680;0;0
FK;01;0;0041807548041;10;2018;31/10/2018;579473596823000;"Supantia Saleh";"Jl. Bitung Tengah RT.010 Rw.004. Bitung Tengah - Maesa Bitung";267273;26727;0;0;0;0;0;0;45070
LT;579473596823000;"Supantia Saleh";-;-;-;0;0;-;-;-;-;-;-
OF;PP0309;"TOP UP Loyalty 2 Biorate";49000;6;294000;0;267273;26727;0;0
FK;01;0;0041807548074;10;2018;31/10/2018;674087382114000;"IDA FENNY ELYSA";"JL. DEBLOD SUNDORO NO. 41 LK. II";11664545;1166454;0;0;0;0;0;0;45102
LT;674087382114000;"IDA FENNY ELYSA";-;-;-;0;0;-;-;-;-;-;-
OF;NT020001;Legres;125020;18;2250360;0;2045782;204578;0;0
OF;PP0194;"Magozai 750 ml - (BELI 3 GRATIS 1)";562120;12;6745440;0;6132218;613222;0;0
OF;NT0024;"Magozai Fruity";366600;2;733200;0;666545;66654;0;0
OF;HF060010;"Salmon Oil (90)";310200;10;3102000;0;2820000;282000;0;0
FK;01;0;0041807548080;10;2018;31/10/2018;061106084008000;"Mira Rebeka Sani";"Jl. Kesenian Blok O 1/12 Rt.016 Rw.009 Duren Sawit Jakarta Timur";133636;13364;0;0;0;0;0;0;45107
LT;061106084008000;"Mira Rebeka Sani";-;-;-;0;0;-;-;-;-;-;-
OF;PP0309;"TOP UP Loyalty 2 Biorate";49000;3;147000;0;133636;13364;0;0
FK;01;0;0041807548105;10;2018;31/10/2018;674087382114000;"IDA FENNY ELYSA";"JL. DEBLOD SUNDORO NO. 41 LK. II";4316308;431631;0;0;0;0;0;0;45130
LT;674087382114000;"IDA FENNY ELYSA";-;-;-;0;0;-;-;-;-;-;-
OF;PP0194;"Magozai 750 ml - (BELI 3 GRATIS 1)";562120;6;3372720;0;3066109;306611;0;0
OF;PP0338;"BI 2 Serum - (Diskon 40%)";114680;4;458720;0;417018;41702;0;0
OF;PP0314;"Bee Propolis Liquid-(Beli 2 atau Lebih Diskon 30%)";195990;2;391980;0;356345;35634;0;0
OF;PP0328;"Sistocare - (Beli 2 atau Lebih Diskon 30%)";169200;2;338400;0;307636;30764;0;0
OF;PP0337;"BI 2 Facial Wash - (Diskon 20%)";93060;2;186120;0;169200;16920;0;0
FK;01;0;0041807548148;10;2018;31/10/2018;579473596823000;"Supantia Saleh";"Jl. Bitung Tengah RT.010 Rw.004. Bitung Tengah - Maesa Bitung";3667127;366713;0;0;0;0;0;0;45172
LT;579473596823000;"Supantia Saleh";-;-;-;0;0;-;-;-;-;-;-
OF;NT020003;"Magozai 750ml";562120;7;3934840;0;3577127;357713;0;0
OF;SK0022;"Starter Kit Oktober 2018 - 99rb";99000;1;99000;0;90000;9000;0;0
FK;01;0;0041807548149;10;2018;31/10/2018;579473596823000;"Supantia Saleh";"Jl. Bitung Tengah RT.010 Rw.004. Bitung Tengah - Maesa Bitung";90000;9000;0;0;0;0;0;0;45173
LT;579473596823000;"Supantia Saleh";-;-;-;0;0;-;-;-;-;-;-
OF;SK0022;"Starter Kit Oktober 2018 - 99rb";99000;1;99000;0;90000;9000;0;0
