RK;NPWP;NAMA;KD_JENIS_TRANSAKSI;FG_PENGGANTI;NOMOR_FAKTUR;TANGGAL_FAKTUR;NO_DOKUMEN_FAKTUR;TANGGAL_RETUR;MASA_PAJAK_RETUR;TAHUN_PAJAK_RETUR;NILAI_RETUR_DPP;NILAI_RETUR_PPN;NILAI_RETUR_PPNBM
RK;059461533732001;"Ir.HJ.Hayatun Fardah";01;0;0021873664838;05/06/2018;0064/UHNCAB/RET/2018;05/06/2018;6;2018;5681018;568102;0
RK;000000000000000;"Syahwal SP";01;0;0021873664862;06/06/2018;0065/UHNCAB/RET/2018;06/06/2018;6;2018;890909;89091;0
RK;000000000000000;"Eni Suhartatik";01;0;0021873664863;06/06/2018;0066/UHNCAB/RET/2018;06/06/2018;6;2018;16522636;1652264;0
RK;000000000000000;FARIDAH;01;0;0021873664821;04/06/2018;0067/UHNCAB/RET/2018;07/06/2018;6;2018;8676200;867620;0
RK;000000000000000;Zulima.;01;0;0021873664833;04/06/2018;0068/UHNCAB/RET/2018;08/06/2018;6;2018;450000;45000;0
RK;000000000000000;Samsiar;01;0;0021873665108;09/06/2018;0069/UHNCAB/RET/2018;09/06/2018;6;2018;447782;44778;0
RK;061106084008000;"Mira Rebeka Sani";01;0;0021873665244;20/06/2018;0070/UHNCAB/RET/2018;21/06/2018;6;2018;1022036;102204;0
RK;000000000000000;"Eni Suhartatik";01;0;0021873665301;21/06/2018;0071/UHNCAB/RET/2018;22/06/2018;6;2018;2551673;255167;0
RK;059461533732001;"Ir.HJ.Hayatun Fardah";01;0;0021873665427;25/06/2018;0072/UHNCAB/RET/2018;25/06/2018;6;2018;5953618;595362;0
RK;000000000000000;"RATNA RAHAYUNI";01;0;0021873665461;25/06/2018;0073/UHNCAB/RET/2018;25/06/2018;6;2018;14570855;1457085;0
RK;000000000000000;"Nani Hardi Astuti";01;0;0021873665475;25/06/2018;0074/UHNCAB/RET/2018;26/06/2018;6;2018;8582600;858260;0
RK;000000000000000;"DAMARIS TIKU";01;0;0021873665485;26/06/2018;0075/UHNCAB/RET/2018;26/06/2018;6;2018;931455;93145;0
RK;000000000000000;"Harlia Sepulustina Siahaan";01;0;0021873665535;27/06/2018;0076/UHNCAB/RET/2018;27/06/2018;6;2018;165355;16535;0
RK;000000000000000;Delvira.;01;0;0021873665592;27/06/2018;0077/UHNCAB/RET/2018;29/06/2018;6;2018;2727709;272771;0
RK;000000000000000;"SUSANTI, SE";01;0;0021873665762;30/06/2018;0078/UHNCAB/RET/2018;30/06/2018;6;2018;1870600;187060;0
RK;000000000000000;"Jifly Frenla Polii";01;0;0021873665892;30/06/2018;0080/UHNCAB/RET/2018;30/06/2018;6;2018;3698891;369889;0
RK;000000000000000;"Ekat Hawini";01;0;0021873665754;30/06/2018;0079/UHNCAB/RET/2018;30/06/2018;6;2018;1648182;164818;0
