0SP201612080033059008 00030331               00000000476684659.0000493BCA               BONUS MEMBER000000NOVEMBER 201600000                                                                             
13890296598                        00000000000327500.0000000                                                                                    BONUS MEMBER      NOVEMBER 2016                       014
11010492820                        00000000000051357.0000000                                                                                    BONUS MEMBER      NOVEMBER 2016                       014
17685051231                        00000000001316784.00A YUDI JAYA MUSRADHY P                                                                   BONUS MEMBER      NOVEMBER 2016                       014
17870363812                        00000000000985904.00ABDUL AZIZ MUSLIM                                                                        BONUS MEMBER      NOVEMBER 2016                       014
13880409866                        00000000000233770.00ACHMAD YUSUF DR SPKK                                                                     BONUS MEMBER      NOVEMBER 2016                       014
12540341161                        00000000000117495.00ADIEK ACHMAD SAFI\`I                                                                     BONUS MEMBER      NOVEMBER 2016                       014
11941100509                        00000000000507577.00ADRIANUS HARTONO                                                                         BONUS MEMBER      NOVEMBER 2016                       014
17910573050                        00000000000911933.00ADRYAN FRISTIOHADI MSC-A                                                                 BONUS MEMBER      NOVEMBER 2016                       014
10657178440                        00000000000203574.00AGATHA THERESSIA                                                                         BONUS MEMBER      NOVEMBER 2016                       014
16170186760                        00000000000061300.00AGNES SINTA SARI                                                                         BONUS MEMBER      NOVEMBER 2016                       014
17735034995                        00000000000200579.00AGUS HARIYANTO                                                                           BONUS MEMBER      NOVEMBER 2016                       014
16665052579                        00000000000076480.00AGUSTINA EKA BUDI                                                                        BONUS MEMBER      NOVEMBER 2016                       014
10540838909                        00000000000089788.00ALAN DWILANGGA                                                                           BONUS MEMBER      NOVEMBER 2016                       014
10290244889                        00000000003341519.00ALBERT THERIONO.LIM                                                                      BONUS MEMBER      NOVEMBER 2016                       014
14582204377                        00000000000417577.00ALDO LAMMY                                                                               BONUS MEMBER      NOVEMBER 2016                       014
12581605007                        00000000000347047.00ALFRYATI VENTHY SANDA SAU TAN                                                            BONUS MEMBER      NOVEMBER 2016                       014
12200053624                        00000000000073017.00AMAN YULIUS                                                                              BONUS MEMBER      NOVEMBER 2016                       014
15115024431                        00000000000050007.00AMELIA ANITA YESSI MANDOLANG                                                             BONUS MEMBER      NOVEMBER 2016                       014
17975243478                        00000000000054024.00AMNAWATY DUKALANG                                                                        BONUS MEMBER      NOVEMBER 2016                       014
17920703920                        00000000000105167.00ANDI FATDA LAYLI                                                                         BONUS MEMBER      NOVEMBER 2016                       014
17910175402                        00000000000221220.00ANDI SEI                                                                                 BONUS MEMBER      NOVEMBER 2016                       014
10270948880                        00000000000128344.00ANDRE ABENG                                                                              BONUS MEMBER      NOVEMBER 2016                       014
13000615551                        00000000000058292.00ANDREAN                                                                                  BONUS MEMBER      NOVEMBER 2016                       014
17955062035                        00000000000519753.00ANDREW CAVIN P                                                                           BONUS MEMBER      NOVEMBER 2016                       014
17720119999                        00000000000106591.00ANDRIANTO TEDDY WIJAYA                                                                   BONUS MEMBER      NOVEMBER 2016                       014
10102198172                        00000000000050169.00ANIS YULIANTI                                                                            BONUS MEMBER      NOVEMBER 2016                       014
10530136345                        00000000001779179.00ANITJE MAHESO                                                                            BONUS MEMBER      NOVEMBER 2016                       014
11000062762                        00000000000063967.00ANNI ANDRAWATI                                                                           BONUS MEMBER      NOVEMBER 2016                       014
10721022195                        00000000000071591.00ANTONIUS PURNAWARMAN T                                                                   BONUS MEMBER      NOVEMBER 2016                       014
10320912555                        00000000000137186.00ANTONY FIRGO IR                                                                          BONUS MEMBER      NOVEMBER 2016                       014
11970182825                        00000000000073877.00ARIANNY BUDIMAN SH                                                                       BONUS MEMBER      NOVEMBER 2016                       014
18140035352                        00000000000307597.00ARIE PARMINDANI RENMAUR                                                                  BONUS MEMBER      NOVEMBER 2016                       014
17910671256                        00000000001016033.00ARIF SETIALAN                                                                            BONUS MEMBER      NOVEMBER 2016                       014
15465242440                        00000000000515590.00ARIFANDI IRIANTO HAMZAH                                                                  BONUS MEMBER      NOVEMBER 2016                       014
14050227427                        00000000003098819.00ARIS YULIANTO                                                                            BONUS MEMBER      NOVEMBER 2016                       014
10530013669                        00000000000220622.00ARNIS H LAKAONI                                                                          BONUS MEMBER      NOVEMBER 2016                       014
11071200936                        00000000000130889.00BAMBANG APRILIANTO                                                                       BONUS MEMBER      NOVEMBER 2016                       014
17870079944                        00000000001105209.00BAMBANG MARDIYANTO                                                                       BONUS MEMBER      NOVEMBER 2016                       014
14720197681                        00000000000103301.00BAMBANG SUDJOKO DRS EC                                                                   BONUS MEMBER      NOVEMBER 2016                       014
17870304379                        00000000000548546.00BENNY ALAMSYAH                                                                           BONUS MEMBER      NOVEMBER 2016                       014
10881122421                        00000000000124573.00BENNY WONGSODIPUTRA                                                                      BONUS MEMBER      NOVEMBER 2016                       014
12533226078                        00000000000079390.00BENYAMIN RAHAYU                                                                          BONUS MEMBER      NOVEMBER 2016                       014
11711037034                        00000000000113146.00BIBIANA                                                                                  BONUS MEMBER      NOVEMBER 2016                       014
10251071356                        00000000000314154.00BING SEBASTIAN RUSLI                                                                     BONUS MEMBER      NOVEMBER 2016                       014
10885138417                        00000000000050120.00BOYKE MAIKEL                                                                             BONUS MEMBER      NOVEMBER 2016                       014
10182608325                        00000000000308182.00BUDI SANTOSO                                                                             BONUS MEMBER      NOVEMBER 2016                       014
11520228035                        00000000000074036.00CHAM MEU FU                                                                              BONUS MEMBER      NOVEMBER 2016                       014
16970053369                        00000000000516618.00CHANDRA PURNAMA GUNARTO                                                                  BONUS MEMBER      NOVEMBER 2016                       014
14050005025                        00000000000783368.00CHARLES SURYA GUNARTO                                                                    BONUS MEMBER      NOVEMBER 2016                       014
13691033021                        00000000000839966.00CHARLIE BUDIMAN SH                                                                       BONUS MEMBER      NOVEMBER 2016                       014
14710032497                        00000000001659703.00CHARLOTHA PUTRI SHARON                                                                   BONUS MEMBER      NOVEMBER 2016                       014
10268518561                        00000000000629142.00CHRISTIAN JUDHISTIRA K H                                                                 BONUS MEMBER      NOVEMBER 2016                       014
17880895219                        00000000001359454.00CHRISTIAN YENDI                                                                          BONUS MEMBER      NOVEMBER 2016                       014
12540401601                        00000000000124625.00CHRISTIANUS A.DWIDO                                                                      BONUS MEMBER      NOVEMBER 2016                       014
17920438878                        00000000000050726.00CHRISTINE                                                                                BONUS MEMBER      NOVEMBER 2016                       014
11020393170                        00000000001194057.00CHRISTINE YURIS MELINDA KADANG                                                           BONUS MEMBER      NOVEMBER 2016                       014
10272374196                        00000000000058947.00CONY NELYTA RENY                                                                         BONUS MEMBER      NOVEMBER 2016                       014
12540095739                        00000000000213397.00CORINA LUCHAS                                                                            BONUS MEMBER      NOVEMBER 2016                       014
18050030734                        00000000000137459.00CORNELIA CHANDRA BSC                                                                     BONUS MEMBER      NOVEMBER 2016                       014
15455312181                        00000000000051114.00CORRY HERAWATI                                                                           BONUS MEMBER      NOVEMBER 2016                       014
11191719811                        00000000003449108.00DAHLIA                                                                                   BONUS MEMBER      NOVEMBER 2016                       014
12540141323                        00000000000117897.00DANA RITA                                                                                BONUS MEMBER      NOVEMBER 2016                       014
18140306372                        00000000000058292.00DANI FADRYANA                                                                            BONUS MEMBER      NOVEMBER 2016                       014
17890816511                        00000000000051988.00DANNES, S.KOM                                                                            BONUS MEMBER      NOVEMBER 2016                       014
11630357205                        00000000000637067.00DARMAWAN TEDJA                                                                           BONUS MEMBER      NOVEMBER 2016                       014
16540127008                        00000000000096268.00DEASY CHRISTY LATUMETTEN                                                                 BONUS MEMBER      NOVEMBER 2016                       014
18140331041                        00000000000056110.00DECKY YORICKHSON TUANGE                                                                  BONUS MEMBER      NOVEMBER 2016                       014
17890068582                        00000000001288213.00DEDENG DESRIADI A                                                                        BONUS MEMBER      NOVEMBER 2016                       014
17955140486                        00000000000173528.00DEISY OPING                                                                              BONUS MEMBER      NOVEMBER 2016                       014
17025018966                        00000000000295045.00DELLY MULIARIADI                                                                         BONUS MEMBER      NOVEMBER 2016                       014
11191899321                        00000000013263789.00DELVIRA                                                                                  BONUS MEMBER      NOVEMBER 2016                       014
17955108671                        00000000000054510.00DEMSY OPING                                                                              BONUS MEMBER      NOVEMBER 2016                       014
17020435628                        00000000000163780.00DESIANTI SARI                                                                            BONUS MEMBER      NOVEMBER 2016                       014
15000029396                        00000000000050824.00DESY                                                                                     BONUS MEMBER      NOVEMBER 2016                       014
17840016620                        00000000000060363.00DEVI                                                                                     BONUS MEMBER      NOVEMBER 2016                       014
11196030221                        00000000001580865.00DEWI                                                                                     BONUS MEMBER      NOVEMBER 2016                       014
10261613742                        00000000000263642.00DEWI PURNAMA                                                                             BONUS MEMBER      NOVEMBER 2016                       014
10290788510                        00000000000091806.00DEWI SANDRAWATI                                                                          BONUS MEMBER      NOVEMBER 2016                       014
16460217715                        00000000000053200.00DINI ANGGRIANI SIJOATMOD                                                                 BONUS MEMBER      NOVEMBER 2016                       014
17920178531                        00000000001567257.00DIONISIUS RORI PARENGKUA                                                                 BONUS MEMBER      NOVEMBER 2016                       014
12540294553                        00000000000050969.00DJOKO BUNTORO                                                                            BONUS MEMBER      NOVEMBER 2016                       014
18140044661                        00000000000058292.00DOLFIEN MAGHDA LUMINGKEWAS                                                               BONUS MEMBER      NOVEMBER 2016                       014
13301047388                        00000000000055754.00DOTTY JOEDOWATI                                                                          BONUS MEMBER      NOVEMBER 2016                       014
10323801476                        00000000000055706.00DR WIDYARMAN                                                                             BONUS MEMBER      NOVEMBER 2016                       014
11830773718                        00000000000233922.00DWI QHORINUR AKHIM M YAS                                                                 BONUS MEMBER      NOVEMBER 2016                       014
16750111163                        00000000001052276.00EDDY SUWARNO                                                                             BONUS MEMBER      NOVEMBER 2016                       014
17910585325                        00000000005009884.00EKAWATI K                                                                                BONUS MEMBER      NOVEMBER 2016                       014
18140011186                        00000000000416391.00ELISA SUTIMIN                                                                            BONUS MEMBER      NOVEMBER 2016                       014
11410476271                        00000000002065014.00ELISABET SANTOSO                                                                         BONUS MEMBER      NOVEMBER 2016                       014
11190892448                        00000000000124265.00ELISYE TJHANG                                                                            BONUS MEMBER      NOVEMBER 2016                       014
18295014811                        00000000000076989.00ELLEN JEANNE SANGARI                                                                     BONUS MEMBER      NOVEMBER 2016                       014
12331649033                        00000000000298804.00ELLYANY SUGIAMAN                                                                         BONUS MEMBER      NOVEMBER 2016                       014
10021223785                        00000000001074190.00ELLYJATY SALIM                                                                           BONUS MEMBER      NOVEMBER 2016                       014
15315000111                        00000000000259064.00ELVIRA ANNE WANTAH                                                                       BONUS MEMBER      NOVEMBER 2016                       014
11199009948                        00000000000520458.00ELVY SUHARTI MAHYUDIN                                                                    BONUS MEMBER      NOVEMBER 2016                       014
12581563851                        00000000011979414.00EMMY INDRIATY                                                                            BONUS MEMBER      NOVEMBER 2016                       014
10210294228                        00000000000312432.00ENAH                                                                                     BONUS MEMBER      NOVEMBER 2016                       014
17910296374                        00000000000131833.00ERLIS SADYA KENCANA                                                                      BONUS MEMBER      NOVEMBER 2016                       014
14050254823                        00000000000052521.00ERNAWATI,SE                                                                              BONUS MEMBER      NOVEMBER 2016                       014
12800894614                        00000000000408880.00ERNI WIDAYATI                                                                            BONUS MEMBER      NOVEMBER 2016                       014
15235140907                        00000000000737341.00ERNIE TRISNO                                                                             BONUS MEMBER      NOVEMBER 2016                       014
18140329909                        00000000000053200.00ERWIN MAMAHIT                                                                            BONUS MEMBER      NOVEMBER 2016                       014
12411119434                        00000000000070810.00ERWINA ZULKARNAIN                                                                        BONUS MEMBER      NOVEMBER 2016                       014
18600271122                        00000000000507588.00ESLYN R. JABAR                                                                           BONUS MEMBER      NOVEMBER 2016                       014
10281796967                        00000000000072553.00ESTER JULIATI SUSANTO                                                                    BONUS MEMBER      NOVEMBER 2016                       014
12881053146                        00000000000083610.00ESTER JUNINGSIH SUDIONO                                                                  BONUS MEMBER      NOVEMBER 2016                       014
10640557265                        00000000000272881.00ESTIANI                                                                                  BONUS MEMBER      NOVEMBER 2016                       014
13981098941                        00000000000051389.00FATMAWATI ALWI                                                                           BONUS MEMBER      NOVEMBER 2016                       014
17910658616                        00000000000058341.00FEBRIAN DARWIS                                                                           BONUS MEMBER      NOVEMBER 2016                       014
17975224384                        00000000000058438.00FEBRYANTI MADAUNA                                                                        BONUS MEMBER      NOVEMBER 2016                       014
11010841743                        00000000000115765.00FEMMY ANTE                                                                               BONUS MEMBER      NOVEMBER 2016                       014
18140135462                        00000000000053152.00FENNY WIDHIASTUTY TESALONICA                                                             BONUS MEMBER      NOVEMBER 2016                       014
10060230340                        00000000000536275.00FERDYNANDS SAMPE                                                                         BONUS MEMBER      NOVEMBER 2016                       014
10260168916                        00000000000055382.00FERRY RAMBITAN                                                                           BONUS MEMBER      NOVEMBER 2016                       014
12771143956                        00000000000085598.00FIANTY ROSSANA GOSAL                                                                     BONUS MEMBER      NOVEMBER 2016                       014
17920546000                        00000000000100488.00FIFI YULIANTI SALIM                                                                      BONUS MEMBER      NOVEMBER 2016                       014
18295037861                        00000000000331134.00FILLY LADY DIANE FRANCES                                                                 BONUS MEMBER      NOVEMBER 2016                       014
17970003651                        00000000003078849.00FITRIYANTI RASYID                                                                        BONUS MEMBER      NOVEMBER 2016                       014
10261679051                        00000000000544161.00FRANKY HEROL MANDALIKA                                                                   BONUS MEMBER      NOVEMBER 2016                       014
16750190993                        00000000000105168.00FRANSISCA                                                                                BONUS MEMBER      NOVEMBER 2016                       014
13992171615                        00000000000058292.00FRANSISCA CORI PRATIWI S                                                                 BONUS MEMBER      NOVEMBER 2016                       014
10491569688                        00000000003220713.00FRANSISKUS YANNO SOERATMAN                                                               BONUS MEMBER      NOVEMBER 2016                       014
10931388737                        00000000000619632.00FREDDY BOLANG                                                                            BONUS MEMBER      NOVEMBER 2016                       014
13000443874                        00000000000059262.00FREDI                                                                                    BONUS MEMBER      NOVEMBER 2016                       014
17920342226                        00000000000104291.00FRELIYANTI                                                                               BONUS MEMBER      NOVEMBER 2016                       014
15271146583                        00000000000138463.00GAVRILA SETIAWAN                                                                         BONUS MEMBER      NOVEMBER 2016                       014
14450917406                        00000000000095929.00GEOFFREY W O PALIAMA                                                                     BONUS MEMBER      NOVEMBER 2016                       014
10640357029                        00000000000105168.00GIDEON                                                                                   BONUS MEMBER      NOVEMBER 2016                       014
10181151811                        00000000000079390.00GINAWATI                                                                                 BONUS MEMBER      NOVEMBER 2016                       014
10870065515                        00000000000634614.00GO MEYER GAUTAMA                                                                         BONUS MEMBER      NOVEMBER 2016                       014
10831144199                        00000000000320852.00GO SUZY                                                                                  BONUS MEMBER      NOVEMBER 2016                       014
10151133851                        00000000000054631.00GOEIJFANG FANG PETER                                                                     BONUS MEMBER      NOVEMBER 2016                       014
17460134557                        00000000000146902.00GOUW GIOK ING / ELLY                                                                     BONUS MEMBER      NOVEMBER 2016                       014
17920780088                        00000000000175008.00GRACIA STEFANI TJIOE                                                                     BONUS MEMBER      NOVEMBER 2016                       014
10272624362                        00000000000100730.00GRATIA SELLA BUSTANI                                                                     BONUS MEMBER      NOVEMBER 2016                       014
12580127617                        00000000000068647.00GUNADI WIBOWO TOEMALI, DRS                                                               BONUS MEMBER      NOVEMBER 2016                       014
17975227260                        00000000000051745.00GUNARTO MONOARFA                                                                         BONUS MEMBER      NOVEMBER 2016                       014
12450197397                        00000000000104512.00H. EDI JUNAEDI                                                                           BONUS MEMBER      NOVEMBER 2016                       014
17260909546                        00000000000116069.00HADI SOEDJAJA PRAMONO                                                                    BONUS MEMBER      NOVEMBER 2016                       014
13900389212                        00000000003595336.00HAMSIAH SANGKALA                                                                         BONUS MEMBER      NOVEMBER 2016                       014
17920451742                        00000000001998381.00HANIFA                                                                                   BONUS MEMBER      NOVEMBER 2016                       014
17380285732                        00000000000051034.00HANNA TUMEWU                                                                             BONUS MEMBER      NOVEMBER 2016                       014
17920237333                        00000000000132788.00HARDY GONDOKUSUMO                                                                        BONUS MEMBER      NOVEMBER 2016                       014
10291799719                        00000000000854255.00HARI LIEWARNATA IR MM                                                                    BONUS MEMBER      NOVEMBER 2016                       014
13640823487                        00000000000051462.00HARMAN ANDRIANTO, TJIA                                                                   BONUS MEMBER      NOVEMBER 2016                       014
14800127748                        00000000000268104.00HARTI ROESMAN                                                                            BONUS MEMBER      NOVEMBER 2016                       014
17795019669                        00000000020718556.00HARUN D. TUMBUAN                                                                         BONUS MEMBER      NOVEMBER 2016                       014
18190287671                        00000000000103567.00HARY PUTRA                                                                               BONUS MEMBER      NOVEMBER 2016                       014
10212811287                        00000000000264313.00HASAN. ST                                                                                BONUS MEMBER      NOVEMBER 2016                       014
17955125061                        00000000000114019.00HASDAYANTI LOLO PAYUNG                                                                   BONUS MEMBER      NOVEMBER 2016                       014
17870016845                        00000000000102460.00HASNAH                                                                                   BONUS MEMBER      NOVEMBER 2016                       014
17920475943                        00000000000534777.00HASNIAH SYAH,DR                                                                          BONUS MEMBER      NOVEMBER 2016                       014
17685089955                        00000000000425146.00HASNIH S                                                                                 BONUS MEMBER      NOVEMBER 2016                       014
10272616980                        00000000000245312.00HELEN TANSIL                                                                             BONUS MEMBER      NOVEMBER 2016                       014
18140210081                        00000000000108320.00HELENA A KAFUDJI SH                                                                      BONUS MEMBER      NOVEMBER 2016                       014
10210293884                        00000000000981191.00HENDARTO SANTOSO                                                                         BONUS MEMBER      NOVEMBER 2016                       014
11196046357                        00000000000265630.00HENDRA                                                                                   BONUS MEMBER      NOVEMBER 2016                       014
14720143319                        00000000000593393.00HENDRATA SUHADA                                                                          BONUS MEMBER      NOVEMBER 2016                       014
17955163206                        00000000000054510.00HENDRIKUS FERDI                                                                          BONUS MEMBER      NOVEMBER 2016                       014
15930446167                        00000000000050048.00HENNY KAIRUPAN                                                                           BONUS MEMBER      NOVEMBER 2016                       014
17920677546                        00000000000051842.00HENY RATNAWATI - S PD                                                                    BONUS MEMBER      NOVEMBER 2016                       014
17935018889                        00000000000116008.00HERLINA                                                                                  BONUS MEMBER      NOVEMBER 2016                       014
16580593338                        00000000000061542.00HERMAN TEDJA                                                                             BONUS MEMBER      NOVEMBER 2016                       014
12101099000                        00000000000051034.00HERNIWATY UTAMA                                                                          BONUS MEMBER      NOVEMBER 2016                       014
17925178389                        00000000000103393.00HERRY KURNIAWAN                                                                          BONUS MEMBER      NOVEMBER 2016                       014
12540156053                        00000000000388064.00HJ SULIAH IR                                                                             BONUS MEMBER      NOVEMBER 2016                       014
17870017426                        00000000000610036.00HJ WENNY ROSITA                                                                          BONUS MEMBER      NOVEMBER 2016                       014
17910342228                        00000000000073447.00HJ.ANDI DADJENG,SE                                                                       BONUS MEMBER      NOVEMBER 2016                       014
17910313015                        00000000000052169.00HJ.INDRIATI NINGSIH                                                                      BONUS MEMBER      NOVEMBER 2016                       014
10210694960                        00000000000644211.00HUDIJAH                                                                                  BONUS MEMBER      NOVEMBER 2016                       014
12770199151                        00000000000158324.00HUI LING                                                                                 BONUS MEMBER      NOVEMBER 2016                       014
11191707121                        00000000001737094.00HUSAIRI NATILA                                                                           BONUS MEMBER      NOVEMBER 2016                       014
11302222414                        00000000000447427.00I G A WARDHANA                                                                           BONUS MEMBER      NOVEMBER 2016                       014
17920051108                        00000000000058292.00I NYOMAN SUARYA                                                                          BONUS MEMBER      NOVEMBER 2016                       014
13880343768                        00000000000086326.00IKAWATI POEDJIONO                                                                        BONUS MEMBER      NOVEMBER 2016                       014
11981615498                        00000000000452828.00IMANUEL ADAM                                                                             BONUS MEMBER      NOVEMBER 2016                       014
17920203412                        00000000000274347.00IMELDA                                                                                   BONUS MEMBER      NOVEMBER 2016                       014
11440327261                        00000000000051721.00IMELDA ESTER MARLINDA S SH                                                               BONUS MEMBER      NOVEMBER 2016                       014
18840434941                        00000000000073877.00INCA ISADORA DAUNAN                                                                      BONUS MEMBER      NOVEMBER 2016                       014
10183766217                        00000000000050581.00INDANA ZULFA                                                                             BONUS MEMBER      NOVEMBER 2016                       014
18615071753                        00000000000052982.00INDARTI                                                                                  BONUS MEMBER      NOVEMBER 2016                       014
10241015270                        00000000000100618.00INDRIANA                                                                                 BONUS MEMBER      NOVEMBER 2016                       014
10101206822                        00000000000118691.00INDRIANI WINOTO                                                                          BONUS MEMBER      NOVEMBER 2016                       014
15880209959                        00000000009831027.00INDRIYATI SALIM                                                                          BONUS MEMBER      NOVEMBER 2016                       014
10884771397                        00000000000106599.00INGGRIATI DJOJOSEPUTRO D                                                                 BONUS MEMBER      NOVEMBER 2016                       014
12440015231                        00000000000081473.00INNEKE KUSUMO                                                                            BONUS MEMBER      NOVEMBER 2016                       014
11340719227                        00000000000072474.00IRAWAN                                                                                   BONUS MEMBER      NOVEMBER 2016                       014
10640485604                        00000000000783038.00IRMANTO                                                                                  BONUS MEMBER      NOVEMBER 2016                       014
17910178061                        00000000000470793.00IRVIANA HAPSARI TURUSI                                                                   BONUS MEMBER      NOVEMBER 2016                       014
18575095336                        00000000000050209.00ISABELA PRATAMI                                                                          BONUS MEMBER      NOVEMBER 2016                       014
17925038300                        00000000000067604.00IVINA                                                                                    BONUS MEMBER      NOVEMBER 2016                       014
18140090639                        00000000000107059.00JAKSON BOYOH                                                                             BONUS MEMBER      NOVEMBER 2016                       014
10530178102                        00000000000215142.00JAMES TEDDY TENDEAN                                                                      BONUS MEMBER      NOVEMBER 2016                       014
15260649207                        00000000000054202.00JANE SHALIMAR                                                                            BONUS MEMBER      NOVEMBER 2016                       014
15000013562                        00000000000998116.00JANTI NGADIMAN                                                                           BONUS MEMBER      NOVEMBER 2016                       014
10030200101                        00000000001007599.00JANTI W                                                                                  BONUS MEMBER      NOVEMBER 2016                       014
18140283623                        00000000000052497.00JAVET S A TUANGE                                                                         BONUS MEMBER      NOVEMBER 2016                       014
18140305473                        00000000000058341.00JEANETTE GORETTY PAAT                                                                    BONUS MEMBER      NOVEMBER 2016                       014
15000370977                        00000000000058002.00JENAWATI                                                                                 BONUS MEMBER      NOVEMBER 2016                       014
10181090234                        00000000001704033.00JOHANNES PUTRA MAYNINEDO                                                                 BONUS MEMBER      NOVEMBER 2016                       014
11191496111                        00000000000637351.00JON TOMI                                                                                 BONUS MEMBER      NOVEMBER 2016                       014
17955124626                        00000000000054510.00JONNY                                                                                    BONUS MEMBER      NOVEMBER 2016                       014
15000477704                        00000000000977481.00JOSEPHINE KOE                                                                            BONUS MEMBER      NOVEMBER 2016                       014
11781176392                        00000000001840284.00JOUSJE ADAM                                                                              BONUS MEMBER      NOVEMBER 2016                       014
11681694248                        00000000000700181.00JUANITA ICHSANI                                                                          BONUS MEMBER      NOVEMBER 2016                       014
12910359331                        00000000000073877.00JULIANA KULLIT                                                                           BONUS MEMBER      NOVEMBER 2016                       014
13981352279                        00000000000127429.00JUNISARIMI                                                                               BONUS MEMBER      NOVEMBER 2016                       014
10885727030                        00000000000157077.00KALEB YEREMIA YUNIOR KOR                                                                 BONUS MEMBER      NOVEMBER 2016                       014
17920725931                        00000000000175876.00KALSUM                                                                                   BONUS MEMBER      NOVEMBER 2016                       014
14870262014                        00000000000096268.00KARNIKA KARNELIA                                                                         BONUS MEMBER      NOVEMBER 2016                       014
15890134027                        00000000000066732.00KARTIKA                                                                                  BONUS MEMBER      NOVEMBER 2016                       014
12090328592                        00000000000074346.00KEUIS NURLUNAWATI                                                                        BONUS MEMBER      NOVEMBER 2016                       014
13020487452                        00000000000051648.00KIKI NURWAHYUNI                                                                          BONUS MEMBER      NOVEMBER 2016                       014
12671608145                        00000000000053200.00KINI HERTANTO                                                                            BONUS MEMBER      NOVEMBER 2016                       014
16460176768                        00000000000248170.00KO SOE TJIEN                                                                             BONUS MEMBER      NOVEMBER 2016                       014
18140311741                        00000000000121496.00KRISTIANA YUNIARTI,SE                                                                    BONUS MEMBER      NOVEMBER 2016                       014
12700086081                        00000000000077378.00KRISTIANI UTOMO                                                                          BONUS MEMBER      NOVEMBER 2016                       014
17855044188                        00000000000297415.00KRISTIN SUSILOWATI IKWAN                                                                 BONUS MEMBER      NOVEMBER 2016                       014
18615019433                        00000000000427401.00KUMALA DEWI                                                                              BONUS MEMBER      NOVEMBER 2016                       014
10290039053                        00000000000067604.00KUSMARI LIMIN                                                                            BONUS MEMBER      NOVEMBER 2016                       014
17920594608                        00000000000261135.00LA LA LA ALFRITS BAWUNTU                                                                 BONUS MEMBER      NOVEMBER 2016                       014
14131012939                        00000000000193708.00LANNY SANTOSO                                                                            BONUS MEMBER      NOVEMBER 2016                       014
17880132037                        00000000000079875.00LANY MANDANG                                                                             BONUS MEMBER      NOVEMBER 2016                       014
16840260508                        00000000000058923.00LAURENSIUS LEONARD PR                                                                    BONUS MEMBER      NOVEMBER 2016                       014
17955077326                        00000000000261750.00LENNY LIPUNAN                                                                            BONUS MEMBER      NOVEMBER 2016                       014
17910170584                        00000000000052448.00LENY UMAR                                                                                BONUS MEMBER      NOVEMBER 2016                       014
10510490436                        00000000000303145.00LEONORA AUGUSTA LEGOH                                                                    BONUS MEMBER      NOVEMBER 2016                       014
17380176011                        00000000000051786.00LIA MULYAWATI                                                                            BONUS MEMBER      NOVEMBER 2016                       014
13971165357                        00000000000197536.00LIAN BIE HUI                                                                             BONUS MEMBER      NOVEMBER 2016                       014
12871470865                        00000000000146902.00LIAN BIE KIEM                                                                            BONUS MEMBER      NOVEMBER 2016                       014
18170663684                        00000000000050338.00LIAWATI                                                                                  BONUS MEMBER      NOVEMBER 2016                       014
15505113621                        00000000000058292.00LIE MIE YIN                                                                              BONUS MEMBER      NOVEMBER 2016                       014
13843148910                        00000000000054461.00LIEM LI PIEN                                                                             BONUS MEMBER      NOVEMBER 2016                       014
10880370006                        00000000000058244.00LIEM LINDAWATI MASAJU                                                                    BONUS MEMBER      NOVEMBER 2016                       014
10182575346                        00000000000102217.00LIKE WIJAYA                                                                              BONUS MEMBER      NOVEMBER 2016                       014
10213175570                        00000000000058002.00LILI                                                                                     BONUS MEMBER      NOVEMBER 2016                       014
15200070064                        00000000000108732.00LILI MULJANI, SE                                                                         BONUS MEMBER      NOVEMBER 2016                       014
15780511526                        00000000000387064.00LILI YANA                                                                                BONUS MEMBER      NOVEMBER 2016                       014
17540460269                        00000000000281926.00LILIANY WIJAYA                                                                           BONUS MEMBER      NOVEMBER 2016                       014
18290723125                        00000000000254765.00LILIES DHARMANTO SIADY S                                                                 BONUS MEMBER      NOVEMBER 2016                       014
16240522720                        00000000000089788.00LILY CHRISTINA                                                                           BONUS MEMBER      NOVEMBER 2016                       014
12762222222                        00000000031725190.00LILY NGADIMAN                                                                            BONUS MEMBER      NOVEMBER 2016                       014
16595009557                        00000000000103972.00LILYANA GOEY                                                                             BONUS MEMBER      NOVEMBER 2016                       014
14050148799                        00000000000233329.00LIM AGATHA LIANA                                                                         BONUS MEMBER      NOVEMBER 2016                       014
10291538451                        00000000000067604.00LIM MUI LIE                                                                              BONUS MEMBER      NOVEMBER 2016                       014
10050398986                        00000000000080821.00LIM TJIU SIANG                                                                           BONUS MEMBER      NOVEMBER 2016                       014
10171829797                        00000000000050395.00LINA ARIESIANY GEOPUTRA                                                                  BONUS MEMBER      NOVEMBER 2016                       014
17795143955                        00000000004599824.00LINDA                                                                                    BONUS MEMBER      NOVEMBER 2016                       014
10261700599                        00000000000221803.00LINDA D WATANIA,MM.DRA                                                                   BONUS MEMBER      NOVEMBER 2016                       014
10490010009                        00000000000176424.00LINDA PUSPA DEWI                                                                         BONUS MEMBER      NOVEMBER 2016                       014
17955171314                        00000000001231979.00LISDA TUNILAN                                                                            BONUS MEMBER      NOVEMBER 2016                       014
18760344207                        00000000000062706.00LOANITA                                                                                  BONUS MEMBER      NOVEMBER 2016                       014
10261808730                        00000000000070233.00LOEI MEI SIONG                                                                           BONUS MEMBER      NOVEMBER 2016                       014
14050147482                        00000000000176584.00LOLITA LEWA                                                                              BONUS MEMBER      NOVEMBER 2016                       014
17570069858                        00000000000083610.00LOUISA SUSIANA HAKIM                                                                     BONUS MEMBER      NOVEMBER 2016                       014
17975271188                        00000000025163865.00LUTFIA Y. K. NASIB ALAMR                                                                 BONUS MEMBER      NOVEMBER 2016                       014
10115124884                        00000000000058244.00M. MONICA SOETINI ATAU IRENE LAMPITA                                                     BONUS MEMBER      NOVEMBER 2016                       014
17870397644                        00000000002972459.00M.AFIF VILANO FITRIAH                                                                    BONUS MEMBER      NOVEMBER 2016                       014
17910615607                        00000000000236186.00MAHMUD                                                                                   BONUS MEMBER      NOVEMBER 2016                       014
16460077212                        00000000000134680.00MAN LING HIDAYAT                                                                         BONUS MEMBER      NOVEMBER 2016                       014
17920613921                        00000000000102581.00MANOVER MPILA                                                                            BONUS MEMBER      NOVEMBER 2016                       014
13841355618                        00000000000577873.00MARGONO                                                                                  BONUS MEMBER      NOVEMBER 2016                       014
12560095921                        00000000000050120.00MARIA                                                                                    BONUS MEMBER      NOVEMBER 2016                       014
10260829971                        00000000005854956.00MARIA BEATRIX LUNTUNGAN                                                                  BONUS MEMBER      NOVEMBER 2016                       014
14643198200                        00000000000268774.00MARIA CHENDRA                                                                            BONUS MEMBER      NOVEMBER 2016                       014
10251360129                        00000000000379993.00MARIA ROSALINA TANNUS                                                                    BONUS MEMBER      NOVEMBER 2016                       014
17800311980                        00000000000058317.00MARIANA CHRYCYTA KAUNANG                                                                 BONUS MEMBER      NOVEMBER 2016                       014
17570028027                        00000000000121585.00MARIANA GUNAWAN                                                                          BONUS MEMBER      NOVEMBER 2016                       014
10031555999                        00000000000520473.00MARIO RENDY NGADIMAN                                                                     BONUS MEMBER      NOVEMBER 2016                       014
10292155075                        00000000000363309.00MARISA CAROLINA TEDJA                                                                    BONUS MEMBER      NOVEMBER 2016                       014
14650268356                        00000000003493949.00MARSUDI                                                                                  BONUS MEMBER      NOVEMBER 2016                       014
11520325049                        00000000000306815.00MARTHEN CAREL KORWA                                                                      BONUS MEMBER      NOVEMBER 2016                       014
16705015990                        00000000000051357.00MARTINA                                                                                  BONUS MEMBER      NOVEMBER 2016                       014
16610493350                        00000000000060354.00MARTINUS B. PALAMBA                                                                      BONUS MEMBER      NOVEMBER 2016                       014
17795044337                        00000000004188013.00MARWAN AMIR                                                                              BONUS MEMBER      NOVEMBER 2016                       014
14870038254                        00000000000051523.00MARYANA                                                                                  BONUS MEMBER      NOVEMBER 2016                       014
10446543456                        00000000000051308.00MAYASAHI MAMONTO                                                                         BONUS MEMBER      NOVEMBER 2016                       014
10640167297                        00000000000244936.00MEDYAWATI LIMANTARA DRG                                                                  BONUS MEMBER      NOVEMBER 2016                       014
10883225888                        00000000000058244.00MELI WIDJAJA                                                                             BONUS MEMBER      NOVEMBER 2016                       014
10590359505                        00000000000113146.00MELIANTY LIANTO                                                                          BONUS MEMBER      NOVEMBER 2016                       014
10261882727                        00000000000123869.00MELINDA PRABOWO                                                                          BONUS MEMBER      NOVEMBER 2016                       014
10884820207                        00000000001967751.00MELYSA YULIANA                                                                           BONUS MEMBER      NOVEMBER 2016                       014
14411287399                        00000000000104319.00MERIAM SELONITA SAMBO                                                                    BONUS MEMBER      NOVEMBER 2016                       014
11510310442                        00000000000083677.00MERIYANTI                                                                                BONUS MEMBER      NOVEMBER 2016                       014
18600187148                        00000000000224612.00MERRY LUKAS TUNJANG                                                                      BONUS MEMBER      NOVEMBER 2016                       014
10210293175                        00000000000925358.00METRY WIDJAJA KOHAR                                                                      BONUS MEMBER      NOVEMBER 2016                       014
18140264165                        00000000000322132.00METTY A SIMATUPANG                                                                       BONUS MEMBER      NOVEMBER 2016                       014
17955118723                        00000000000213202.00MEYRINDHA MANDALA P                                                                      BONUS MEMBER      NOVEMBER 2016                       014
12741034559                        00000000002201222.00MIRA REBEKA SANI                                                                         BONUS MEMBER      NOVEMBER 2016                       014
17245033443                        00000000000050694.00MISNA                                                                                    BONUS MEMBER      NOVEMBER 2016                       014
17920607271                        00000000000053612.00MOH RIYAN-S STP                                                                          BONUS MEMBER      NOVEMBER 2016                       014
11850608276                        00000000000050120.00MOH ROHIM                                                                                BONUS MEMBER      NOVEMBER 2016                       014
18140254534                        00000000000051786.00MONNY SABACHTANI MAYOR SROYER                                                            BONUS MEMBER      NOVEMBER 2016                       014
10255460574                        00000000000169241.00MUH. KADIR                                                                               BONUS MEMBER      NOVEMBER 2016                       014
17910357349                        00000000002186311.00MUHAMAD TAUFAN BACHTIAR                                                                  BONUS MEMBER      NOVEMBER 2016                       014
17920781742                        00000000000138710.00MUHAMMAD HILMI MARWAN                                                                    BONUS MEMBER      NOVEMBER 2016                       014
18615114649                        00000000000050824.00MUHAMMAD NAZAR RUDDIN                                                                    BONUS MEMBER      NOVEMBER 2016                       014
13860011858                        00000000000113146.00MULIANA                                                                                  BONUS MEMBER      NOVEMBER 2016                       014
10948235164                        00000000000057783.00NADYA SYAFIRA                                                                            BONUS MEMBER      NOVEMBER 2016                       014
10771035891                        00000000000237131.00NANIEK BUDHI DARMAWATI                                                                   BONUS MEMBER      NOVEMBER 2016                       014
17955166957                        00000000000114019.00NATALIA SUANGGA                                                                          BONUS MEMBER      NOVEMBER 2016                       014
10871399769                        00000000000073866.00NGUI SIM SIN                                                                             BONUS MEMBER      NOVEMBER 2016                       014
10653453890                        00000000000053200.00NILAWATI SUTIOSO                                                                         BONUS MEMBER      NOVEMBER 2016                       014
17920541113                        00000000000102501.00NILUH SRIYUTI SARKO                                                                      BONUS MEMBER      NOVEMBER 2016                       014
17920375141                        00000000000213888.00NINA ANDRIANI                                                                            BONUS MEMBER      NOVEMBER 2016                       014
18190165362                        00000000000328958.00NINA KARTINI                                                                             BONUS MEMBER      NOVEMBER 2016                       014
17955110897                        00000000000052933.00NINGRUM I BUTARBUTAR S.TH                                                                BONUS MEMBER      NOVEMBER 2016                       014
18290171513                        00000000000538079.00NINIK ELSAWATIE                                                                          BONUS MEMBER      NOVEMBER 2016                       014
17890483377                        00000000000054202.00NIRMALASARI BADI                                                                         BONUS MEMBER      NOVEMBER 2016                       014
17955152824                        00000000000104101.00NIRMAWATI                                                                                BONUS MEMBER      NOVEMBER 2016                       014
10262097011                        00000000000741008.00NONTJE TANGAHU                                                                           BONUS MEMBER      NOVEMBER 2016                       014
15000385940                        00000000000117527.00NOVA                                                                                     BONUS MEMBER      NOVEMBER 2016                       014
10262041385                        00000000000054097.00NOVA KOLIBU                                                                              BONUS MEMBER      NOVEMBER 2016                       014
10291650359                        00000000000089127.00NOVIANA LOUW                                                                             BONUS MEMBER      NOVEMBER 2016                       014
17930044134                        00000000000108393.00NOVIATI                                                                                  BONUS MEMBER      NOVEMBER 2016                       014
17955145160                        00000000000054510.00NUFI SRI RAHAYU                                                                          BONUS MEMBER      NOVEMBER 2016                       014
11160238093                        00000000000058292.00NULI MOECHTAR                                                                            BONUS MEMBER      NOVEMBER 2016                       014
10371933335                        00000000000761491.00NUR KHAMIM                                                                               BONUS MEMBER      NOVEMBER 2016                       014
17920488344                        00000000000214661.00NURAENI S. LADJIDJI                                                                      BONUS MEMBER      NOVEMBER 2016                       014
10221603116                        00000000000070776.00NURFAMI PUTRISARI                                                                        BONUS MEMBER      NOVEMBER 2016                       014
11199004598                        00000000002461948.00NURHASANAH HS                                                                            BONUS MEMBER      NOVEMBER 2016                       014
12181365694                        00000000000310876.00NURHAYATI                                                                                BONUS MEMBER      NOVEMBER 2016                       014
11000208228                        00000000000054202.00OEI JANG BOEN                                                                            BONUS MEMBER      NOVEMBER 2016                       014
17600336759                        00000000000136174.00OEI LAY SIANG                                                                            BONUS MEMBER      NOVEMBER 2016                       014
12481467936                        00000000000058292.00OEY DE HOA                                                                               BONUS MEMBER      NOVEMBER 2016                       014
12540309828                        00000000000080583.00OEYANSYAH LIMANTO                                                                        BONUS MEMBER      NOVEMBER 2016                       014
10262166048                        00000000000350403.00OLFA GRENISE DEENG                                                                       BONUS MEMBER      NOVEMBER 2016                       014
17970065878                        00000000000105483.00OLIVIA THIO                                                                              BONUS MEMBER      NOVEMBER 2016                       014
17975051811                        00000000000176414.00ONNY E WANTOUW                                                                           BONUS MEMBER      NOVEMBER 2016                       014
16195034889                        00000000000262987.00PATMAWATI                                                                                BONUS MEMBER      NOVEMBER 2016                       014
16750081531                        00000000000700607.00PETTY SUHASTUTI                                                                          BONUS MEMBER      NOVEMBER 2016                       014
14681270978                        00000000000072881.00PRASTI ADHI DHARMASANTI DR                                                               BONUS MEMBER      NOVEMBER 2016                       014
17910346177                        00000000000208028.00PUTU AGUSTIN K                                                                           BONUS MEMBER      NOVEMBER 2016                       014
18290259127                        00000000000051260.00R. BUDI WITJAKSONO                                                                       BONUS MEMBER      NOVEMBER 2016                       014
17910174473                        00000000000317110.00RAHMAWATI WIDJAJA                                                                        BONUS MEMBER      NOVEMBER 2016                       014
17975307646                        00000000000054202.00RAMLA WAHAB SH                                                                           BONUS MEMBER      NOVEMBER 2016                       014
10381392421                        00000000000121585.00RANNY                                                                                    BONUS MEMBER      NOVEMBER 2016                       014
17920745258                        00000000000160894.00RATMIN HJ                                                                                BONUS MEMBER      NOVEMBER 2016                       014
17920717254                        00000000000116226.00RATNA SUKMANINGSIH                                                                       BONUS MEMBER      NOVEMBER 2016                       014
12741009970                        00000000000259583.00RAY LAMMY                                                                                BONUS MEMBER      NOVEMBER 2016                       014
10921357752                        00000000000051034.00REENA CHRISTINE LUCAS                                                                    BONUS MEMBER      NOVEMBER 2016                       014
10262082227                        00000000002071048.00REITTY LILYANNY SAMADI                                                                   BONUS MEMBER      NOVEMBER 2016                       014
15550192022                        00000000000816115.00RENDY HARTANTO                                                                           BONUS MEMBER      NOVEMBER 2016                       014
10580540082                        00000000000815433.00RHAFISA                                                                                  BONUS MEMBER      NOVEMBER 2016                       014
17955126777                        00000000000054510.00RIANA JAUARINI                                                                           BONUS MEMBER      NOVEMBER 2016                       014
14641280911                        00000000000108352.00RICHARD SUSANTO                                                                          BONUS MEMBER      NOVEMBER 2016                       014
17955082915                        00000000000054510.00RICKY NELSON NGELIARATAN                                                                 BONUS MEMBER      NOVEMBER 2016                       014
17975271081                        00000000003283416.00RIECKY REINALD SOENGE. SP                                                                BONUS MEMBER      NOVEMBER 2016                       014
14970191921                        00000000000063356.00RIKA                                                                                     BONUS MEMBER      NOVEMBER 2016                       014
17910036585                        00000000001750682.00RINA ARIYANIE TAHIR-ST                                                                   BONUS MEMBER      NOVEMBER 2016                       014
10511670666                        00000000000276542.00RINAH YULIYANI                                                                           BONUS MEMBER      NOVEMBER 2016                       014
10880590481                        00000000003560667.00RINI SETYOWATI                                                                           BONUS MEMBER      NOVEMBER 2016                       014
10050457273                        00000000000204952.00RINI SURJANIE AMD                                                                        BONUS MEMBER      NOVEMBER 2016                       014
17955117824                        00000000000054510.00RISALDI                                                                                  BONUS MEMBER      NOVEMBER 2016                       014
17920717351                        00000000003598530.00RISDIYANTO                                                                               BONUS MEMBER      NOVEMBER 2016                       014
17920441119                        00000000039224330.00ROBERTH PARENGKUAN                                                                       BONUS MEMBER      NOVEMBER 2016                       014
17955175760                        00000000000054510.00RONA N FLAURANCIA LOG                                                                    BONUS MEMBER      NOVEMBER 2016                       014
11302300580                        00000000000054510.00RONNY DEDY SANTOSA                                                                       BONUS MEMBER      NOVEMBER 2016                       014
14970282306                        00000000000083610.00ROOSDIANA ROESMAN                                                                        BONUS MEMBER      NOVEMBER 2016                       014
16665004884                        00000000000072220.00ROSA                                                                                     BONUS MEMBER      NOVEMBER 2016                       014
17955163109                        00000000000054510.00ROSALIA MERRY PANTOW                                                                     BONUS MEMBER      NOVEMBER 2016                       014
18705168993                        00000000000107617.00ROSITA NATADARMA DJAJA                                                                   BONUS MEMBER      NOVEMBER 2016                       014
11191806421                        00000000000126784.00RTS SUKARTIK                                                                             BONUS MEMBER      NOVEMBER 2016                       014
17955124863                        00000000000114019.00RUPINI                                                                                   BONUS MEMBER      NOVEMBER 2016                       014
16665050541                        00000000038292628.00RUSIANI                                                                                  BONUS MEMBER      NOVEMBER 2016                       014
11410324047                        00000000001353929.00RUTH HANDAYANI DARMAWAN                                                                  BONUS MEMBER      NOVEMBER 2016                       014
17920484900                        00000000001554692.00SAHABUDIN                                                                                BONUS MEMBER      NOVEMBER 2016                       014
10291513190                        00000000000129098.00SAHALA MARULI HUTAGALUNG DR                                                              BONUS MEMBER      NOVEMBER 2016                       014
12581015901                        00000000004835622.00SALIM                                                                                    BONUS MEMBER      NOVEMBER 2016                       014
17910170583                        00000000028840738.00SALMIA RODHIYA HUSAINY                                                                   BONUS MEMBER      NOVEMBER 2016                       014
17955124162                        00000000000114019.00SAMSIAH                                                                                  BONUS MEMBER      NOVEMBER 2016                       014
15910006799                        00000000000058292.00SANNY LIE                                                                                BONUS MEMBER      NOVEMBER 2016                       014
17910628831                        00000000001003229.00SATRIA                                                                                   BONUS MEMBER      NOVEMBER 2016                       014
10272998998                        00000000000074375.00SELVIA SULISTIO                                                                          BONUS MEMBER      NOVEMBER 2016                       014
17020348199                        00000000000561407.00SELVIANA                                                                                 BONUS MEMBER      NOVEMBER 2016                       014
10511502089                        00000000000051308.00SEPTIA SUSANTI RAHADINI                                                                  BONUS MEMBER      NOVEMBER 2016                       014
11010200209                        00000000001847089.00SETYOTUHU TATIK                                                                          BONUS MEMBER      NOVEMBER 2016                       014
12260916028                        00000000000051406.00SHAHNAZ BANAJI                                                                           BONUS MEMBER      NOVEMBER 2016                       014
15550112738                        00000000003218446.00SHERLY EKAWATI                                                                           BONUS MEMBER      NOVEMBER 2016                       014
12290005101                        00000000000509803.00SHIRLY SANTOSO                                                                           BONUS MEMBER      NOVEMBER 2016                       014
10180623515                        00000000000066020.00SHYARON ONE SANCHIA                                                                      BONUS MEMBER      NOVEMBER 2016                       014
17920792191                        00000000000065107.00SINIR MOKODOMPIS                                                                         BONUS MEMBER      NOVEMBER 2016                       014
14564945767                        00000000000050395.00SISILIA CLARA DAUR                                                                       BONUS MEMBER      NOVEMBER 2016                       014
18145000994                        00000000000098167.00SITI AMINAH                                                                              BONUS MEMBER      NOVEMBER 2016                       014
10272614219                        00000000000050913.00SITI FARTIAH SH                                                                          BONUS MEMBER      NOVEMBER 2016                       014
17650478864                        00000000000135044.00SITI HURIYAH                                                                             BONUS MEMBER      NOVEMBER 2016                       014
10271287207                        00000000000128391.00SITI NUR AINI                                                                            BONUS MEMBER      NOVEMBER 2016                       014
17955123859                        00000000000054510.00SLAMET SUGIO                                                                             BONUS MEMBER      NOVEMBER 2016                       014
13981030522                        00000000000054073.00SOFI                                                                                     BONUS MEMBER      NOVEMBER 2016                       014
17910576075                        00000000003354955.00SONRA TONDRANG                                                                           BONUS MEMBER      NOVEMBER 2016                       014
11630316266                        00000000000083610.00SONYA SJOFIAN                                                                            BONUS MEMBER      NOVEMBER 2016                       014
17910276721                        00000000000051034.00SRI ASTUTI                                                                               BONUS MEMBER      NOVEMBER 2016                       014
12140477331                        00000000000224698.00SRI HANDAYANI SOEDARSONO                                                                 BONUS MEMBER      NOVEMBER 2016                       014
10450448371                        00000000000113146.00SRI HASTUTI                                                                              BONUS MEMBER      NOVEMBER 2016                       014
17955222211                        00000000001046092.00SRI MULIADEWI GUNARTO                                                                    BONUS MEMBER      NOVEMBER 2016                       014
10697075058                        00000000000053200.00SRI MULYATI DJOHAN                                                                       BONUS MEMBER      NOVEMBER 2016                       014
13981000623                        00000000000083610.00SRI SUBEKTI                                                                              BONUS MEMBER      NOVEMBER 2016                       014
17570071984                        00000000000151292.00SRI WINDUNINGSIH                                                                         BONUS MEMBER      NOVEMBER 2016                       014
17990581236                        00000000000051034.00SRIDAHLIANI                                                                              BONUS MEMBER      NOVEMBER 2016                       014
16240695390                        00000000000102185.00STACIA ANGGAPUTRI                                                                        BONUS MEMBER      NOVEMBER 2016                       014
18295083863                        00000000000287843.00STANLEY A DORINGIN                                                                       BONUS MEMBER      NOVEMBER 2016                       014
10350378481                        00000000000231753.00STEPHANIE MULIARIADI                                                                     BONUS MEMBER      NOVEMBER 2016                       014
12531230843                        00000000000554106.00STEVIE LENGKONG                                                                          BONUS MEMBER      NOVEMBER 2016                       014
10272409747                        00000000000063862.00SUANDY VIKTORIANUS BOESTANY ATAU HELEN TANSIL                                            BONUS MEMBER      NOVEMBER 2016                       014
18670077854                        00000000000051963.00SUDARSO                                                                                  BONUS MEMBER      NOVEMBER 2016                       014
17580131250                        00000000000058292.00SUGIANTO                                                                                 BONUS MEMBER      NOVEMBER 2016                       014
12681191650                        00000000000067604.00SUGIMAN                                                                                  BONUS MEMBER      NOVEMBER 2016                       014
16260028900                        00000000000079390.00SUGITO                                                                                   BONUS MEMBER      NOVEMBER 2016                       014
11071171596                        00000000000594630.00SUGITO EFFENDY                                                                           BONUS MEMBER      NOVEMBER 2016                       014
18305025867                        00000000000319037.00SUHARDIMAN                                                                               BONUS MEMBER      NOVEMBER 2016                       014
17570630517                        00000000000058292.00SUI FENIKA ALIANY                                                                        BONUS MEMBER      NOVEMBER 2016                       014
11611276074                        00000000000050848.00SUKARDI GUNAWAN                                                                          BONUS MEMBER      NOVEMBER 2016                       014
15650035854                        00000000000184447.00SUKAWI IWAN                                                                              BONUS MEMBER      NOVEMBER 2016                       014
17910249091                        00000000010042827.00SULEMAN MILE                                                                             BONUS MEMBER      NOVEMBER 2016                       014
10600441035                        00000000000160522.00SUMARYOTO                                                                                BONUS MEMBER      NOVEMBER 2016                       014
17920679352                        00000000000184772.00SUMIRNA SIMURU                                                                           BONUS MEMBER      NOVEMBER 2016                       014
10851157564                        00000000000092301.00SUNMEIRIA                                                                                BONUS MEMBER      NOVEMBER 2016                       014
17155008806                        00000000003335185.00SURIANTO                                                                                 BONUS MEMBER      NOVEMBER 2016                       014
16320031581                        00000000000193682.00SURIJANI                                                                                 BONUS MEMBER      NOVEMBER 2016                       014
11750637139                        00000000000050217.00SURIYANTO                                                                                BONUS MEMBER      NOVEMBER 2016                       014
15320117765                        00000000000054073.00SURYA KANDINATA                                                                          BONUS MEMBER      NOVEMBER 2016                       014
15940337625                        00000000000067604.00SUSANA                                                                                   BONUS MEMBER      NOVEMBER 2016                       014
15700022767                        00000000000459669.00SUSANA                                                                                   BONUS MEMBER      NOVEMBER 2016                       014
11710186312                        00000000005214497.00SUSANTI                                                                                  BONUS MEMBER      NOVEMBER 2016                       014
12540333371                        00000000010757875.00SUSANTI OEY                                                                              BONUS MEMBER      NOVEMBER 2016                       014
15390008173                        00000000000073230.00SUSANTI WIDJAJA                                                                          BONUS MEMBER      NOVEMBER 2016                       014
10290977771                        00000000003065962.00SUSANTO                                                                                  BONUS MEMBER      NOVEMBER 2016                       014
16240174497                        00000000000065500.00SUSANTY BACHTIAR                                                                         BONUS MEMBER      NOVEMBER 2016                       014
10450646156                        00000000000171346.00SUWANRI OR LANNY CHATRA                                                                  BONUS MEMBER      NOVEMBER 2016                       014
12910142804                        00000000000887390.00SUWATI HIMAWAN                                                                           BONUS MEMBER      NOVEMBER 2016                       014
11881052224                        00000000001076482.00TANG HONG TJIEH                                                                          BONUS MEMBER      NOVEMBER 2016                       014
12821503568                        00000000000277706.00TANYA EDWINA BELATUR                                                                     BONUS MEMBER      NOVEMBER 2016                       014
13080072162                        00000000003439805.00TEDDY WIJAYAPUTRA                                                                        BONUS MEMBER      NOVEMBER 2016                       014
10450806137                        00000000000053200.00TENG KEE CHIA SUWANRI                                                                    BONUS MEMBER      NOVEMBER 2016                       014
16695025657                        00000000000108781.00TENG SIAO PHIN                                                                           BONUS MEMBER      NOVEMBER 2016                       014
17955163303                        00000000000054510.00TENNI DOMI                                                                               BONUS MEMBER      NOVEMBER 2016                       014
10080751974                        00000000000079390.00THEA SUTANTA                                                                             BONUS MEMBER      NOVEMBER 2016                       014
17925011061                        00000000000088770.00THEN MI MI                                                                               BONUS MEMBER      NOVEMBER 2016                       014
10657212095                        00000000000083610.00THEODORE CHRISTOPHER                                                                     BONUS MEMBER      NOVEMBER 2016                       014
12370130909                        00000000000172219.00THERESIA INDRAWATI                                                                       BONUS MEMBER      NOVEMBER 2016                       014
18220202764                        00000000000053200.00THERESIA MARGRIET LAZAR                                                                  BONUS MEMBER      NOVEMBER 2016                       014
12160521450                        00000000000079211.00THIO KIM TJU                                                                             BONUS MEMBER      NOVEMBER 2016                       014
10491563566                        00000000000267732.00TIFFANY SRIWAHYUNI KADANG                                                                BONUS MEMBER      NOVEMBER 2016                       014
10031705486                        00000000000083610.00TIO TJEN AI                                                                              BONUS MEMBER      NOVEMBER 2016                       014
10341672553                        00000000000070267.00TIRTA ACHDA                                                                              BONUS MEMBER      NOVEMBER 2016                       014
14641386515                        00000000001628735.00TIRZA FINANSIH K.D                                                                       BONUS MEMBER      NOVEMBER 2016                       014
10291562271                        00000000000151917.00TJEN SHU LANG                                                                            BONUS MEMBER      NOVEMBER 2016                       014
10663170888                        00000000000058292.00TJHIN AI LING                                                                            BONUS MEMBER      NOVEMBER 2016                       014
15780082285                        00000000000058292.00TJHIN MOEK TIN                                                                           BONUS MEMBER      NOVEMBER 2016                       014
13880517464                        00000000000050613.00TJIOE ANTON SURYADHARMA                                                                  BONUS MEMBER      NOVEMBER 2016                       014
15650009853                        00000000000102295.00TJOA MIN NIO                                                                             BONUS MEMBER      NOVEMBER 2016                       014
17980107048                        00000000000264708.00TJONG SWEE FU                                                                            BONUS MEMBER      NOVEMBER 2016                       014
12580951891                        00000000000686743.00TOENDJOENG SARIWATI                                                                      BONUS MEMBER      NOVEMBER 2016                       014
15490741722                        00000000000058002.00TOMI                                                                                     BONUS MEMBER      NOVEMBER 2016                       014
10270723845                        00000000000557567.00TONNY EFFENDI                                                                            BONUS MEMBER      NOVEMBER 2016                       014
18220870601                        00000000000051769.00TUTIK RAHAYU                                                                             BONUS MEMBER      NOVEMBER 2016                       014
10101615731                        00000000000052764.00ULFATURROHMAH                                                                            BONUS MEMBER      NOVEMBER 2016                       014
13300449823                        00000000000058292.00URIFAH                                                                                   BONUS MEMBER      NOVEMBER 2016                       014
17955124065                        00000000000054510.00VARDI LOWAY                                                                              BONUS MEMBER      NOVEMBER 2016                       014
10261779233                        00000000000105047.00VELISIA CISILIA LANGELO                                                                  BONUS MEMBER      NOVEMBER 2016                       014
18315005660                        00000000000096646.00VERONIKA NOVRIYANTI, S.S                                                                 BONUS MEMBER      NOVEMBER 2016                       014
17910194172                        00000000000104707.00VINA AMBODALE SE                                                                         BONUS MEMBER      NOVEMBER 2016                       014
18830889303                        00000000000180740.00VIVI TEDJA SUWARNO                                                                       BONUS MEMBER      NOVEMBER 2016                       014
17975284611                        00000000001095691.00VONNY JANTOY SP                                                                          BONUS MEMBER      NOVEMBER 2016                       014
17920788712                        00000000000144598.00WAFIQAH AMIRAH MARWAN                                                                    BONUS MEMBER      NOVEMBER 2016                       014
10272535114                        00000000000255041.00WAHIDAH                                                                                  BONUS MEMBER      NOVEMBER 2016                       014
13191467131                        00000000000083610.00WELLA SOLIHIN                                                                            BONUS MEMBER      NOVEMBER 2016                       014
11410592998                        00000000000383703.00WELLY DJUNAIDI                                                                           BONUS MEMBER      NOVEMBER 2016                       014
10450765562                        00000000000263181.00WENNY JAYANTI                                                                            BONUS MEMBER      NOVEMBER 2016                       014
17955004418                        00000000000512148.00WESTI SETIATI                                                                            BONUS MEMBER      NOVEMBER 2016                       014
10250633360                        00000000000080554.00WIJOYO HALIM                                                                             BONUS MEMBER      NOVEMBER 2016                       014
10120213237                        00000000001188578.00WINARTI                                                                                  BONUS MEMBER      NOVEMBER 2016                       014
17910448191                        00000000000103300.00WINARTIN                                                                                 BONUS MEMBER      NOVEMBER 2016                       014
18190307175                        00000000000122555.00WINDA FITRI                                                                              BONUS MEMBER      NOVEMBER 2016                       014
18140253902                        00000000000128703.00WIRA SUTRIA SE MSI                                                                       BONUS MEMBER      NOVEMBER 2016                       014
10641111260                        00000000000152058.00WIWIK MEGAWATI                                                                           BONUS MEMBER      NOVEMBER 2016                       014
17975056121                        00000000000335228.00WIWIN PAKAYA                                                                             BONUS MEMBER      NOVEMBER 2016                       014
16100101503                        00000000000050460.00YATINI, SH.                                                                              BONUS MEMBER      NOVEMBER 2016                       014
11520368066                        00000000001093924.00YAYUK RIWAYATI                                                                           BONUS MEMBER      NOVEMBER 2016                       014
15375036719                        00000000000619744.00YB JALU DANANJAYA                                                                        BONUS MEMBER      NOVEMBER 2016                       014
15045001692                        00000000000133128.00YENI IRAWATI                                                                             BONUS MEMBER      NOVEMBER 2016                       014
10420386109                        00000000000061259.00YENNY SIMANJUNTAK                                                                        BONUS MEMBER      NOVEMBER 2016                       014
10321109364                        00000000000316878.00YENYTA FIRGO                                                                             BONUS MEMBER      NOVEMBER 2016                       014
17910037557                        00000000000115648.00YOHANIS PARINDINGAN                                                                      BONUS MEMBER      NOVEMBER 2016                       014
10262260109                        00000000000050953.00YOLANDA MOKOSULI                                                                         BONUS MEMBER      NOVEMBER 2016                       014
12753675035                        00000000000130732.00YUANITA                                                                                  BONUS MEMBER      NOVEMBER 2016                       014
10261879157                        00000000003027175.00YUDIN IBRAHIM                                                                            BONUS MEMBER      NOVEMBER 2016                       014
12581590867                        00000000000283332.00YULIANA NATA LESTARI                                                                     BONUS MEMBER      NOVEMBER 2016                       014
10372918835                        00000000000053030.00YULIANA PRATIWI                                                                          BONUS MEMBER      NOVEMBER 2016                       014
12872372513                        00000000017326648.00YULIANTI LIAN                                                                            BONUS MEMBER      NOVEMBER 2016                       014
10120123874                        00000000000115143.00ZAKARIA MUHIDIN                                                                          BONUS MEMBER      NOVEMBER 2016                       014
17975003256                        00000000000058365.00ZULHAM R TANGAHU                                                                         BONUS MEMBER      NOVEMBER 2016                       014
15600249802                        00000000000051357.00ZUSANNA MOLL                                                                             BONUS MEMBER      NOVEMBER 2016                       014
