RK;NPWP;NAMA;KD_JENIS_TRANSAKSI;FG_PENGGANTI;NOMOR_FAKTUR;TANGGAL_FAKTUR;NO_DOKUMEN_FAKTUR;TANGGAL_RETUR;MASA_PAJAK_RETUR;TAHUN_PAJAK_RETUR;NILAI_RETUR_DPP;NILAI_RETUR_PPN;NILAI_RETUR_PPNBM
RK;000000000000000;INAM;01;0;0061839739668;28/12/2018;0007/UHNPUSAT/RET/2018;28/12/2018;12;2018;288836;28884;0
RK;000000000000000;"JULIANA S.KEP";01;0;0061868283988;28/12/2018;0012/UHNPUSAT/RET/2018;28/12/2018;12;2018;1340355;134035;0
RK;000000000000000;"Jenny Sampe";01;0;0061839739550;28/12/2018;0002/UHNPUSAT/RET/2018;28/12/2018;12;2018;1151073;115107;0
RK;000000000000000;"Suzanna Elly Sentosa";01;0;0061868283733;28/12/2018;0009/UHNPUSAT/RET/2018;28/12/2018;12;2018;6132218;613222;0
RK;000000000000000;susanna;01;0;0061839739618;28/12/2018;0004/UHNPUSAT/RET/2018;28/12/2018;12;2018;623818;62382;0
RK;000000000000000;"Aziza Amiruddin";01;0;0061868283958;28/12/2018;0010/UHNPUSAT/RET/2018;28/12/2018;12;2018;11482527;1148253;0
RK;000000000000000;"Nani Hardi Astuti";01;0;0061839736383;28/12/2018;0001/UHNPUSAT/RET/2018;28/12/2018;12;2018;360000;36000;0
RK;000000000000000;"NURUL AZIZAH";01;0;0061868283651;28/12/2018;0008/UHNPUSAT/RET/2018;28/12/2018;12;2018;120473;12047;0
RK;000000000000000;"Elsis Rosari";01;0;0061868284031;28/12/2018;0014/UHNPUSAT/RET/2018;28/12/2018;12;2018;3238636;323864;0
RK;059461533732001;"Ir.HJ.Hayatun Fardah";01;0;0061839739592;28/12/2018;0003/UHNPUSAT/RET/2018;28/12/2018;12;2018;536364;53636;0
RK;000000000000000;"Yosephina Selfiana kwano";01;0;0061868283761;28/12/2018;0017/UHNPUSAT/RET/2018;28/12/2018;12;2018;8049818;804982;0
RK;000000000000000;"Rahmat Burhamzah";01;0;0061839739663;28/12/2018;0006/UHNPUSAT/RET/2018;28/12/2018;12;2018;3862491;386249;0
RK;000000000000000;"Ninik Elsawatie";01;0;0061868283964;28/12/2018;0013/UHNPUSAT/RET/2018;28/12/2018;12;2018;681927;68193;0
RK;000000000000000;Hendri;01;0;0061839736397;28/12/2018;0015/UHNPUSAT/RET/2018;28/12/2018;12;2018;534545;53455;0
RK;000000000000000;"Ekat Hawini";01;0;0061868284124;28/12/2018;0016/UHNPUSAT/RET/2018;28/12/2018;12;2018;8340364;834036;0
RK;000000000000000;"MEUTIA FARIDA";01;0;0061839739614;28/12/2018;0005/UHNPUSAT/RET/2018;28/12/2018;12;2018;861895;86189;0
RK;000000000000000;"Dra. A. Syarifah Ukkas";01;0;0061868283956;28/12/2018;0011/UHNPUSAT/RET/2018;28/12/2018;12;2018;20127018;2012702;0
RK;000000000000000;"DAMARIS TIKU";01;0;0061868284542;29/12/2018;0020/UHNPUSAT/RET/2018;29/12/2018;12;2018;4753527;475353;0
RK;000000000000000;"Rusiani Ely";01;0;0061868283726;28/12/2018;0018/UHNPUSAT/RET/2018;29/12/2018;12;2018;171818;17182;0
RK;000000000000000;"Melawaty Abyani";01;0;0061868284539;29/12/2018;0019/UHNPUSAT/RET/2018;29/12/2018;12;2018;289691;28969;0
RK;000000000000000;"Elsis Rosari";01;0;0011834799361;30/12/2018;0023/UHNPUSAT/RET/2018;30/12/2018;12;2018;180000;18000;0
RK;000000000000000;"Jifly Frenla Polii";01;0;0061868284533;29/12/2018;0021/UHNPUSAT/RET/2018;30/12/2018;12;2018;536364;53636;0
RK;000000000000000;"Jifly Frenla Polii";01;0;0061868284533;29/12/2018;0022/UHNPUSAT/RET/2018;30/12/2018;12;2018;536364;53636;0
RK;000000000000000;Rahmawati;01;0;0011834799355;30/12/2018;0024/UHNPUSAT/RET/2018;30/12/2018;12;2018;2273091;227309;0
RK;000000000000000;"Hotmauli Simanjuntak";01;0;0011834813197;31/12/2018;0027/UHNPUSAT/RET/2018;31/12/2018;12;2018;3407073;340707;0
RK;000000000000000;"MEUTIA FARIDA";01;0;0011834799979;31/12/2018;0025/UHNPUSAT/RET/2018;31/12/2018;12;2018;6132218;613222;0
RK;000000000000000;"Preisy A M Golioth";01;0;0011834813187;31/12/2018;0026/UHNPUSAT/RET/2018;31/12/2018;12;2018;6132218;613222;0
