RK;NPWP;NAMA;KD_JENIS_TRANSAKSI;FG_PENGGANTI;NOMOR_FAKTUR;TANGGAL_FAKTUR;NO_DOKUMEN_FAKTUR;TANGGAL_RETUR;MASA_PAJAK_RETUR;TAHUN_PAJAK_RETUR;NILAI_RETUR_DPP;NILAI_RETUR_PPN;NILAI_RETUR_PPNBM
RK;000000000000000;"Dr. Richard Izaac Risambessy";01;0;0001623805458;11/07/2016;0079/UHNCAB/RET/2016;11/07/2016;7;2016;1691073;169107;0
RK;000000000000000;"Purwaningdyah Susilowati";01;0;0001623805459;11/07/2016;0078/UHNCAB/RET/2016;11/07/2016;7;2016;890909;89091;0
RK;594682387037000;"Zainal Arifin.";01;0;0001623805518;13/07/2016;0082/UHNCAB/RET/2016;13/07/2016;7;2016;256364;25636;0
RK;000000000000000;"Christianus A.dwido";01;0;0001623805520;13/07/2016;0081/UHNCAB/RET/2016;13/07/2016;7;2016;9241055;924105;0
RK;000000000000000;"A Yudi Jaya Musradhy P";01;0;0001623805515;13/07/2016;0080/UHNCAB/RET/2016;13/07/2016;7;2016;4714509;471451;0
RK;000000000000000;"ALSENSIUS TUMELENG";01;0;0001623805546;14/07/2016;0083/UHNCAB/RET/2016;14/07/2016;7;2016;14620464;1462046;0
RK;000000000000000;"Siti Hadijah Batjo";01;0;0001623805598;16/07/2016;0084/UHNCAB/RET/2016;16/07/2016;7;2016;13601345;1360135;0
RK;000000000000000;"EVI SUSANTI";01;0;0001623805756;23/07/2016;0085/UHNCAB/RET/2016;23/07/2016;7;2016;4527973;452797;0
RK;000000000000000;"EVI SUSANTI";01;0;0001623805769;23/07/2016;0086/UHNCAB/RET/2016;25/07/2016;7;2016;681927;68193;0
RK;000000000000000;"Ninik Elsawatie";01;0;0001623805821;26/07/2016;0087/UHNCAB/RET/2016;26/07/2016;7;2016;4064455;406445;0
RK;000000000000000;Hendri;01;0;0001623806011;29/07/2016;0088/UHNCAB/RET/2016;30/07/2016;7;2016;1840691;184069;0
RK;000000000000000;"Christianus A.dwido";01;0;0001623806088;30/07/2016;0089/UHNCAB/RET/2016;30/07/2016;7;2016;22098582;2209858;0
RK;000000000000000;"Harlia Sepulustina Siahaan";01;0;0001623806186;31/07/2016;0091/UHNCAB/RET/2016;31/07/2016;7;2016;1281818;128182;0
RK;000000000000000;"Siti Hadijah Batjo";01;0;0001623806137;31/07/2016;0090/UHNCAB/RET/2016;31/07/2016;7;2016;2307273;230727;0
