FK;KD_JENIS_TRANSAKSI;FG_PENGGANTI;NOMOR_FAKTUR;MASA_PAJAK;TAHUN_PAJAK;TANGGAL_FAKTUR;NPWP;NAMA;ALAMAT_LENGKAP;JUMLAH_DPP;JUMLAH_PPN;JUMLAH_PPNBM;ID_KETERANGAN_TAMBAHAN;FP_UANG_MUKA;UANG_MUKA_DPP;UANG_MUKA_PPN;UANG_MUKA_PPNBM;REFERENSI
LT;NPWP;NAMA;JALAN;BLOK;NOMOR;RT;RW;KECAMATAN;KELURAHAN;KABUPATEN;PROPINSI;KODE_POS;NOMOR_TELEPON
OF;KODE_OBJEK;NAMA;HARGA_SATUAN;JUMLAH_BARANG;HARGA_TOTAL;DISKON;DPP;PPN;TARIF_PPNBM;PPNBM
FK;01;0;0001756824690;2;2017;02/02/2017;061106084008000;"Mira Rebeka Sani";"Jl. Kesenian Blok O 1/12 Rt.016 Rw.009 Duren Sawit Jakarta Timur";1117746;111774;0;0;0;0;0;0;27128
LT;061106084008000;"Mira Rebeka Sani";-;-;-;0;0;-;-;-;-;-;-
OF;PP0184;"Double Stamina & Vitality Promo (Gratis Legres)";797120;1;797120;0;724655;72465;0;0
OF;BY030011;"Astaderm Face Cream";197400;1;197400;0;179455;17945;0;0
OF;BY030012;"Astaderm Face Serum";235000;1;235000;0;213636;21364;0;0
FK;01;0;0001756824691;2;2017;02/02/2017;082738550831000;"Harun D. Tumbuan";"Komplek RSD Madani No.19 Kota Palu Sualwesi Tengah";536364;53636;0;0;0;0;0;0;27129
LT;082738550831000;"Harun D. Tumbuan";-;-;-;0;0;-;-;-;-;-;-
OF;MT0097;"Catalog Vol 1 th 2017, January (100 Pcs)";590000;1;590000;0;536364;53636;0;0
FK;01;0;0001756824705;2;2017;03/02/2017;082738550831000;"Harun D. Tumbuan";"Komplek RSD Madani No.19 Kota Palu Sualwesi Tengah";9401282;940128;0;0;0;0;0;0;27143
LT;082738550831000;"Harun D. Tumbuan";-;-;-;0;0;-;-;-;-;-;-
OF;PP0187;"Antioxidant Life Promo (Gratis Magozai 375 ml)";1378040;2;2756080;0;2505527;250553;0;0
OF;PP0176;"Cell Protection Promo (Gratis Magozai 750 ml)";1324460;2;2648920;0;2408109;240811;0;0
OF;PP0178;"Diabetic Promo Disc 15%";929190;3;2787570;0;2534155;253415;0;0
OF;PP0184;"Double Stamina & Vitality Promo (Gratis Legres)";797120;2;1594240;0;1449309;144931;0;0
OF;HF060012;"HF Glucosefit";277300;2;554600;0;504182;50418;0;0
FK;01;0;0001756824728;2;2017;06/02/2017;082738550831000;"Harun D. Tumbuan";"Komplek RSD Madani No.19 Kota Palu Sualwesi Tengah";9138082;913807;0;0;0;0;0;0;27160
LT;082738550831000;"Harun D. Tumbuan";-;-;-;0;0;-;-;-;-;-;-
OF;PP0176;"Cell Protection Promo (Gratis Magozai 750 ml)";1324460;4;5297840;0;4816218;481622;0;0
OF;PP0178;"Diabetic Promo Disc 15%";929190;3;2787570;0;2534155;253415;0;0
OF;PP0181;"Liver Guard Promo Disc 20%";857280;1;857280;0;779345;77934;0;0
OF;HF060012;"HF Glucosefit";277300;4;1109200;0;1008364;100836;0;0
FK;01;0;0001756824733;2;2017;06/02/2017;061106084008000;"Mira Rebeka Sani";"Jl. Kesenian Blok O 1/12 Rt.016 Rw.009 Duren Sawit Jakarta Timur";5237891;523788;0;0;0;0;0;0;27165
LT;061106084008000;"Mira Rebeka Sani";-;-;-;0;0;-;-;-;-;-;-
OF;PP0175;"Antioxidant Plus Promo (Gratis Magozai 375ml)";1249260;4;4997040;0;4542764;454276;0;0
OF;PP0170;"Echina-C Plus Promo 2 (Gratis Renewskin 30)";154160;4;616640;0;560582;56058;0;0
OF;SK0022;"Starter Kit";99000;1;99000;0;90000;9000;0;0
OF;PP080144;"TOP UP Loyalty 3 Vegefrut";49000;1;49000;0;44545;4454;0;0
FK;01;0;0001756824756;2;2017;07/02/2017;672354446619000;"Surjana Dewi Effendy";"JL. Manyar Tirtoyoso Selatan 4 no. 11 RT 007 RW 005 Manyarsabrangan Mulyorejo surabaya";5274064;527405;0;0;0;0;0;0;27180
LT;672354446619000;"Surjana Dewi Effendy";-;-;-;0;0;-;-;-;-;-;-
OF;PP080144;"TOP UP Loyalty 3 Vegefrut";49000;10;490000;0;445455;44545;0;0
OF;NT020011;Asta-Gen;253800;7;1776600;0;1615091;161509;0;0
OF;PP0169;"Curcomplex95 Promo (Gratis Legres)";540500;1;540500;0;491364;49136;0;0
OF;NT020001;Legres;125020;10;1250200;0;1136545;113654;0;0
OF;NT020003;"Magozai 750ml";562120;1;562120;0;511018;51102;0;0
OF;PP0179;"Healthy Cardio Promo Disc 25%";1182050;1;1182050;0;1074591;107459;0;0
FK;01;0;0001756824784;2;2017;09/02/2017;672354446619000;"Surjana Dewi Effendy";"JL. Manyar Tirtoyoso Selatan 4 no. 11 RT 007 RW 005 Manyarsabrangan Mulyorejo surabaya";232637;23263;0;0;0;0;0;0;27202
LT;672354446619000;"Surjana Dewi Effendy";-;-;-;0;0;-;-;-;-;-;-
OF;MT0094;"Catalog Vol 1 th 2017, January";6900;1;6900;0;6273;627;0;0
OF;MT0102;"Newsletter Unihealth (50 pcs)";249000;1;249000;0;226364;22636;0;0
FK;01;0;0001756824792;2;2017;09/02/2017;674087382114000;"IDA FENNY ELYSA";"JL. DEBLOD SUNDORO NO. 41 LK. II";9983510;998350;0;0;0;0;0;0;27208
LT;674087382114000;"IDA FENNY ELYSA";-;-;-;0;0;-;-;-;-;-;-
OF;NT020008;Biorate;246750;4;987000;0;897273;89727;0;0
OF;NT020016;"Calway-C Junior";243460;3;730380;0;663982;66398;0;0
OF;PP0170;"Echina-C Plus Promo 2 (Gratis Renewskin 30)";154160;2;308320;0;280291;28029;0;0
OF;HF060004;"HF Joint Booster";336990;2;673980;0;612709;61271;0;0
OF;PP0176;"Cell Protection Promo (Gratis Magozai 750 ml)";1324460;1;1324460;0;1204055;120405;0;0
OF;HF060007;"HF Bee Propolis Liquid";280120;2;560240;0;509309;50931;0;0
OF;PP080144;"TOP UP Loyalty 3 Vegefrut";49000;15;735000;0;668182;66818;0;0
OF;BY030006;"UC - Bright Intense - Facial Foam";190350;5;951750;0;865227;86523;0;0
OF;BY030005;"UC - Intense Rejuvenating Cream (Day-Night Cream)";356730;1;356730;0;324300;32430;0;0
OF;NT020003;"Magozai 750ml";562120;4;2248480;0;2044073;204407;0;0
OF;HF060008;"HF Coformula";540500;2;1081000;0;982727;98273;0;0
OF;SK0022;"Starter Kit";99000;6;594000;0;540000;54000;0;0
OF;HF060009;"HF Pureway-C";107630;4;430520;0;391382;39138;0;0
FK;01;0;0001756824827;2;2017;11/02/2017;594682387037000;"Zainal Arifin.";"Jl. Thalib II No.5 Krukut - Tamansari Jakarta Barat";4606855;460685;0;0;0;0;0;0;27232
LT;594682387037000;"Zainal Arifin.";-;-;-;0;0;-;-;-;-;-;-
OF;PP0175;"Antioxidant Plus Promo (Gratis Magozai 375ml)";1249260;3;3747780;0;3407073;340707;0;0
OF;HF060004;"HF Joint Booster";336990;2;673980;0;612709;61271;0;0
OF;HF060009;"HF Pureway-C";107630;6;645780;0;587073;58707;0;0
FK;01;0;0001756824839;2;2017;13/02/2017;061106084008000;"Mira Rebeka Sani";"Jl. Kesenian Blok O 1/12 Rt.016 Rw.009 Duren Sawit Jakarta Timur";3425891;342589;0;0;0;0;0;0;27240
LT;061106084008000;"Mira Rebeka Sani";-;-;-;0;0;-;-;-;-;-;-
OF;PP0175;"Antioxidant Plus Promo (Gratis Magozai 375ml)";1249260;3;3747780;0;3407073;340707;0;0
OF;MT0094;"Catalog Vol 1 th 2017, January";6900;3;20700;0;18818;1882;0;0
FK;01;0;0001756824861;2;2017;14/02/2017;594682387037000;"Zainal Arifin.";"Jl. Thalib II No.5 Krukut - Tamansari Jakarta Barat";4579955;457995;0;0;0;0;0;0;27254
LT;594682387037000;"Zainal Arifin.";-;-;-;0;0;-;-;-;-;-;-
OF;PP0175;"Antioxidant Plus Promo (Gratis Magozai 375ml)";1249260;3;3747780;0;3407073;340707;0;0
OF;PP0172;"Renewskin 30 Promo (Buy 1 Get 1)";216670;3;650010;0;590918;59092;0;0
OF;PP0171;"Renewskin 15 Promo (Buy 1 Get 1)";124080;2;248160;0;225600;22560;0;0
OF;PP080144;"TOP UP Loyalty 3 Vegefrut";49000;8;392000;0;356364;35636;0;0
FK;01;0;0001756824874;2;2017;14/02/2017;594682387037000;"Zainal Arifin.";"Jl. Thalib II No.5 Krukut - Tamansari Jakarta Barat";391382;39138;0;0;0;0;0;0;27255
LT;594682387037000;"Zainal Arifin.";-;-;-;0;0;-;-;-;-;-;-
OF;HF060009;"HF Pureway-C";107630;4;430520;0;391382;39138;0;0
FK;01;0;0001756824890;2;2017;14/02/2017;061106084008000;"Mira Rebeka Sani";"Jl. Kesenian Blok O 1/12 Rt.016 Rw.009 Duren Sawit Jakarta Timur";1135691;113569;0;0;0;0;0;0;27267
LT;061106084008000;"Mira Rebeka Sani";-;-;-;0;0;-;-;-;-;-;-
OF;PP0175;"Antioxidant Plus Promo (Gratis Magozai 375ml)";1249260;1;1249260;0;1135691;113569;0;0
FK;01;0;0001756824905;2;2017;16/02/2017;061106084008000;"Mira Rebeka Sani";"Jl. Kesenian Blok O 1/12 Rt.016 Rw.009 Duren Sawit Jakarta Timur";1342764;134276;0;0;0;0;0;0;27282
LT;061106084008000;"Mira Rebeka Sani";-;-;-;0;0;-;-;-;-;-;-
OF;PP0187;"Antioxidant Life Promo (Gratis Magozai 375 ml)";1378040;1;1378040;0;1252764;125276;0;0
OF;SK0022;"Starter Kit";99000;1;99000;0;90000;9000;0;0
FK;01;0;0001756824936;2;2017;17/02/2017;145772877711000;"Yesoa Amd.Pd";"Jl. Pangkalima Kapang, Anjir Kalampan KM 1200 Rt. 002 No. 07 Kapuas Kalimantan Tengah 73552";5503183;550317;0;0;0;0;0;0;27296
LT;145772877711000;"Yesoa Amd.Pd";-;-;-;0;0;-;-;-;-;-;-
OF;PP0176;"Cell Protection Promo (Gratis Magozai 750 ml)";1324460;1;1324460;0;1204055;120405;0;0
OF;PP0175;"Antioxidant Plus Promo (Gratis Magozai 375ml)";1249260;1;1249260;0;1135691;113569;0;0
OF;PP0177;"Cerebro Health Promo (Gratis Magozai 750 ml)";1357360;1;1357360;0;1233964;123396;0;0
OF;NT020001;Legres;125020;9;1125180;0;1022891;102289;0;0
OF;HF060011;"HF Salmon Oil 30s";111860;4;447440;0;406764;40676;0;0
OF;NT020012;Legalon;305500;1;305500;0;277727;27773;0;0
OF;MT0094;"Catalog Vol 1 th 2017, January";6900;7;48300;0;43909;4391;0;0
OF;PP080144;"TOP UP Loyalty 3 Vegefrut";49000;4;196000;0;178182;17818;0;0
FK;01;0;0001756824949;2;2017;17/02/2017;061106084008000;"Mira Rebeka Sani";"Jl. Kesenian Blok O 1/12 Rt.016 Rw.009 Duren Sawit Jakarta Timur";5222364;522236;0;0;0;0;0;0;27305
LT;061106084008000;"Mira Rebeka Sani";-;-;-;0;0;-;-;-;-;-;-
OF;PP0187;"Antioxidant Life Promo (Gratis Magozai 375 ml)";1378040;2;2756080;0;2505527;250553;0;0
OF;PP0175;"Antioxidant Plus Promo (Gratis Magozai 375ml)";1249260;2;2498520;0;2271382;227138;0;0
OF;PP080144;"TOP UP Loyalty 3 Vegefrut";49000;10;490000;0;445455;44545;0;0
FK;01;0;0001756824974;2;2017;18/02/2017;594682387037000;"Zainal Arifin.";"Jl. Thalib II No.5 Krukut - Tamansari Jakarta Barat";4392791;439279;0;0;0;0;0;0;27326
LT;594682387037000;"Zainal Arifin.";-;-;-;0;0;-;-;-;-;-;-
OF;HF060007;"HF Bee Propolis Liquid";280120;5;1400600;0;1273273;127327;0;0
OF;PP0175;"Antioxidant Plus Promo (Gratis Magozai 375ml)";1249260;2;2498520;0;2271382;227138;0;0
OF;PP0182;"Royal Skin Promo + Madrid Handbag Hrg Khusus 69rb";932950;1;932950;0;848136;84814;0;0
FK;01;0;0001756824997;2;2017;20/02/2017;061106084008000;"Mira Rebeka Sani";"Jl. Kesenian Blok O 1/12 Rt.016 Rw.009 Duren Sawit Jakarta Timur";1030155;103015;0;0;0;0;0;0;27341
LT;061106084008000;"Mira Rebeka Sani";-;-;-;0;0;-;-;-;-;-;-
OF;NT020012;Legalon;305500;3;916500;0;833182;83318;0;0
OF;PP0172;"Renewskin 30 Promo (Buy 1 Get 1)";216670;1;216670;0;196973;19697;0;0
FK;01;0;0001756825009;2;2017;20/02/2017;082738550831000;"Harun D. Tumbuan";"Komplek RSD Madani No.19 Kota Palu Sualwesi Tengah";450000;45000;0;0;0;0;0;0;27352
LT;082738550831000;"Harun D. Tumbuan";-;-;-;0;0;-;-;-;-;-;-
OF;SK0022;"Starter Kit";99000;5;495000;0;450000;45000;0;0
FK;01;0;0001756825016;2;2017;21/02/2017;082738550831000;"Harun D. Tumbuan";"Komplek RSD Madani No.19 Kota Palu Sualwesi Tengah";4958927;495893;0;0;0;0;0;0;27359
LT;082738550831000;"Harun D. Tumbuan";-;-;-;0;0;-;-;-;-;-;-
OF;PP0187;"Antioxidant Life Promo (Gratis Magozai 375 ml)";1378040;2;2756080;0;2505527;250553;0;0
OF;PP0188;"Care for Cancer Plus Promo (Gratis Magozai 750 ml)";1349370;2;2698740;0;2453400;245340;0;0
FK;01;0;0001756825022;2;2017;22/02/2017;061106084008000;"Mira Rebeka Sani";"Jl. Kesenian Blok O 1/12 Rt.016 Rw.009 Duren Sawit Jakarta Timur";947691;94769;0;0;0;0;0;0;27363
LT;061106084008000;"Mira Rebeka Sani";-;-;-;0;0;-;-;-;-;-;-
OF;PP0174;"Anti-Aging 50+ Promo (Gratis UC Day & Night Cream)";1042460;1;1042460;0;947691;94769;0;0
FK;01;0;0001756825033;2;2017;22/02/2017;061106084008000;"Mira Rebeka Sani";"Jl. Kesenian Blok O 1/12 Rt.016 Rw.009 Duren Sawit Jakarta Timur";1415982;141598;0;0;0;0;0;0;27373
LT;061106084008000;"Mira Rebeka Sani";-;-;-;0;0;-;-;-;-;-;-
OF;PP0175;"Antioxidant Plus Promo (Gratis Magozai 375ml)";1249260;1;1249260;0;1135691;113569;0;0
OF;PP0170;"Echina-C Plus Promo 2 (Gratis Renewskin 30)";154160;2;308320;0;280291;28029;0;0
FK;01;0;0001756825081;2;2017;23/02/2017;594682387037000;"Zainal Arifin.";"Jl. Thalib II No.5 Krukut - Tamansari Jakarta Barat";5466956;546694;0;0;0;0;0;0;27411
LT;594682387037000;"Zainal Arifin.";-;-;-;0;0;-;-;-;-;-;-
OF;PP0168;"Bright Intense Serum Promo (Gratis Renewskin 30)";266020;2;532040;0;483673;48367;0;0
OF;BY030006;"UC - Bright Intense - Facial Foam";190350;2;380700;0;346091;34609;0;0
OF;PP0188;"Care for Cancer Plus Promo (Gratis Magozai 750 ml)";1349370;1;1349370;0;1226700;122670;0;0
OF;NT020011;Asta-Gen;253800;2;507600;0;461455;46145;0;0
OF;PP0187;"Antioxidant Life Promo (Gratis Magozai 375 ml)";1378040;1;1378040;0;1252764;125276;0;0
OF;PP0182;"Royal Skin Promo + Madrid Handbag Hrg Khusus 69rb";932950;2;1865900;0;1696273;169627;0;0
FK;01;0;0001756825085;2;2017;24/02/2017;082738550831000;"Harun D. Tumbuan";"Komplek RSD Madani No.19 Kota Palu Sualwesi Tengah";890909;89091;0;0;0;0;0;0;27415
LT;082738550831000;"Harun D. Tumbuan";-;-;-;0;0;-;-;-;-;-;-
OF;PP080144;"TOP UP Loyalty 3 Vegefrut";49000;20;980000;0;890909;89091;0;0
FK;01;0;0001756825092;2;2017;24/02/2017;082738550831000;"Harun D. Tumbuan";"Komplek RSD Madani No.19 Kota Palu Sualwesi Tengah";4691455;469145;0;0;0;0;0;0;27422
LT;082738550831000;"Harun D. Tumbuan";-;-;-;0;0;-;-;-;-;-;-
OF;PP0180;"Joint Well Promo Disc 15%";1183930;1;1183930;0;1076300;107630;0;0
OF;PP0175;"Antioxidant Plus Promo (Gratis Magozai 375ml)";1249260;1;1249260;0;1135691;113569;0;0
OF;PP0188;"Care for Cancer Plus Promo (Gratis Magozai 750 ml)";1349370;1;1349370;0;1226700;122670;0;0
OF;PP0187;"Antioxidant Life Promo (Gratis Magozai 375 ml)";1378040;1;1378040;0;1252764;125276;0;0
FK;01;0;0001756825100;2;2017;24/02/2017;061106084008000;"Mira Rebeka Sani";"Jl. Kesenian Blok O 1/12 Rt.016 Rw.009 Duren Sawit Jakarta Timur";1396491;139649;0;0;0;0;0;0;27427
LT;061106084008000;"Mira Rebeka Sani";-;-;-;0;0;-;-;-;-;-;-
OF;PP0184;"Double Stamina & Vitality Promo (Gratis Legres)";797120;1;797120;0;724655;72465;0;0
OF;PP0168;"Bright Intense Serum Promo (Gratis Renewskin 30)";266020;1;266020;0;241836;24184;0;0
OF;MT0092;"Paket Legres + Alat Cek Darah";473000;1;473000;0;430000;43000;0;0
FK;01;0;0001756825154;2;2017;27/02/2017;061106084008000;"Mira Rebeka Sani";"Jl. Kesenian Blok O 1/12 Rt.016 Rw.009 Duren Sawit Jakarta Timur";1342764;134276;0;0;0;0;0;0;27474
LT;061106084008000;"Mira Rebeka Sani";-;-;-;0;0;-;-;-;-;-;-
OF;PP0187;"Antioxidant Life Promo (Gratis Magozai 375 ml)";1378040;1;1378040;0;1252764;125276;0;0
OF;SK0022;"Starter Kit";99000;1;99000;0;90000;9000;0;0
FK;01;0;0001756825167;2;2017;27/02/2017;478640824626000;"Anang Purwito";"Jl.SLAMET RIYADI GANG CENTRAL KAV 7 JEMBER 68112";2882536;288253;0;0;0;0;0;0;27482
LT;478640824626000;"Anang Purwito";-;-;-;0;0;-;-;-;-;-;-
OF;NT020011;Asta-Gen;264600;5;1323000;0;1202727;120273;0;0
OF;HF060004;"HF Joint Booster";351330;1;351330;0;319391;31939;0;0
OF;NT020001;Legres;130340;3;391020;0;355473;35547;0;0
OF;NT020004;Legreskin;260680;2;521360;0;473964;47396;0;0
OF;NT020007;Sistocare;267540;2;535080;0;486436;48644;0;0
OF;PP080144;"TOP UP Loyalty 3 Vegefrut";49000;1;49000;0;44545;4454;0;0
FK;01;0;0001756825169;2;2017;27/02/2017;478640824626000;"Anang Purwito";"Jl.SLAMET RIYADI GANG CENTRAL KAV 7 JEMBER 68112";89091;8909;0;0;0;0;0;0;27484
LT;478640824626000;"Anang Purwito";-;-;-;0;0;-;-;-;-;-;-
OF;PP080144;"TOP UP Loyalty 3 Vegefrut";49000;2;98000;0;89091;8909;0;0
FK;01;0;0001756825206;2;2017;27/02/2017;674087382114000;"IDA FENNY ELYSA";"JL. DEBLOD SUNDORO NO. 41 LK. II";8045546;804554;0;0;0;0;0;0;27516
LT;674087382114000;"IDA FENNY ELYSA";-;-;-;0;0;-;-;-;-;-;-
OF;NT020011;Asta-Gen;253800;4;1015200;0;922909;92291;0;0
OF;BY030012;"Astaderm Face Serum";235000;5;1175000;0;1068182;106818;0;0
OF;NT020016;"Calway-C Junior";243460;4;973840;0;885309;88531;0;0
OF;PP0170;"Echina-C Plus Promo 2 (Gratis Renewskin 30)";154160;2;308320;0;280291;28029;0;0
OF;PP0169;"Curcomplex95 Promo (Gratis Legres)";540500;1;540500;0;491364;49136;0;0
OF;HF060004;"HF Joint Booster";336990;2;673980;0;612709;61271;0;0
OF;HF060011;"HF Salmon Oil 30s";111860;4;447440;0;406764;40676;0;0
OF;NT020017;"Magozai 375ml";343100;1;343100;0;311909;31191;0;0
OF;NT020003;"Magozai 750ml";562120;6;3372720;0;3066109;306611;0;0
FK;01;0;0001756825213;2;2017;27/02/2017;061106084008000;"Mira Rebeka Sani";"Jl. Kesenian Blok O 1/12 Rt.016 Rw.009 Duren Sawit Jakarta Timur";90000;9000;0;0;0;0;0;0;27521
LT;061106084008000;"Mira Rebeka Sani";-;-;-;0;0;-;-;-;-;-;-
OF;SK0022;"Starter Kit";99000;1;99000;0;90000;9000;0;0
FK;01;0;0001756825233;2;2017;27/02/2017;061106084008000;"Mira Rebeka Sani";"Jl. Kesenian Blok O 1/12 Rt.016 Rw.009 Duren Sawit Jakarta Timur";652873;65287;0;0;0;0;0;0;27536
LT;061106084008000;"Mira Rebeka Sani";-;-;-;0;0;-;-;-;-;-;-
OF;HF060006;"HF Bee Propolis 30s";204920;1;204920;0;186291;18629;0;0
OF;NT020007;Sistocare;256620;2;513240;0;466582;46658;0;0
FK;01;0;0001756825235;2;2017;27/02/2017;594682387037000;"Zainal Arifin.";"Jl. Thalib II No.5 Krukut - Tamansari Jakarta Barat";324300;32430;0;0;0;0;0;0;27538
LT;594682387037000;"Zainal Arifin.";-;-;-;0;0;-;-;-;-;-;-
OF;BY030005;"UC - Intense Rejuvenating Cream (Day-Night Cream)";356730;1;356730;0;324300;32430;0;0
FK;01;0;0001756825239;2;2017;27/02/2017;082738550831000;"Harun D. Tumbuan";"Komplek RSD Madani No.19 Kota Palu Sualwesi Tengah";511018;51102;0;0;0;0;0;0;27542
LT;082738550831000;"Harun D. Tumbuan";-;-;-;0;0;-;-;-;-;-;-
OF;NT020003;"Magozai 750ml";562120;1;562120;0;511018;51102;0;0
FK;01;0;0001756825240;2;2017;27/02/2017;082738550831000;"Harun D. Tumbuan";"Komplek RSD Madani No.19 Kota Palu Sualwesi Tengah";466582;46658;0;0;0;0;0;0;27543
LT;082738550831000;"Harun D. Tumbuan";-;-;-;0;0;-;-;-;-;-;-
OF;NT020006;"Echina-C Plus";154160;2;308320;0;280291;28029;0;0
OF;HF060006;"HF Bee Propolis 30s";204920;1;204920;0;186291;18629;0;0
FK;01;0;0001756825243;2;2017;27/02/2017;082738550831000;"Harun D. Tumbuan";"Komplek RSD Madani No.19 Kota Palu Sualwesi Tengah";519136;51914;0;0;0;0;0;0;27546
LT;082738550831000;"Harun D. Tumbuan";-;-;-;0;0;-;-;-;-;-;-
OF;BY030006;"UC - Bright Intense - Facial Foam";190350;3;571050;0;519136;51914;0;0
FK;01;0;0001756825244;2;2017;27/02/2017;082738550831000;"Harun D. Tumbuan";"Komplek RSD Madani No.19 Kota Palu Sualwesi Tengah";372582;37258;0;0;0;0;0;0;27547
LT;082738550831000;"Harun D. Tumbuan";-;-;-;0;0;-;-;-;-;-;-
OF;HF060006;"HF Bee Propolis 30s";204920;2;409840;0;372582;37258;0;0
FK;01;0;0171731989934;2;2017;28/02/2017;594682387037000;"Zainal Arifin.";"Jl. Thalib II No.5 Krukut - Tamansari Jakarta Barat";3748037;374803;0;0;0;0;0;0;27642
LT;594682387037000;"Zainal Arifin.";-;-;-;0;0;-;-;-;-;-;-
OF;PP0175;"Antioxidant Plus Promo (Gratis Magozai 375ml)";1249260;3;3747780;0;3407073;340707;0;0
OF;NT020001;Legres;125020;3;375060;0;340964;34096;0;0
FK;01;0;0171731989967;2;2017;28/02/2017;061106084008000;"Mira Rebeka Sani";"Jl. Kesenian Blok O 1/12 Rt.016 Rw.009 Duren Sawit Jakarta Timur";280291;28029;0;0;0;0;0;0;27673
LT;061106084008000;"Mira Rebeka Sani";-;-;-;0;0;-;-;-;-;-;-
OF;PP0170;"Echina-C Plus Promo 2 (Gratis Renewskin 30)";154160;2;308320;0;280291;28029;0;0
FK;01;0;0171731989974;2;2017;28/02/2017;674087382114000;"IDA FENNY ELYSA";"JL. DEBLOD SUNDORO NO. 41 LK. II";19951927;1995192;0;0;0;0;0;0;27679
LT;674087382114000;"IDA FENNY ELYSA";-;-;-;0;0;-;-;-;-;-;-
OF;PP0175;"Antioxidant Plus Promo (Gratis Magozai 375ml)";1249260;12;14991120;0;13628291;1362829;0;0
OF;HF060004;"HF Joint Booster";336990;10;3369900;0;3063545;306354;0;0
OF;NT020009;Gravica;246750;12;2961000;0;2691818;269182;0;0
OF;NT020001;Legres;125020;5;625100;0;568273;56827;0;0
FK;01;0;0171731989980;2;2017;28/02/2017;674087382114000;"IDA FENNY ELYSA";"JL. DEBLOD SUNDORO NO. 41 LK. II";10014418;1001441;0;0;0;0;0;0;27685
LT;674087382114000;"IDA FENNY ELYSA";-;-;-;0;0;-;-;-;-;-;-
OF;NT020001;Legres;125020;37;4625740;0;4205218;420522;0;0
OF;PP0187;"Antioxidant Life Promo (Gratis Magozai 375 ml)";1378040;4;5512160;0;5011055;501105;0;0
OF;PP0172;"Renewskin 30 Promo (Buy 1 Get 1)";216670;2;433340;0;393945;39394;0;0
OF;MT0092;"Paket Legres + Alat Cek Darah";444620;1;444620;0;404200;40420;0;0
FK;01;0;0171731989986;2;2017;28/02/2017;082738550831000;"Harun D. Tumbuan";"Komplek RSD Madani No.19 Kota Palu Sualwesi Tengah";3137036;313703;0;0;0;0;0;0;27691
LT;082738550831000;"Harun D. Tumbuan";-;-;-;0;0;-;-;-;-;-;-
OF;PP0170;"Echina-C Plus Promo 2 (Gratis Renewskin 30)";154160;2;308320;0;280291;28029;0;0
OF;HF060006;"HF Bee Propolis 30s";204920;8;1639360;0;1490327;149033;0;0
OF;HF060011;"HF Salmon Oil 30s";111860;6;671160;0;610145;61014;0;0
OF;HF060012;"HF Glucosefit";277300;3;831900;0;756273;75627;0;0
FK;01;0;0171731989999;2;2017;28/02/2017;579473596823000;"Supantia Saleh";"Jl. Bitung Tengah RT.010 Rw.004. Bitung Tengah - Maesa Bitung";1389490;138949;0;0;0;0;0;0;27704
LT;579473596823000;"Supantia Saleh";-;-;-;0;0;-;-;-;-;-;-
OF;NT020003;"Magozai 750ml";562120;2;1124240;0;1022036;102204;0;0
OF;NT020001;Legres;125020;2;250040;0;227309;22731;0;0
OF;NT020006;"Echina-C Plus";154160;1;154160;0;140145;14014;0;0
FK;01;0;0171731990011;2;2017;28/02/2017;082738550831000;"Harun D. Tumbuan";"Komplek RSD Madani No.19 Kota Palu Sualwesi Tengah";252091;25209;0;0;0;0;0;0;27716
LT;082738550831000;"Harun D. Tumbuan";-;-;-;0;0;-;-;-;-;-;-
OF;HF060012;"HF Glucosefit";277300;1;277300;0;252091;25209;0;0
FK;01;0;0171731990018;2;2017;28/02/2017;674087382114000;"IDA FENNY ELYSA";"JL. DEBLOD SUNDORO NO. 41 LK. II";5497292;549728;0;0;0;0;0;0;27723
LT;674087382114000;"IDA FENNY ELYSA";-;-;-;0;0;-;-;-;-;-;-
OF;BY030011;"Astaderm Face Cream";197400;3;592200;0;538364;53836;0;0
OF;NT020006;"Echina-C Plus";154160;2;308320;0;280291;28029;0;0
OF;PP0173;"HF Salmon Oil 90 Promo (Gratis Legres)";282000;2;564000;0;512727;51273;0;0
OF;NT020003;"Magozai 750ml";562120;4;2248480;0;2044073;204407;0;0
OF;PP0172;"Renewskin 30 Promo (Buy 1 Get 1)";216670;4;866680;0;787891;78789;0;0
OF;PP0171;"Renewskin 15 Promo (Buy 1 Get 1)";124080;4;496320;0;451200;45120;0;0
OF;HF060009;"HF Pureway-C";107630;4;430520;0;391382;39138;0;0
OF;PP0169;"Curcomplex95 Promo (Gratis Legres)";540500;1;540500;0;491364;49136;0;0
FK;01;0;0171731990029;2;2017;28/02/2017;674087382114000;"IDA FENNY ELYSA";"JL. DEBLOD SUNDORO NO. 41 LK. II";15788582;1578858;0;0;0;0;0;0;27733
LT;674087382114000;"IDA FENNY ELYSA";-;-;-;0;0;-;-;-;-;-;-
OF;PP0169;"Curcomplex95 Promo (Gratis Legres)";540500;16;8648000;0;7861818;786182;0;0
OF;HF060006;"HF Bee Propolis 30s";204920;8;1639360;0;1490327;149033;0;0
OF;PP0184;"Double Stamina & Vitality Promo (Gratis Legres)";797120;7;5579840;0;5072582;507258;0;0
OF;NT020001;Legres;125020;12;1500240;0;1363855;136385;0;0
FK;01;0;0171731990040;2;2017;28/02/2017;674087382114000;"IDA FENNY ELYSA";"JL. DEBLOD SUNDORO NO. 41 LK. II";1022891;102289;0;0;0;0;0;0;27744
LT;674087382114000;"IDA FENNY ELYSA";-;-;-;0;0;-;-;-;-;-;-
OF;NT020001;Legres;125020;9;1125180;0;1022891;102289;0;0
FK;01;0;0171731990053;2;2017;28/02/2017;674087382114000;"IDA FENNY ELYSA";"JL. DEBLOD SUNDORO NO. 41 LK. II";1415555;141555;0;0;0;0;0;0;27757
LT;674087382114000;"IDA FENNY ELYSA";-;-;-;0;0;-;-;-;-;-;-
OF;HF060007;"HF Bee Propolis Liquid";280120;3;840360;0;763964;76396;0;0
OF;NT020004;Legreskin;250040;2;500080;0;454618;45462;0;0
OF;PP0172;"Renewskin 30 Promo (Buy 1 Get 1)";216670;1;216670;0;196973;19697;0;0
FK;01;0;0171731990055;2;2017;28/02/2017;674087382114000;"IDA FENNY ELYSA";"JL. DEBLOD SUNDORO NO. 41 LK. II";2613199;261320;0;0;0;0;0;0;27759
LT;674087382114000;"IDA FENNY ELYSA";-;-;-;0;0;-;-;-;-;-;-
OF;HF060007;"HF Bee Propolis Liquid";280120;2;560240;0;509309;50931;0;0
OF;PP0168;"Bright Intense Serum Promo (Gratis Renewskin 30)";266020;4;1064080;0;967345;96734;0;0
OF;NT020004;Legreskin;250040;2;500080;0;454618;45462;0;0
OF;NT020001;Legres;125020;6;750120;0;681927;68193;0;0
FK;01;0;0171731990056;2;2017;28/02/2017;674087382114000;"IDA FENNY ELYSA";"JL. DEBLOD SUNDORO NO. 41 LK. II";454618;45462;0;0;0;0;0;0;27760
LT;674087382114000;"IDA FENNY ELYSA";-;-;-;0;0;-;-;-;-;-;-
OF;NT020001;Legres;125020;4;500080;0;454618;45462;0;0
FK;01;0;0171731990060;2;2017;28/02/2017;674087382114000;"IDA FENNY ELYSA";"JL. DEBLOD SUNDORO NO. 41 LK. II";1704818;170482;0;0;0;0;0;0;27764
LT;674087382114000;"IDA FENNY ELYSA";-;-;-;0;0;-;-;-;-;-;-
OF;NT020001;Legres;125020;15;1875300;0;1704818;170482;0;0
FK;01;0;0171731990063;2;2017;28/02/2017;674087382114000;"IDA FENNY ELYSA";"JL. DEBLOD SUNDORO NO. 41 LK. II";90910;9090;0;0;0;0;0;0;27767
LT;674087382114000;"IDA FENNY ELYSA";-;-;-;0;0;-;-;-;-;-;-
OF;MT0118;"Flyer Promo 1 Mar 2017 (Beli 100 Gratis 50)";50000;1;50000;0;45455;4545;0;0
OF;MT0121;"Flyer Promo 2 Mar 2017 (Beli 100 Gratis 50)";50000;1;50000;0;45455;4545;0;0
FK;01;0;0171731990072;2;2017;28/02/2017;674087382114000;"IDA FENNY ELYSA";"JL. DEBLOD SUNDORO NO. 41 LK. II";1363855;136385;0;0;0;0;0;0;27776
LT;674087382114000;"IDA FENNY ELYSA";-;-;-;0;0;-;-;-;-;-;-
OF;NT020001;Legres;125020;12;1500240;0;1363855;136385;0;0
FK;01;0;0001756825255;2;2017;28/02/2017;061106084008000;"Mira Rebeka Sani";"Jl. Kesenian Blok O 1/12 Rt.016 Rw.009 Duren Sawit Jakarta Timur";90000;9000;0;0;0;0;0;0;27558
LT;061106084008000;"Mira Rebeka Sani";-;-;-;0;0;-;-;-;-;-;-
OF;SK0022;"Starter Kit";99000;1;99000;0;90000;9000;0;0
FK;01;0;0001756825261;2;2017;28/02/2017;594682387037000;"Zainal Arifin.";"Jl. Thalib II No.5 Krukut - Tamansari Jakarta Barat";9397345;939735;0;0;0;0;0;0;27563
LT;594682387037000;"Zainal Arifin.";-;-;-;0;0;-;-;-;-;-;-
OF;PP0175;"Antioxidant Plus Promo (Gratis Magozai 375ml)";1249260;8;9994080;0;9085527;908553;0;0
OF;PP080144;"TOP UP Loyalty 3 Vegefrut";49000;7;343000;0;311818;31182;0;0
FK;01;0;0001756825267;2;2017;28/02/2017;672354446619000;"Surjana Dewi Effendy";"JL. Manyar Tirtoyoso Selatan 4 no. 11 RT 007 RW 005 Manyarsabrangan Mulyorejo surabaya";668182;66818;0;0;0;0;0;0;27569
LT;672354446619000;"Surjana Dewi Effendy";-;-;-;0;0;-;-;-;-;-;-
OF;PP080144;"TOP UP Loyalty 3 Vegefrut";49000;15;735000;0;668182;66818;0;0
FK;01;0;0001756825272;2;2017;28/02/2017;061106084008000;"Mira Rebeka Sani";"Jl. Kesenian Blok O 1/12 Rt.016 Rw.009 Duren Sawit Jakarta Timur";1135691;113569;0;0;0;0;0;0;27573
LT;061106084008000;"Mira Rebeka Sani";-;-;-;0;0;-;-;-;-;-;-
OF;PP0175;"Antioxidant Plus Promo (Gratis Magozai 375ml)";1249260;1;1249260;0;1135691;113569;0;0
FK;01;0;0001756825274;2;2017;28/02/2017;082738550831000;"Harun D. Tumbuan";"Komplek RSD Madani No.19 Kota Palu Sualwesi Tengah";90000;9000;0;0;0;0;0;0;27575
LT;082738550831000;"Harun D. Tumbuan";-;-;-;0;0;-;-;-;-;-;-
OF;SK0022;"Starter Kit";99000;1;99000;0;90000;9000;0;0
FK;01;0;0001756825276;2;2017;28/02/2017;061106084008000;"Mira Rebeka Sani";"Jl. Kesenian Blok O 1/12 Rt.016 Rw.009 Duren Sawit Jakarta Timur";1226700;122670;0;0;0;0;0;0;27577
LT;061106084008000;"Mira Rebeka Sani";-;-;-;0;0;-;-;-;-;-;-
OF;PP0188;"Care for Cancer Plus Promo (Gratis Magozai 750 ml)";1349370;1;1349370;0;1226700;122670;0;0
FK;01;0;0001756825318;2;2017;28/02/2017;061106084008000;"Mira Rebeka Sani";"Jl. Kesenian Blok O 1/12 Rt.016 Rw.009 Duren Sawit Jakarta Timur";4194872;419488;0;0;0;0;0;0;27612
LT;061106084008000;"Mira Rebeka Sani";-;-;-;0;0;-;-;-;-;-;-
OF;PP0175;"Antioxidant Plus Promo (Gratis Magozai 375ml)";1249260;1;1249260;0;1135691;113569;0;0
OF;PP0187;"Antioxidant Life Promo (Gratis Magozai 375 ml)";1378040;2;2756080;0;2505527;250553;0;0
OF;PP0168;"Bright Intense Serum Promo (Gratis Renewskin 30)";266020;1;266020;0;241836;24184;0;0
OF;PP080144;"TOP UP Loyalty 3 Vegefrut";49000;7;343000;0;311818;31182;0;0
