RK;NPWP;NAMA;KD_JENIS_TRANSAKSI;FG_PENGGANTI;NOMOR_FAKTUR;TANGGAL_FAKTUR;NO_DOKUMEN_FAKTUR;TANGGAL_RETUR;MASA_PAJAK_RETUR;TAHUN_PAJAK_RETUR;NILAI_RETUR_DPP;NILAI_RETUR_PPN;NILAI_RETUR_PPNBM
RK;000000000000000;"Sri Purwani";01;0;0001862577686;19/01/2018;0001/UHNCAB/RET/2018;19/01/2018;1;2018;241409;24141;0
RK;000000000000000;"Dr Felly Gresi S.";01;0;0001862577933;27/01/2018;0002/UHNCAB/RET/2018;27/01/2018;1;2018;437682;43768;0
RK;000000000000000;INAM;01;0;0001862578093;30/01/2018;0003/UHNCAB/RET/2018;31/01/2018;1;2018;5436618;543662;0
RK;000000000000000;INAM;01;0;0001862578093;30/01/2018;0004/UHNCAB/RET/2018;31/01/2018;1;2018;1281036;128104;0
