RK;NPWP;NAMA;KD_JENIS_TRANSAKSI;FG_PENGGANTI;NOMOR_FAKTUR;TANGGAL_FAKTUR;NO_DOKUMEN_FAKTUR;TANGGAL_RETUR;MASA_PAJAK_RETUR;TAHUN_PAJAK_RETUR;NILAI_RETUR_DPP;NILAI_RETUR_PPN;NILAI_RETUR_PPNBM
RK;000000000000000;"Rusiani Ely";01;0;0031972503945;13/04/2019;0042/UHNPUSAT/RET/20;13/04/2019;4;2019;330709;33071;0
RK;000000000000000;"Indriyati Salim.";01;0;0031972504262;26/04/2019;0043/UHNPUSAT/RET/20;26/04/2019;4;2019;180000;18000;0
RK;000000000000000;"Ekat Hawini";01;0;0031972504381;29/04/2019;0044/UHNPUSAT/RET/20;29/04/2019;4;2019;1917600;191760;0
RK;000000000000000;SURYANTA;01;0;0031972504489;30/04/2019;0045/UHNPUSAT/RET/20;30/04/2019;4;2019;666545;66655;0
