FK;KD_JENIS_TRANSAKSI;FG_PENGGANTI;NOMOR_FAKTUR;MASA_PAJAK;TAHUN_PAJAK;TANGGAL_FAKTUR;NPWP;NAMA;ALAMAT_LENGKAP;JUMLAH_DPP;JUMLAH_PPN;JUMLAH_PPNBM;ID_KETERANGAN_TAMBAHAN;FP_UANG_MUKA;UANG_MUKA_DPP;UANG_MUKA_PPN;UANG_MUKA_PPNBM;REFERENSI
LT;NPWP;NAMA;JALAN;BLOK;NOMOR;RT;RW;KECAMATAN;KELURAHAN;KABUPATEN;PROPINSI;KODE_POS;NOMOR_TELEPON
OF;KODE_OBJEK;NAMA;HARGA_SATUAN;JUMLAH_BARANG;HARGA_TOTAL;DISKON;DPP;PPN;TARIF_PPNBM;PPNBM
FK;01;0;0041509111326;10;2015;05/10/2015;597360627532000;"AGUS HARIYANTO";"Jl. Pandawa AF-6 Grogol Indah Sukoharjo";724654;72466;0;0;0;0;0;0;17039
LT;597360627532000;"AGUS HARIYANTO";-;-;-;0;0;-;-;-;-;-;-
OF;NT020003;"Magozai ";562120;1;562120;0;511018;51102;0;0
OF;NT020008;Biorate;235000;1;235000;0;213636;21364;0;0
FK;01;0;0041509111345;10;2015;06/10/2015;478640824626000;"Anang Purwito";"Jl.SLAMET RIYADI GANG CENTRAL KAV 7 JEMBER 68112";1421890;142188;0;0;0;0;0;0;17056
LT;478640824626000;"Anang Purwito";-;-;-;0;0;-;-;-;-;-;-
OF;NT020001;Legres;130340;6;782040;0;710945;71094;0;0
OF;NT020004;Legreskin;260680;3;782040;0;710945;71094;0;0
FK;01;0;0041509111349;10;2015;06/10/2015;478640824626000;"Anang Purwito";"Jl.SLAMET RIYADI GANG CENTRAL KAV 7 JEMBER 68112";1421891;142189;0;0;0;0;0;0;17060
LT;478640824626000;"Anang Purwito";-;-;-;0;0;-;-;-;-;-;-
OF;NT020001;Legres;130340;12;1564080;0;1421891;142189;0;0
FK;01;0;0041509111395;10;2015;09/10/2015;597360627532000;"AGUS HARIYANTO";"Jl. Pandawa AF-6 Grogol Indah Sukoharjo";938291;93829;0;0;0;0;0;0;17093
LT;597360627532000;"AGUS HARIYANTO";-;-;-;0;0;-;-;-;-;-;-
OF;NT020003;"Magozai ";562120;1;562120;0;511018;51102;0;0
OF;NT020009;Gravica;235000;2;470000;0;427273;42727;0;0
FK;01;0;0041509111520;10;2015;16/10/2015;597360627532000;"AGUS HARIYANTO";"Jl. Pandawa AF-6 Grogol Indah Sukoharjo";1135691;113569;0;0;0;0;0;0;17189
LT;597360627532000;"AGUS HARIYANTO";-;-;-;0;0;-;-;-;-;-;-
OF;NT020003;"Magozai ";562120;2;1124240;0;1022036;102204;0;0
OF;NT020001;Legres;125020;1;125020;0;113655;11365;0;0
FK;01;0;0041509111546;10;2015;19/10/2015;597360627532000;"AGUS HARIYANTO";"Jl. Pandawa AF-6 Grogol Indah Sukoharjo";851982;85198;0;0;0;0;0;0;17209
LT;597360627532000;"AGUS HARIYANTO";-;-;-;0;0;-;-;-;-;-;-
OF;NT020003;"Magozai ";562120;1;562120;0;511018;51102;0;0
OF;NT020004;Legreskin;250040;1;250040;0;227309;22731;0;0
OF;NT020001;Legres;125020;1;125020;0;113655;11365;0;0
FK;01;0;0041509111651;10;2015;24/10/2015;597360627532000;"AGUS HARIYANTO";"Jl. Pandawa AF-6 Grogol Indah Sukoharjo";1022036;102204;0;0;0;0;0;0;17289
LT;597360627532000;"AGUS HARIYANTO";-;-;-;0;0;-;-;-;-;-;-
OF;NT020003;"Magozai ";562120;2;1124240;0;1022036;102204;0;0
FK;01;0;0041509111674;10;2015;26/10/2015;073245110047000;"Inneke Kusumo";"Jl.Pluit sakti raya no.143 Rt:09 Rw:07

Pluit Penjaringan

Jakarta Utara";1630909;163091;0;0;0;0;0;0;138855
LT;073245110047000;"Inneke Kusumo";-;-;-;0;0;-;-;-;-;-;-
OF;NT020003;"Magozai ";598000;3;1794000;0;1630909;163091;0;0
FK;01;0;0041509111809;10;2015;30/10/2015;154440663201000;Wenny;"Komp. Pondok Indah Permai A/2 

T.Hitam Padang";362727;36273;0;0;0;0;0;0;140003
LT;154440663201000;Wenny;-;-;-;0;0;-;-;-;-;-;-
OF;NT020001;Legres;133000;3;399000;0;362727;36273;0;0
FK;01;0;0041509111903;10;2015;31/10/2015;774312052009000;"Hj Netty Nasir";"Jl. Masjid AL-Barkah No.2 RT.005 RW.001 Kel:Gedong Kec:Pasar Rebo";241818;24182;0;0;0;0;0;0;141299
LT;774312052009000;"Hj Netty Nasir";-;-;-;0;0;-;-;-;-;-;-
OF;NT020001;Legres;133000;2;266000;0;241818;24182;0;0
