module gitlab.com/fastunovsv/leveler/leveler-api

go 1.21.1

require (
	github.com/grpc-ecosystem/grpc-gateway/v2 v2.18.0
	google.golang.org/genproto/googleapis/api v0.0.0-20230920204549-e6e6cdab5c13
	google.golang.org/grpc v1.58.2
	google.golang.org/protobuf v1.31.0
)

require (
	github.com/golang/glog v1.1.0 // indirect
	github.com/golang/protobuf v1.5.3 // indirect
	golang.org/x/net v0.15.0 // indirect
	golang.org/x/sys v0.12.0 // indirect
	golang.org/x/text v0.13.0 // indirect
	google.golang.org/genproto v0.0.0-20230913181813-007df8e322eb // indirect
	google.golang.org/genproto/googleapis/rpc v0.0.0-20230920183334-c177e329c48b // indirect
	google.golang.org/grpc/cmd/protoc-gen-go-grpc v1.3.0 // indirect
	gopkg.in/yaml.v3 v3.0.1 // indirect
)
