{
  "appId": "eu.fastplatform.mobile.farmer",
  "appName": "FaST",
  "bundledWebRuntime": false,
  "npmClient": "npm",
  "webDir": "www",
  "cordova": {},
  "plugins": {
    "SplashScreen": {
      "launchShowDuration": 3000,
      "launchAutoHide": false,
      "backgroundColor": "#1c9bcdff",
      "androidSplashResourceName": "splash",
      "androidScaleType": "CENTER_CROP",
      "androidSpinnerStyle": "large",
      "iosSpinnerStyle": "small",
      "spinnerColor": "#999999",
      "showSpinner": false
    },
    "Keyboard": {
      "resize": "native",
      "style": "light"
    }
  }
}