<svg xmlns="http://www.w3.org/2000/svg" viewBox="0 0 80.1 48">
  <defs>
    <clipPath id="a">
      <path d="M0 0h48v48H0z"/>
    </clipPath>
  </defs>
  <g clip-path="url(#a)">
    <path fill="#37B7EA" d="M6.7 11.4a21.3 21.3 0 0130-4.7C41 9.9 44 14.5 45 19.9h-2v-4a1.3 1.3 0 10-2.6 0V20H40v-3.5a1.3 1.3 0 10-2.6 0v4c-2.8.5-4.6 1.3-5.5 1.7v-4h.4a1.3 1.3 0 00.5-2.5L16 10h-1l-8.4 4a1.3 1.3 0 00.6 2.4v5.2l-4.6.5c.3-3.8 1.7-7.5 4-10.6z"/>
    <path fill="#233644" d="M47.7 20.3A23.8 23.8 0 0020.3.3a23.8 23.8 0 00-20 27.4 23.8 23.8 0 0027.4 20 23.8 23.8 0 0020-27.4zM43.4 33c-1.6-.9-5-2.4-10-3.8a82 82 0 00-30.5-1.8l-.3-2.8 4.7-.6v.6c0 .8.6 1.3 1.3 1.3h22c.5 0 1-.3 1.2-.7a62.7 62.7 0 0112.9 4.4c-.3 1.2-.7 2.3-1.3 3.4zM40 38.2c-2.2-1-6-2.6-11.5-3.9a81.4 81.4 0 00-24-1.5c-.5-1-.8-1.9-1-2.9 13-1.4 23 .1 29 1.8 5 1.3 8.2 2.8 9.7 3.6a22 22 0 01-2.2 2.9zm-5.5 4.5l-.2-.1A73 73 0 008 38.2c-.8-.9-1.6-1.9-2.2-3a69 69 0 0132.3 5c-1.1 1-2.3 1.8-3.6 2.5zM9.9 16.3h11.9v7h-5.5V22a1.3 1.3 0 00-2.6 0v1.5H10v-7.1zm19.4 1v6h-5v-7.8l3.5 1.2 1.5.6zm-16-3.6l2.5-1.2 3.3 1.2h-5.9zm22.5 9.8c2.1-.6 5.4-1.2 9.6-1 0 1.5 0 3-.2 4.5-1.7-1-4.9-2.3-9.4-3.5zM6.7 11.4a21.3 21.3 0 0130-4.7C41 9.9 44 14.5 45 19.9h-2v-4a1.3 1.3 0 10-2.6 0V20H40v-3.5a1.3 1.3 0 10-2.6 0v4c-2.8.5-4.6 1.3-5.5 1.7v-4h.4a1.3 1.3 0 00.5-2.5L16 10h-1l-8.4 4a1.3 1.3 0 00.6 2.4v5.2l-4.6.5c.3-3.8 1.7-7.5 4-10.6zm20.6 33.8a21.3 21.3 0 01-16.5-4.4c8.5.2 15.4 1.8 20.3 3.4-1.2.4-2.5.8-3.8 1z"/>
    <path fill="#37EAAE" d="M34.5 42.7l-.2-.1A73 73 0 008 38.2c-.8-.9-1.6-1.9-2.2-3a69 69 0 0132.3 5c-1.1 1-2.3 1.8-3.6 2.5z"/>
    <path fill="#E6EAEE" d="M10 16.3h11.8v7h-5.5V22a1.3 1.3 0 00-2.6 0v1.5H10v-7.1zM29.3 17.3v6h-5v-7.8l3.5 1.2 1.5.6zM13.2 13.7l2.6-1.2 3.3 1.2h-5.9z"/>
    <path fill="#25B282" d="M35.8 23.5c2.1-.6 5.4-1.2 9.6-1 0 1.5 0 3-.2 4.5-1.7-1-4.9-2.3-9.4-3.5zM40 38.2c-2.2-1-6-2.6-11.5-3.9a81.4 81.4 0 00-24-1.5c-.5-1-.8-1.9-1-2.9 13-1.4 23 .1 29 1.8 5 1.3 8.2 2.8 9.7 3.6a22 22 0 01-2.2 2.9zM27.3 45.2a21.3 21.3 0 01-16.5-4.4c8.5.2 15.4 1.8 20.3 3.4-1.2.4-2.5.8-3.8 1z"/>
    <path fill="#37EAAE" d="M43.4 33a49 49 0 00-10-3.8 81.9 81.9 0 00-30.5-1.8l-.3-2.8 4.7-.6v.6c0 .8.6 1.3 1.3 1.3h22c.5 0 1-.3 1.2-.7a62.7 62.7 0 0112.9 4.4c-.3 1.2-.7 2.3-1.3 3.4z"/>
    <path fill="#0052B4" d="M37.3 45a8.3 8.3 0 100-16.5 8.3 8.3 0 000 16.5z"/>
    <path fill="none" stroke="#233644" stroke-width="1.9" d="M37.3 45a8.3 8.3 0 100-16.5 8.3 8.3 0 000 16.5z"/>
    <path fill="#FFDA44" d="M37.4 31.9l.3.8h.8l-.7.5.3.8-.7-.5-.7.5.3-.8-.7-.5h.8l.3-.8zM33.9 33.3l.7.4.6-.6v.8l.7.4-.9.2-.1.8-.4-.8-.8.2.6-.6-.4-.8zM32.4 36.8l.8-.2v-.9l.5.7.8-.3-.5.7.5.7-.8-.2-.5.7v-1l-.8-.2zM33.9 40.3l.4-.7-.6-.6.8.1.4-.8.1.9.9.1-.8.4.1.9-.6-.6-.7.3zM37.4 41.8L37 41h-.8l.7-.5-.3-.8.7.5.7-.5-.3.8.7.5h-.8l-.3.8zM41 40.3L40 40l-.6.6.2-.9-.8-.4.9-.1v-.9l.5.8.8-.1-.6.6.4.7zM42.4 36.8l-.8.3v.9l-.6-.7-.8.2.5-.7-.5-.7.8.3.6-.7v.9l.8.2zM41 33.3l-.5.8.6.6-.8-.2-.4.8-.1-.8-.9-.2.8-.4-.2-.8.6.6.8-.4z"/>
  </g>
  <path fill="#DA121A" d="M54.2 14.6h23.9V33H54.2z"/>
  <path fill="#FFF" d="M54.2 23.8h12V33h-12zM66.2 14.6H78v9.2H66z"/>
  <path fill="#742C64" d="M59 27c0-.2-.4-.4-.3-.7v-.4h-.2v.1h-.3v.3H58v.3h.2v.2c0 .3.2.4.3.5l.5-.3z"/>
  <path fill="none" stroke="#192E2E" stroke-width=".1" d="M59 27c0-.2-.4-.4-.3-.7v-.4h-.2v.1h-.3v.3H58v.3h.2v.2c0 .3.2.4.3.5l.5-.3z"/>
  <path fill="#742C64" d="M60.4 25.2c-.2 0-.5.1-.2.2l.3.3v.2h-.4c-.1 0 0 0 0 .1-.1.2 0 .3.1.1l.1.1c0 .3-.5.4-.3 0-.4 0-.3.2-.2.4-.2 0-.5.1-.3-.2-.4 0-.4.4 0 .5-.4 0-.6 0-.9.5-.2.2-.3 0-.3 0 .1.1.2.4.4 0 0 .8-.3.8-.3.7 0 0 .1.4.3 0 .2.4 0 .4 0 .4s0 .2.3 0l.2-.3c-.2.2-.4.8-.8.7h-.1v.2h.2c-.2 0-.3 0-.2.2 0 .2.2.4.2 0 0 .3.1.3.2.4.2 0 .2-.2 0-.2l.2-.3c.1.2.2 0 .2 0 .2 0 .1-.1.2-.2l.3-.1c.2.3.6.3 1 .3l.2.1c-.7.3-.5-.3-1.5.3-.1 0-.2 0 0 .2 0 .1 0 .2-.2.3.1.2.2.2.3 0 0 .1.2.3 0 .4h.3v.2c-.5.4-.5-.2-.6 0H59c-.2.2 0 .2.1.3L59 31h-.1v.1c0 .1 0 .2.2.2l.1.2c.3 0 .3-.1.4-.2 0 .3.2-.1.2-.2.1 0 .1.1 0 .2l.5-.7-.1-.2c-.2-.4.2-.5.7-.6-.2.2-.6.6-.4.9v.2c.1.1.2 0 .2-.1l.3.4s.2 0 .2-.2l.4-.2c.2 0 .5.7 0 .5h-.3v.1c0 .2.3 0 .4 0-.5.2-.2 0-.2.3.1.2.2 0 .5-.2h-.1v.4c.4 0 .3-.4.4-.6h.2c-.2 0-.4-.3-.2-.5-.2 0-.4-.2-.3-.3-.1-.2-.1-.2-.4 0-.2-.1-.3-.2-.2-.3.3-.2.3-.4.4-.6 1.6-.6-.9-2.4.2-2.6v.6c.2 0 .3 0 .3.2l.1.2v-.4-.3-.2c-.3-.3-.4-.3-.6-.2-.3.1-.3.6 0 1 .4.7.7 1.4 0 1.4-.3-.2-.8-.2-1-1.3l.2-.2c-.2-.2.2-.8.4-.5l.1-.7h.1s0-.5.2-.4c.1 0 0 0 0 0l-.1-.3-.5-.6h-.5-.2z"/>
  <path fill="none" stroke="#192E2E" stroke-width=".1" d="M60.4 25.2c-.2 0-.5.1-.2.2 0 0 0 0 0 0l.3.3v.2h-.4c-.1 0 0 0 0 .1-.1.2 0 .3.1.1l.1.1c0 .3-.5.4-.3 0-.4 0-.3.2-.2.4-.2 0-.5.1-.3-.2-.4 0-.4.4 0 .5-.4 0-.6 0-.9.5-.2.2-.3 0-.3 0 .1.1.2.4.4 0 0 .8-.3.8-.3.7 0 0 .1.4.3 0 .2.4 0 .4 0 .4s0 .2.3 0l.2-.3c-.2.2-.4.8-.8.7h-.1v.2h.2c-.2 0-.3 0-.2.2 0 .2.2.4.2 0 0 .3.1.3.2.4.2 0 .2-.2 0-.2l.2-.3c.1.2.2 0 .2 0 .2 0 .1-.1.2-.2l.3-.1c.2.3.6.3 1 .3l.2.1c-.7.3-.5-.3-1.5.3 0 0 0 0 0 0-.1 0-.2 0 0 .2 0 .1 0 .2-.2.3.1.2.2.2.3 0 0 .1.2.3 0 .4h.3v.2c-.5.4-.5-.2-.6 0H59c-.2.2 0 .2.1.3L59 31h-.1v.1c0 .1 0 .2.2.2l.1.2c.3 0 .3-.1.4-.2 0 .3.2-.1.2-.2.1 0 .1.1 0 .2l.5-.7-.1-.2c-.2-.4.2-.5.7-.6-.2.2-.6.6-.4.9v.2c.1.1.2 0 .2-.1l.3.4s.2 0 .2-.2l.4-.2c.2 0 .5.7 0 .5h-.3v.1c0 .2.3 0 .4 0-.5.2-.2 0-.2.3.1.2.2 0 .5-.2h-.1v.4c.4 0 .3-.4.4-.6h.2c-.2 0-.4-.3-.2-.5-.2 0-.4-.2-.3-.3-.1-.2-.1-.2-.4 0-.2-.1-.3-.2-.2-.3.3-.2.3-.4.4-.6 1.6-.6-.9-2.4.2-2.6v.6c.2 0 .3 0 .3.2l.1.2v-.4-.3-.2c-.3-.3-.4-.3-.6-.2-.3.1-.3.6 0 1 .4.7.7 1.4 0 1.4-.3-.2-.8-.2-1-1.3l.2-.2h0c-.2-.2.2-.8.4-.5l.1-.7h.1s0-.5.2-.4c.1 0 0 0 0 0l-.1-.3-.5-.6h-.5-.2zM58.2 26.3l.3.2M58.5 26v.3M60.8 25.3l.1.3"/>
  <path fill="#E7E7E7" d="M60.8 25.3s-.3.2 0 .2c.1 0 0-.2 0-.2z"/>
  <path fill="none" stroke="#192E2E" stroke-width=".1" d="M60.8 25.3s-.3.2 0 .2c.1 0 0-.2 0-.2zM60.2 25.3v.1M61.2 25.8s.2.1 0 .3M60.6 25.7l.2.2M60.5 26.9c-.1.2 0 .2.1.1 0 0 0 .3-.3.2-.1-.1 0-.3 0-.4"/>
  <path fill="none" stroke="#192E2E" stroke-width=".1" d="M60.3 27.2c0 .3-.1.7-.5.4.3 0 .2-.4.2-.6 0 0-.1.4-.4.4-.2 0-.1-.3-.1-.3s.2.1.2 0l.2-.4M60.8 27v.2M59.2 27.4s-.2.4 0 .4M59.7 27.7v.3c.1 0-.2.1-.2-.3M62.1 27.4v.2M60.8 29.3c.1.1 0 .2 0 .2M60.7 27.6l.1.2"/>
  <path fill="#DA121A" d="M60.3 25.8s-.1-.1-.4 0c-.3.1-.4 0-.4-.2h.2s-.1.2.2 0l.4.1v.2z"/>
  <path fill="none" stroke="#192E2E" stroke-width=".1" d="M60.3 25.8s-.1-.1-.4 0c-.3.1-.4 0-.4-.2h.2s-.1.2.2 0l.4.1v.2h0z"/>
  <path fill="#192E2E" d="M60.9 25.4s-.2 0 0 0"/>
  <path fill="none" stroke="#192E2E" stroke-width=".1" d="M60.9 25.4s-.2 0 0 0M59.5 28.9c.3-.2.4-.3.3-.6M58.6 29.6h.2M59 30.7h.1M58.7 30.9s.1 0 0 .1M61.2 31.2s.1 0 0 .1M61.3 31.5c.2 0 .1 0 .1.1M61.8 31.6h.2"/>
  <path fill="#FCDD09" d="M61.7 25.4h-.1s-.1 0 0 .1c0 .1 0 0 0 0h.3l-.1.1h-.1-.1l.2.1.1.2h-.3c0-.2-.4-.7-.5-.7V25l.2.1v.1s-.1 0 0 0c0 .1 0 .1 0 0h.2v.1h-.1v.1H61.7z"/>
  <path fill="none" stroke="#192E2E" stroke-width=".1" d="M61.7 25.4h-.1s-.1 0 0 .1c0 .1 0 0 0 0s0 0 0 0h.3l-.1.1h-.1-.1l.2.1.1.2h-.3c0-.2-.4-.7-.5-.7V25l.2.1v.1s-.1 0 0 0c0 .1 0 .1 0 0 0 0 0 0 0 0h.2v.1h-.1v.1h.1s0 0 0 0h.2s0 0 0 0z"/>
  <path fill="#DA121A" d="M58.3 29h-.1l.1.1V29z"/>
  <path fill="none" stroke="#192E2E" stroke-width=".1" d="M58.3 29h-.1l.1.1V29z"/>
  <path fill="#DA121A" d="M58.3 29.3v.2h.1l-.1-.2z"/>
  <path fill="none" stroke="#192E2E" stroke-width=".1" d="M58.3 29.3v.2h.1l-.1-.2z"/>
  <path fill="#DA121A" d="M58.6 29.6v.2l.1-.1c0-.1 0-.1-.1 0z"/>
  <path fill="none" stroke="#192E2E" stroke-width=".1" d="M58.6 29.6v.2l.1-.1c0-.1 0-.1-.1 0z"/>
  <path fill="#DA121A" d="M59 30.7h.1c0-.2 0 0-.1-.1-.1 0 0 .2 0 .1z"/>
  <path fill="none" stroke="#192E2E" stroke-width=".1" d="M59 30.7h.1c0-.2 0 0-.1-.1-.1 0 0 .2 0 .1z"/>
  <path fill="#DA121A" d="M58.7 31c.1 0 0 0 0-.1l-.1.1h.1z"/>
  <path fill="none" stroke="#192E2E" stroke-width=".1" d="M58.7 31c.1 0 0 0 0-.1l-.1.1h.1z"/>
  <g>
    <path fill="#DA121A" d="M59 31.3l.1.1h-.2v-.1z"/>
    <path fill="none" stroke="#192E2E" stroke-width=".1" d="M59 31.3l.1.1h-.2v-.1z"/>
  </g>
  <g>
    <path fill="#DA121A" d="M61.2 31.2s.1.2 0 .2v-.2z"/>
    <path fill="none" stroke="#192E2E" stroke-width=".1" d="M61.2 31.2s.1.2 0 .2c0 0 0 0 0 0v-.2z"/>
  </g>
  <g>
    <path fill="#DA121A" d="M61.3 31.5s.2 0 .1.1h-.2l.1-.1z"/>
    <path fill="none" stroke="#192E2E" stroke-width=".1" d="M61.3 31.5s.2 0 .1.1h-.2l.1-.1z"/>
  </g>
  <g>
    <path fill="#DA121A" d="M61.8 31.6l.2.1h-.2v-.1z"/>
    <path fill="none" stroke="#192E2E" stroke-width=".1" d="M61.8 31.6l.2.1h-.2v-.1z"/>
  </g>
  <g>
    <path fill="#DA121A" d="M58.5 26h.1l-.1-.2v.2z"/>
    <path fill="none" stroke="#192E2E" stroke-width=".1" d="M58.5 26h.1l-.1-.2v.2z"/>
  </g>
  <g>
    <path fill="#DA121A" d="M58.2 26.1h.1l-.1-.1v.1z"/>
    <path fill="none" stroke="#192E2E" stroke-width=".1" d="M58.2 26.1h.1l-.1-.1v.1z"/>
  </g>
  <g>
    <path fill="#DA121A" d="M58 26.4v.1h.2l-.1-.1z"/>
    <path fill="none" stroke="#192E2E" stroke-width=".1" d="M58 26.4v.1h.2l-.1-.1z"/>
  </g>
  <path fill="none" stroke="#121F1F" stroke-width=".1" d="M61 26.1v.3s-.1.2 0 .2c0 0-.1.2-.2-.2 0 0-.2.4-.4 0l.2-.1M59 28.4l.1-.3"/>
  <g>
    <path fill="#DA121A" d="M59 31.2"/>
    <path fill="none" stroke="#000" stroke-width=".1" d="M59 31.2s0 0 0 0"/>
  </g>
  <g>
    <path fill="#FCDD09" d="M59.6 15.7h1.1l.2.2v.5l-.1.1v1.2h.3v-1.3h.7l.2.2v.4l-.1.1v.8l.4.2v.6l-.2.2V21l.4.3v.7l-.7.5h-3.3l-.7-.5v-.7l.4-.3V19l-.1-.2V18l.4-.2V17l-.2-.1v-.4l.2-.2h.7l.1.2v1.1h.2v-1.2l-.1-.6.2-.2z"/>
    <path fill="none" stroke="#000" stroke-width=".1" d="M59.6 15.7h1.1l.2.2v.5l-.1.1v1.2h.3v-1.3h.7l.2.2v.4l-.1.1v.8l.4.2v.6l-.2.2V21l.4.3v.7l-.7.5h-3.3l-.7-.5v-.7l.4-.3V19l-.1-.2V18l.4-.2V17l-.2-.1v-.4l.2-.2h.7l.1.2v1.1h.2v-1.2h0l-.1-.6.2-.2z"/>
    <path fill="none" stroke="#000" stroke-width=".1" d="M59.6 22.6v-1.2s.5-.8 1 0l.1 1.2M57.9 21.4l.6.3h1.1M62.5 21.4l-.7.3h-1.1M57.8 21.7l.7.3h1.1"/>
    <path fill="none" stroke="#000" stroke-width=".1" d="M57.8 21.9l.7.4h1.1M58.2 21.6v.2M58 21.7v.3M58.4 21.9v.3M58.2 22v.4M58 18.7l.7-.3h2.9l.7.3M58.2 18.9l.6-.2h2.7l.6.2M58.2 19.2l.6-.1h2.7l.6.1M58.2 19.6H62M58.2 20h4M58.2 20.4H62M58.2 20.8l.7.1h2.6l.6-.2M58.2 21.1l.6.2h.9M60.7 21.3h.8l.7-.2M58.5 17.9l.2-.2M58.3 17l.2-.2h.6l.2.2M58.5 17.4l.1-.2h.5l.1.2M58.5 17.6l.1-.1h.5l.1.1M61.8 17.9l-.2-.2M59.6 15.7v.6l.1.1v1.3M60.7 15.7v.6l-.1.1v1.3"/>
    <path fill="none" stroke="#000" stroke-width=".1" d="M59.4 16.4l.2-.1h1l.3.1M59.5 16.5h1.3M59.5 16.9l.2-.1h1.1M59.5 17.2l.2-.1h1.1M59.5 17.5h1.3M61.9 17.1H61M61.9 17.4l-.2-.1H61.1M61.8 17.6l-.1-.1h-.4l-.2.1M62.5 21.6l-.7.4h-1M60.7 22.3h1l.8-.4M62.1 21.6v.2M62 21.9v.3M62.3 21.7v.3M62.1 22v.3M61.2 21.7v.3M61 22v.3M61.5 22v.3M61.2 22.3v.3M59 21.7v.3M58.8 22v.3M59.4 22v.3M59 22.3v.3M58.2 21.5l.3-.3M58.3 21.2v-.4M58.7 20.9v.4M58.5 20.8v-.4M58.3 20.4V20M58.7 20v.4M58.5 19.6v.4M58.3 19.2v.4M58.7 19.1v.5M58.5 18.8v.4M62 21.2v-.4M61.7 20.8v.5M61.8 20.8v-.4M62 20.4V20M61.6 20v.5M61.8 19.6v.4M62 19.2v.4M61.6 19.1v.5M61.8 18.8v.4M59 21.7l.3-.4M61 21.3l.2.4M61.8 21.2l.3.3M59.5 20.9v.4M60.2 20.9v.1M60.8 20.9v.4M60.6 20.5v.4M59.7 20.5v.4M60.1 20v.5M59.3 20v.4M60.6 19.6v.4M60.6 18.7v.4M59.7 18.7v.4M60.2 19.1v.4M59.7 19.6v.4M59.3 20v.5M61 20v.5M58.3 18v.2M58.5 17.8v.4M58.7 16.4v.2M58.8 16.4v.2M59 16.4v.2M61.3 16.4v.2M61.5 16.4v.2M61.7 16.4v.2"/>
    <path fill="none" stroke="#000" stroke-width=".1" d="M58.5 22.6v-.9l.4-.4v-2.6l-.2-.3v-.7h.4v.4h.1v-.4h.4v.4h.1v-.4h.4v.4h.1v-.4h.4v.4h.1v-.4h.4v.4h.1v-.4h.4v.7l-.1.3v2.6l.3.4v.9M58.5 16.4v.4l.1.2v.7M59.1 16.4v1.3"/>
    <path fill="none" stroke="#000" stroke-width=".1" d="M58.5 17.1l.1-.1h.5l.1.1M61.8 16.4v.5l-.1.1v.8M61.2 16.4V17.7"/>
    <path fill="none" stroke="#000" stroke-width=".1" d="M61 17l.1-.1H62M59.9 15.7v.3M60.1 15.7v.2M60.4 15.7v.3M61.8 17.9v.3M62 18v.3"/>
    <path fill="#0F47AF" d="M60 17.4V17s.1-.2.3 0v.5H60z"/>
    <path fill="none" stroke="#000" stroke-width=".1" d="M60 17.4V17s.1-.2.3 0v.5H60z"/>
    <path fill="#0F47AF" d="M59.3 20v-.7s.1-.4.3 0v.7h-.3z"/>
    <path fill="none" stroke="#000" stroke-width=".1" d="M59.3 20v-.7s.1-.4.3 0v.7h-.3z"/>
    <g>
      <path fill="#0F47AF" d="M60.7 20v-.7s.1-.4.3 0v.7h-.3z"/>
      <path fill="none" stroke="#000" stroke-width=".1" d="M60.7 20v-.7s.1-.4.3 0v.7h-.3z"/>
    </g>
    <g>
      <path fill="#0F47AF" d="M59.8 21.5s.2-.3.4-.3c0 0 .2 0 .3.2v1.2h-.7v-1.1z"/>
      <path fill="none" stroke="#000" stroke-width=".1" d="M59.8 21.5s.2-.3.4-.3c0 0 .2 0 .3.2v1.2h-.7v-1.1z"/>
    </g>
  </g>
  <g>
    <path fill="#742C64" d="M71 17.8c-.1-.2-.5-.4-.4-.7v-.3l-.2-.2v.2h-.3v.6h.2v.2c0 .3.2.4.3.5l.4-.3z"/>
    <path fill="none" stroke="#192E2E" stroke-width=".1" d="M71 17.8c-.1-.2-.5-.4-.4-.7v-.3l-.2-.2v.2h-.3v.3h0v.3h.2v.2c0 .3.2.4.3.5l.4-.3z"/>
    <path fill="#742C64" d="M72.3 16c-.1 0-.4.1-.2.2v.1l.3.2v.2c0 .1 0 0-.2 0h-.1c-.2 0-.1 0 0 .2-.2 0 0 .2 0 0l.2.1c0 .3-.6.4-.4 0-.3 0-.3.2-.1.4-.2 0-.6.1-.3-.2-.4 0-.4.4-.1.5-.3 0-.6 0-.8.5-.3.2-.4 0-.3 0 0 .1.2.4.4 0 0 .8-.3.8-.3.7 0 0 0 .4.3 0 .2.5 0 .4 0 .4-.1 0 0 .3.3 0l.2-.3c-.3.2-.4.9-.9.7v.2l.2.1-.3.1c.1.2.3.4.3 0 0 .3 0 .3.2.4.1 0 .1-.2 0-.2 0-.1 0-.2.2-.2l.1-.2.2-.1.3-.1c.2.3.7.3 1.1.3l.1.2c-.7.2-.5-.4-1.4.2h-.1s-.1 0 0 .2c0 .1 0 .2-.2.3.2.3.3.2.4 0 0 .1.2.3 0 .4 0 .1.1.2.2 0v.2c-.5.4-.5-.2-.6 0H71c-.2.2.1.2.2.3l-.3-.1h-.1v.1c0 .1 0 .2.2.2l.2.2c.3 0 .2-.1.3-.2.1.3.2-.1.3-.2v.2l.4-.7v-.2c-.2-.4.2-.5.7-.6-.3.2-.6.6-.4.9v.2l.1-.1c.1.1.4.3.3.5 0 0 .3-.1.2-.3l.4-.1c.3 0 .5.6 0 .4h-.2v.2h.3c-.4 0-.2 0-.1.2 0 .2.1 0 .4-.2v.4c.3 0 .3-.4.4-.5l.1-.1c-.2 0-.3-.3-.2-.5-.1 0-.3-.2-.2-.3-.2-.2-.2-.2-.5 0-.1-.1-.3-.2-.2-.3.3-.2.3-.4.4-.6 1.7-.6-.9-2.4.3-2.5v.5c.1 0 .2 0 .3.2v.2s.1-.3 0-.4V18v-.2c-.3-.3-.4-.3-.5-.2-.4.1-.4.6-.1 1 .5.7.7 1.4 0 1.4-.2-.2-.8-.2-1-1.3l.2-.2h.1c-.3-.2.1-.8.4-.4v-.8h.2s-.1-.5.2-.3v-.1s-.2 0-.2-.3c0-.2-.3-.5-.4-.6H72.5v.1h-.2z"/>
    <path fill="none" stroke="#192E2E" stroke-width=".1" d="M72.3 16c-.1 0-.4.1-.2.2v.1l.3.2v.2c0 .1 0 0-.2 0h-.1c-.2 0-.1 0 0 .2-.2 0 0 .2 0 0l.2.1c0 .3-.6.4-.4 0-.3 0-.3.2-.1.4-.2 0-.6.1-.3-.2-.4 0-.4.4-.1.5-.3 0-.6 0-.8.5-.3.2-.4 0-.3 0 0 .1.2.4.4 0 0 .8-.3.8-.3.7 0 0 0 .4.3 0 .2.5 0 .4 0 .4-.1 0 0 .3.3 0l.2-.3c-.3.2-.4.9-.9.7h0v.2l.2.1-.3.1c.1.2.3.4.3 0 0 .3 0 .3.2.4.1 0 .1-.2 0-.2 0-.1 0-.2.2-.2l.1-.2.2-.1.3-.1c.2.3.7.3 1.1.3l.1.2c-.7.2-.5-.4-1.4.2h-.1s-.1 0 0 .2c0 .1 0 .2-.2.3.2.3.3.2.4 0 0 .1.2.3 0 .4 0 .1.1.2.2 0v.2c-.5.4-.5-.2-.6 0H71c-.2.2.1.2.2.3l-.3-.1h-.1v.1c0 .1 0 .2.2.2l.2.2c.3 0 .2-.1.3-.2.1.3.2-.1.3-.2v.2l.4-.7v-.2c-.2-.4.2-.5.7-.6-.3.2-.6.6-.4.9v.2l.1-.1c.1.1.4.3.3.5 0 0 .3-.1.2-.3l.4-.1c.3 0 .5.6 0 .4h-.2v.2h.3c-.4 0-.2 0-.1.2 0 .2.1 0 .4-.2h0v.4c.3 0 .3-.4.4-.5l.1-.1c-.2 0-.3-.3-.2-.5-.1 0-.3-.2-.2-.3-.2-.2-.2-.2-.5 0-.1-.1-.3-.2-.2-.3.3-.2.3-.4.4-.6 1.7-.6-.9-2.4.3-2.5v.5c.1 0 .2 0 .3.2v.2s.1-.3 0-.4V18v-.2c-.3-.3-.4-.3-.5-.2-.4.1-.4.6-.1 1 .5.7.7 1.4 0 1.4-.2-.2-.8-.2-1-1.3l.2-.2h.1c-.3-.2.1-.8.4-.4v-.8h.2s-.1-.5.2-.3v-.1s-.2 0-.2-.3c0-.2-.3-.5-.4-.6H72.5v.1h-.2zM70.1 17l.3.3M70.4 16.8v.3M72.7 16l.2.4"/>
    <path fill="#E7E7E7" d="M72.7 16.1s-.2.3.1.3V16z"/>
    <path fill="none" stroke="#192E2E" stroke-width=".1" d="M72.7 16.1s-.2.3.1.3V16zM72.1 16.1l.1.1M73.2 16.6v.3M72.6 16.5s0 .2.2.2M72.5 17.7c-.2.2 0 .2 0 .1.1 0 .1.3-.2.2-.2-.1-.1-.3 0-.4"/>
    <path fill="none" stroke="#192E2E" stroke-width=".1" d="M72.3 18c0 .3-.2.7-.5.4.3 0 .1-.4.2-.6 0 0-.2.4-.5.4-.2 0 0-.3 0-.3-.1 0 .1.1.2 0l.2-.4M72.8 17.7v.3M71.1 18.2s-.2.4 0 .5M71.6 18.5v.3c.1 0-.2.1-.2-.3M74 18.2v.2M72.7 20.2c.1 0 0 .1 0 .1M72.6 18.4l.1.2"/>
    <path fill="#DA121A" d="M72.2 16.6s0-.1-.4 0c-.3.2-.4 0-.4-.2h.2s0 .2.2.1h.4l.1.2z"/>
    <path fill="none" stroke="#192E2E" stroke-width=".1" d="M72.2 16.6s0-.1-.4 0c-.3.2-.4 0-.4-.2h.2s0 .2.2.1h.4l.1.2h0z"/>
    <path fill="#192E2E" d="M72.8 16.2s-.1.1 0 0"/>
    <path fill="none" stroke="#192E2E" stroke-width=".1" d="M72.8 16.2s-.1.1 0 0M71.5 19.7c.3-.1.3-.3.2-.6M70.5 20.4h.2M71 21.6v-.2M70.7 21.7v.1M73.2 22v.2M73.3 22.3c.1 0 0 0 0 .2M73.8 22.4l.1.1"/>
    <path fill="#FCDD09" d="M73.6 16.2s-.2 0-.1.1c0 .1 0 0 0 0H73.9v.2h-.2s-.1 0 0 0h.2v.2h-.3l-.4-.7v-.3l.2.1-.1.1v.1l.1-.1h.1v.2c0 .1 0 0 0 0h.2s0 .1 0 0z"/>
    <path fill="none" stroke="#192E2E" stroke-width=".1" d="M73.6 16.2h0s-.2 0-.1.1c0 .1 0 0 0 0H73.9v.2h-.2s-.1 0 0 0h.2v.2h-.3l-.4-.7v-.3l.2.1-.1.1v.1s0 0 0 0l.1-.1h.1v.1h0v.1c0 .1 0 0 0 0s0 0 0 0h.2s0 .1 0 0z"/>
    <path fill="#DA121A" d="M70.3 19.8H70l.2.1v-.1z"/>
    <path fill="none" stroke="#192E2E" stroke-width=".1" d="M70.3 19.8H70l.2.1v-.1z"/>
    <path fill="#DA121A" d="M70.2 20.1v.2h.1v-.2z"/>
    <path fill="none" stroke="#192E2E" stroke-width=".1" d="M70.2 20.1v.2h.1v-.2z"/>
    <path fill="#DA121A" d="M70.5 20.4v.2l.2-.1c0-.1-.1 0-.2 0z"/>
    <path fill="none" stroke="#192E2E" stroke-width=".1" d="M70.5 20.4v.2l.2-.1c0-.1-.1 0-.2 0z"/>
    <path fill="#DA121A" d="M71 21.6v-.2c0-.1 0 0 0 0-.2 0 0 .2 0 .2z"/>
    <path fill="none" stroke="#192E2E" stroke-width=".1" d="M71 21.6v-.2c0-.1 0 0 0 0-.2 0 0 .2 0 .2z"/>
    <path fill="#DA121A" d="M70.7 21.8v-.1l-.2.1h.2z"/>
    <path fill="none" stroke="#192E2E" stroke-width=".1" d="M70.7 21.8v-.1l-.2.1h.2z"/>
    <g>
      <path fill="#DA121A" d="M71 22v.2H71v-.1z"/>
      <path fill="none" stroke="#192E2E" stroke-width=".1" d="M71 22v.2H71v-.1z"/>
    </g>
    <g>
      <path fill="#DA121A" d="M73.2 22v.2H73V22z"/>
      <path fill="none" stroke="#192E2E" stroke-width=".1" d="M73.2 22v.2H73V22z"/>
    </g>
    <g>
      <path fill="#DA121A" d="M73.3 22.3s.1 0 0 .2l-.2-.1.2-.1z"/>
      <path fill="none" stroke="#192E2E" stroke-width=".1" d="M73.3 22.3s.1 0 0 .2l-.2-.1.2-.1z"/>
    </g>
    <g>
      <path fill="#DA121A" d="M73.7 22.4l.3.1h-.3v-.1z"/>
      <path fill="none" stroke="#192E2E" stroke-width=".1" d="M73.7 22.4l.3.1h-.3v-.1z"/>
    </g>
    <g>
      <path fill="#DA121A" d="M70.4 16.8h.2l-.2-.1v.1z"/>
      <path fill="none" stroke="#192E2E" stroke-width=".1" d="M70.4 16.8h.2l-.2-.1v.1z"/>
    </g>
    <g>
      <path fill="#DA121A" d="M70.1 17c.2 0 .2-.1.2-.2H70v.1z"/>
      <path fill="none" stroke="#192E2E" stroke-width=".1" d="M70.1 17c.2 0 .2-.1.2-.2H70v.1z"/>
    </g>
    <g>
      <path fill="#DA121A" d="M70 17.2v.1h.1v-.1z"/>
      <path fill="none" stroke="#192E2E" stroke-width=".1" d="M70 17.2v.1h.1v-.1z"/>
    </g>
    <path fill="none" stroke="#121F1F" stroke-width=".1" d="M73 17v.2s-.2.2 0 .3c0 0-.2 0-.2-.3 0 0-.3.4-.5.1 0 0 .2 0 .2-.2M71 19.3v-.4"/>
    <g>
      <path fill="#DA121A" d="M71 22"/>
      <path fill="none" stroke="#000" stroke-width=".1" d="M71 22s0 0 0 0"/>
    </g>
  </g>
  <g>
    <path fill="#FCDD09" d="M71.6 24.9h1l.3.2v.5l-.2.1v1.2h.3v-1.1l.1-.2h.6l.2.2v1.3l.3.2v.5l-.1.3v2.2l.3.3v.7l-.7.5h-3.2l-.7-.5v-.7l.3-.3V27.3l.3-.2v-.8l-.1-.1v-.4l.1-.2h.7l.2.2v.4l-.1.1v.6h.3v-1.2h-.1V25l.2-.2z"/>
    <path fill="none" stroke="#000" stroke-width=".1" d="M71.6 24.9h1l.3.2v.5l-.2.1v1.2h.3v-1.1l.1-.2h.6l.2.2v1.3l.3.2v.5l-.1.3v2.2l.3.3v.7l-.7.5h-3.2l-.7-.5v-.7l.3-.3V27.3l.3-.2v-.8l-.1-.1v-.4l.1-.2h.7l.2.2v.4l-.1.1v.6h.3v-1.2h-.1V25l.2-.2z"/>
    <path fill="none" stroke="#000" stroke-width=".1" d="M71.6 31.8v-1.2s.5-.8 1 0v1.2M69.8 30.6l.7.3h1M74.4 30.6l-.7.3h-1M69.8 30.8l.7.4h1M69.8 31l.7.5h1M70.1 30.7v.3M70 31v.2M70.3 31v.4M70.1 31.3v.2M70 27.9l.6-.3h3l.6.2M70.1 28l.7-.1h2.6l.7.2M70.1 28.4l.7-.1h2.6l.7.1M70.1 28.8h4M70.1 29.2h4M70.1 29.6h4M70.1 30h4M70.1 30.3l.7.2h.8M72.6 30.5h.8l.7-.2M70.4 27l.3-.1M70.3 26.2l.1-.2h.7l.2.2M70.4 26.5h.8M70.4 26.8l.2-.1h.4l.2.1M73.8 27h-.2M71.6 25v1.9M72.6 25v1.9M71.4 25.6l.2-.1h1l.3.1M71.5 25.7h1.2M71.5 26h1.2M71.5 26.4l.2-.1h1M71.5 26.7l.1-.1h1l.1.1M73.8 26.3l-.2-.1h-.4l-.2.1M73.8 26.6l-.1-.1H73M73.8 26.8l-.2-.1H73M74.4 30.8l-.7.4h-1M72.7 31.5h1l.7-.4M74 30.7v.3M74 31v.4M74.3 30.9v.3M74 31.3v.2M73.2 30.9v.3M73 31.2v.3M73.4 31.2v.3M73.2 31.5v.3M71 30.9v.3M70.7 31.2v.3M71.3 31.2v.3M71 31.5v.3M70.1 30.7l.3-.3M70.3 30.4V30M70.6 30v.4M70.4 30v-.4M70.3 29.6v-.4M70.6 29.2v.4M70.5 28.8v.4M70.3 28.4v.4M70.6 28.3v.5M70.4 28v.4M74 30.3V30M73.6 30v.4M73.8 30v-.4M74 29.6v-.4M73.6 29.2v.4M73.8 28.8v.4M74 28.4v.4M73.6 28.3v.5M73.8 28v.3M71 30.9l.2-.4M73 30.5l.2.4M73.8 30.4l.3.3M71.4 30v.5M72.1 30v.2M72.8 30v.5M72.5 29.7v.4M71.7 29.6v.5M72 29.2v.4M71.2 29.2v.4M72.6 28.8v.4M72.5 27.9v.4M71.7 27.8v.5M72.1 28.3v.4M71.7 28.8v.4M71.2 29.2v.5M73 29.2v.5M70.2 27.2v.2M70.4 27v.3M70.6 25.6v.2M70.8 25.6v.2M71 25.6v.2M73.3 25.6v.2M73.4 25.6v.2M73.6 25.6v.2"/>
    <path fill="none" stroke="#000" stroke-width=".1" d="M70.5 31.8v-1l.3-.3V28l-.1-.3V27h.3v.4h.2v-.4h.3v.4h.2v-.4h.3v.4h.2v-.4h.3v.4h.2v-.4h.3v.4h.2v-.4h.4v.7l-.2.3v2.6l.3.4v.9M70.4 25.6v.4l.2.2v.7M71 25.6l.1.4V27"/>
    <path fill="none" stroke="#000" stroke-width=".1" d="M70.4 26.3l.2-.1h.4l.2.1M73.8 25.6v.4l-.2.2v.7M73.1 25.6V27"/>
    <path fill="none" stroke="#000" stroke-width=".1" d="M73 26.2V26h.7l.2.2M71.8 25v.1M72 25v.1M72.4 25v.1M73.8 27v.4M74 27.2v.2"/>
    <path fill="#0F47AF" d="M72 26.6v-.5s0-.3.2 0v.5H72z"/>
    <path fill="none" stroke="#000" stroke-width=".1" d="M72 26.6v-.5s0-.3.2 0v.5H72z"/>
    <path fill="#0F47AF" d="M71.3 29.2v-.7s0-.4.2 0v.7h-.2z"/>
    <path fill="none" stroke="#000" stroke-width=".1" d="M71.3 29.2v-.7s0-.4.2 0v.7h-.2z"/>
    <g>
      <path fill="#0F47AF" d="M72.7 29.2v-.7s0-.4.3 0v.7h-.3z"/>
      <path fill="none" stroke="#000" stroke-width=".1" d="M72.7 29.2v-.7s0-.4.3 0v.7h-.3z"/>
    </g>
    <g>
      <path fill="#0F47AF" d="M71.8 30.6s.1-.2.3-.2c0 0 .2 0 .3.2v1.2h-.6v-1.2z"/>
      <path fill="none" stroke="#000" stroke-width=".1" d="M71.8 30.6s.1-.2.3-.2c0 0 .2 0 .3.2v1.2h-.6v-1.2z"/>
    </g>
  </g>
  <g>
    <path fill="#233644" d="M78 12.9c1.1 0 2 .9 2 2v18.2a2 2 0 01-2 2H54.6c-1 0-1.9-.9-1.9-2V14.9c0-1.1.9-2 2-2H78zM76.5 15H56.2c-1 0-1.7.7-1.7 1.6v14.6c0 .9.8 1.6 1.7 1.6h20.3c1 0 1.7-.7 1.7-1.6V16.7c0-.9-.8-1.6-1.7-1.6z"/>
    <path fill="none" stroke="#233644" stroke-width=".1" d="M78 12.9c1.1 0 2 .9 2 2v18.2a2 2 0 01-2 2H54.6c-1 0-1.9-.9-1.9-2V14.9c0-1.1.9-2 2-2H78zM76.5 15H56.2c-1 0-1.7.7-1.7 1.6v14.6c0 .9.8 1.6 1.7 1.6h20.3c1 0 1.7-.7 1.7-1.6V16.7c0-.9-.8-1.6-1.7-1.6z"/>
  </g>
</svg>
