id,name,provider_id,description,logo,website,is_active,is_visible,callback,callback_with_user_id,callback_with_holding_id,auto_subscribe
fertilicalc,Fertilicalc,itacyl,Fertilicalc es una aplicación y un algoritmo para calcular las necesidades de nutrientes y de fertilizantes con datos para 150 cultivos. El programa permite elegir fertilizantes orgánicos e inorgánicos y evalúa la acidificación y las pérdidas de N. La aplicación incluye el manual y  material de lectura adicional y se puede descargar en los vínculos que se indican a continuación.,add_on/logo/fertilicalc.png,http://www.uco.es/fitotecnia/fertilicalc.html,TRUE,TRUE,,FALSE,FALSE,TRUE
siar-aemet,Servicio Meteorologico,siar-aemet,,add_on/logo/siar-aemet.png,http://www.siar.es,TRUE,TRUE,,FALSE,FALSE,TRUE
vegsyst,VegSyst-DSS,ual,"El Sistema de Apoyo a la Decisión VegSyst (VegSyst-DSS) se ha desarrollado para calcular los requerimientos diarios de fertilizantes y riego con N, y la concentración de N de la solución de nutrientes aplicada aplicada para cultivos de hortalizas fertirrigadas en invernaderos. Se puede usar para cultivos en suelo o sustrato. Los requerimientos de N fertilizantes se basan en la absorción diaria de N del cultivo y consideran el N mineral del suelo en la siembra y el N mineralizado a partir del estiércol y la materia orgánica del suelo. Los requisitos de riego se basan en la evapotranspiración estimada (ETc) y consideran la eficiencia de la aplicación de riego y la salinidad del agua de riego. La ETc se puede calcular utilizando la ecuación de Penman-Monteith adaptada a los invernaderos o la ecuación de radiación de Almería.

VegSyst-DSS tiene muy pocos insumos, todos los cuales están disponibles para agricultores y asesores. Las entradas de datos son:
los parámetros climáticos fácilmente disponibles de la temperatura del aire diaria máxima y mínima y la humedad relativa (HR) en el invernadero, y la radiación solar fuera del invernadero, la cantidad de mineral de suelo N en la zona de la raíz en la siembra: detalles de la aplicación de estiércol más reciente, diseño de riego, características del suelo.

Para los datos climáticos, se puede utilizar una base de datos interna de datos climáticos promedio a largo plazo para Almería; No es necesario ingresar datos climáticos. Las recomendaciones basadas en datos climáticos promedio a largo plazo son adecuadas para climas con una variación climática muy baja entre años, como en los invernaderos de Almería. VegSyst DSS proporciona un plan detallado basado en la ciencia de los requerimientos diarios de N y riego que es específico para las características de un cultivo individual.

Para optimizar completamente el manejo, se sugiere que los usuarios también usen métodos de monitoreo para ajustar N y el manejo del riego.

VegSyst-DSS se basa en el modelo de simulación de cultivos Veg-Syst que calcula la producción diaria de biomasa de cultivos, la absorción crítica de N y ETc para cultivos de hortalizas. El modelo de simulación es impulsado por el tiempo térmico y se adapta a las variaciones en las condiciones climáticas, proporcionando recomendaciones de N y riego específicas para las condiciones de cultivo dadas, como la estación, el tiempo de siembra y el diseño del invernadero y los materiales de cobertura. El VegSyst-DSS asume que los cultivos no tienen limitaciones de agua o nutrientes, lo cual es casi siempre el caso con la producción comercial de vegetales en invernaderos.

El software VegSyst-DSS ha sido programado en Visual C # usando la interfaz visual Winform con un estilo ModernUI; La gestión de datos se realiza a través de la tecnología LocalDBv.11 para Microsoft SQL Server 2012 Express. El software calcula los requerimientos diarios de N y riego para tomates, pimientos, pepinos, melones, sandías, calabacines y berenjenas cultivados en invernadero. También calcula la concentración diaria de N para aplicar en la solución de nutrientes aplicada y la concentración promedio de N por períodos de cuatro semanas.

Para obtener más información acerca de VegSyst-DSS, ayuda para usarlo o comentarios sobre el material presentado, comuníquese con Marisa Gallardo, Departamento de Agronomía, Universidad de Almería, 04120 Almería, España mgallard@ual.es",add_on/logo/vegsyst.jpg,https://w3.ual.es/GruposInv/nitrogeno/VegSyst-DSS.shtml,TRUE,TRUE,,FALSE,FALSE,TRUE
dummy,Dummy add-on,pwc,Este es un complemento ficticio para probar el servicio de suscripción.,add_on/logo/globe.svg,http://www.dummy.com,TRUE,TRUE,https://postman-echo.com/get,TRUE,TRUE,FALSE
sentinel-l2a-rgb-ndvi,Sentinel L2A imagery (RGB/NDVI),sobloo,"La misión Copernicus Sentinel-2 se basa en dos satélites con el Instrumento multiespectral (MSI) con 13 bandas espectrales y un ancho de franja de 290 km. Gracias al MSI y una frecuente revisión (cada 5 días) de cada lugar en la Tierra, es particularmente valioso para aplicaciones agrícolas y forestales y detección de cambios. Sin embargo, otras aplicaciones también pueden beneficiarse de este instrumento óptico, por ejemplo, evaluaciones de contaminación de aguas costeras o de lagos o monitoreo de desastres, por ejemplo, erupciones volcánicas o deslizamientos de tierra.",add_on/logo/sentinel-l2a-rgb-ndvi.jpg,https://sentinel.esa.int/web/sentinel/missions/sentinel-2,TRUE,TRUE,,FALSE,FALSE,TRUE
