id,label,definition,description,parent_id
http://inspire.ec.europa.eu/codelist/SoilProfileParameterNameValue/chemicalParameter,parametro quimico del suelo,,Parametros quimicos observados para caracterizar el perfil de suelo.,
http://inspire.ec.europa.eu/codelist/SoilProfileParameterNameValue/physicalParameter,parametro fisico,,Parametros fisicos observados para caracterizar el perfil de suelo.,
http://inspire.ec.europa.eu/codelist/SoilProfileParameterNameValue/biologicalParameter,parametro biologico,,Parametros biologicos observados para caracterizar el perfil de suelo.,
http://inspire.ec.europa.eu/codelist/SoilProfileParameterNameValue/potentialRootDepth,profundidad potencial de enraizamiento,This depth must take in account the presence of obstacle to roots. An obstacle can be:  ‚Ä¢ a toxic layer resulting from low pH values and associated high concentrations of Al and heavy metals,,
http://inspire.ec.europa.eu/codelist/SoilProfileParameterNameValue/availableWaterCapacity,capacidad de retencion de agua disponible,the amount of water that a soil can store that is available for use by plants. It is the water held between field capacity and the wilting point adjusted downward for rock fragments and for salts in solution. DEFINITION Field capacity: maximum water content expressed in percent (mass fraction or volume fraction),,
http://inspire.ec.europa.eu/codelist/SoilProfileParameterNameValue/carbonStock,reserva de carbono,NOTE The carbon stock is a parameter to be taken into account for meeting the (i) Directive 2009/28/EC of the European Parliament and of the Council (Energy from renewable resources),Masa total de carbono del suelo para una profundidad determinada.,http://inspire.ec.europa.eu/codelist/SoilProfileParameterNameValue/chemicalParameter
http://inspire.ec.europa.eu/codelist/SoilProfileParameterNameValue/waterDrainage,drenaje del agua,The natural water drainage class refers to the frequency and duration of wet periods under conditions similar to those under which the soil developed. Alteration of the water regime by man,,
water_chemicalParameter,parametro quimico del agua,,Parametros quimicos observados para caracterizar el perfil de agua.,