id,name,genus,group_id,notes
1,TRIGO BLANDO,Triticum aestivum,CEREALS,
2,SPELTA,Triticum spelta,CEREALS,
3,TRIGO DURO,Triticum turgidum,CEREALS,
4,MAIZ,Zea mays,FORAGE_NON_LEGUME,
5,CEBADA,Hordeum vulgare,CEREALS,
6,CENTENO,Secale cereale,CEREALS,
7,SORGO,Sorghum bicolor,FORAGE_NON_LEGUME,
8,AVENA,Avena sativa,CEREALS,
9,ALFORFON,Fagopyrum esculentum,CEREALS,
10,MIJO,Setaria italica,CEREALS,
11,ALPISTE,Phalaris arundinacea,FORAGE_NON_LEGUME,
12,TRANQUILLON,,OTHER,
13,TRITICALE,X Triticosecale rimpaui,CEREALS,
14,TRITORDEUM,,OTHER,
19,TEFF,,OTHER,
20,BARBECHO TRADICIONAL,,OTHER,
21,BARBECHO MEDIOAMBIENTAL ABANDONO 5 AÑOS,,OTHER,
23,BARBECHO MEDIOAMBIENTAL,,OTHER,
24,BARBECHO SIN PRODUCCION,,OTHER,
25,ABANDONO 20 AÑOS,,OTHER,
28,RETIRADA FORESTACION,,OTHER,
33,GIRASOL,Helianthus annuus,INDUSTRIAL,
34,SOJA,Glicine max,PULSES,
35,COLZA,Brassica campestris,INDUSTRIAL,
36,CAMELINA,,OTHER,
40,GUISANTE,Pissum sativum,PULSES,
41,HABAS,Vicia faba,PULSES,
43,ALTRAMUZ DULCE,,OTHER,
49,ALUBIAS,,OTHER,
50,GARBANZOS,Cicer arietinum,PULSES,
51,LENTEJAS,Lens culinaris,PULSES,
52,VEZA,Vicia sativa,FORAGE_LEGUME,
53,YEROS,,OTHER,
60,ALFALFA,Medicago sativa,FORAGE_LEGUME,
61,ALHOLVA,,OTHER,
62,PASTOS PERMANENTES DE 5 O MAS AÑOS,,OTHER,
63,PASTOS DE MENOS DE 5 AÑOS,,OTHER,
64,PASTIZAL DE 5 O MAS AÑOS,,OTHER,
65,PASTO ARBUSTIVO DE 5 O MAS AÑOS,,OTHER,
66,PASTO ARBOLADO DE 5 O MAS AÑOS,,OTHER,
67,ESPARCETA,,OTHER,
68,FESTUCA,Festuca or Lolium sp.,FORAGE_NON_LEGUME,
69,RAYGRAS,Lolium perenne ssp. perenne,FORAGE_NON_LEGUME,
70,AGROSTIS,,OTHER,
71,ARRHENATHERUM,,OTHER,
72,DACTILO,Dactylis glomerata,FORAGE_NON_LEGUME,
73,FLEO,Phleum pratense,FORAGE_NON_LEGUME,
74,POA,Poa pratensis,FORAGE_NON_LEGUME,
76,ZULLA,,OTHER,
77,TREBOL,Trifolium repens,FORAGE_LEGUME,
78,RAYGRAS ANUAL (Lolium multiflorum LAM,,OTHER,
80,ARROZ,Oryza sativa,CEREALS,
81,ALGODÓN,Gossypium hirsutum,INDUSTRIAL,
82,REMOLACHA,Beta vulgaris,INDUSTRIAL,
83,TABACO,Nicotiana tabacum,INDUSTRIAL,
84,LUPULO,,OTHER,
85,LINO TEXTIL PARA FIBRA,Linum usitatissimum,INDUSTRIAL,
86,CAÑAMO,,OTHER,
87,CACAHUETE,Arachis hypogaea,PULSES,
88,CARTAMO,Carthamus tinctorius,INDUSTRIAL,
89,CHUFA,,OTHER,
90,REGALIZ,,OTHER,
91,FLORES,,OTHER,
92,ROMANESCU,,OTHER,
93,LINO NO TEXTIL,,OTHER,
96,ESPECIES AROMATICAS HERBACEAS,,OTHER,
97,SETAS,,OTHER,
98,PIMIENTO PARA PIMENTÓN,,OTHER,
99,PATATA,Solanum tuberosum,TUBERS_ROOT,
101,OLIVAR,Olea europaea,TREES,
102,VIÑEDO VINIFICACION,Vitis spp.,TREES,
103,UVA DE MESA,Vitis spp.,TREES,
104,ALMENDROS,Prunus dulcis,TREES,
105,MELOCOTONEROS,Prunus persica,TREES,
106,NECTARINOS,,OTHER,
107,ALBARICOQUEROS,Prunus armeniaca,TREES,
108,PERALES,Pyrus communis,TREES,
109,MANZANOS,Malus sylvestris,TREES,
110,CEREZOS,Prunus avium,TREES,
111,CIRUELOS,Prunus domestica,TREES,
112,NOGALES,Juglans regina,TREES,
113,OTROS FRUTALES,,OTHER,
114,SUPERFICIES FORESTALES MADERABLES,,OTHER,
115,OTRAS SUPERFICIES FORESTALES,,OTHER,
116,CHOPOS,,OTHER,
117,CASTAÑOS,,OTHER,
118,ESPECIES AROMATICAS LEÑOSAS,,OTHER,
119,VIVEROS,,OTHER,
120,VIÑA-OLIVAR,,OTHER,
121,BONIATO,,OTHER,
122,ALGARROBO,,OTHER,
123,AVELLANO,Corylus avellana,TREES,
124,PISTACHO,,OTHER,
125,FRUTOS DE CASCARA,,OTHER,
138,ADORMIDERA,,OTHER,
139,HIERBA CINTA,,OTHER,
140,ABACA ALIAS MANILA,,OTHER,
141,KENAF,,OTHER,
142,YUTE ,,OTHER,
143,SISAL ,,OTHER,
144,PINOS PIÑONEROS,,OTHER,
145,RESTO DE PINOS (NO PIÑONEROS),,OTHER,
146,ARBOLES DE NAVIDAD,,OTHER,
147,ENCINA,,OTHER,
148,BELLOTA,,OTHER,
149,ZARZAMORA (Rubus L,,OTHER,
150,OTRAS UTILIZACIONES NO AGRARIAS NI FORESTALES,,OTHER,
151,PUERROS,Allium sativum,HORTICULTURAL,
152,PIMIENTO,Capsicum annum,HORTICULTURAL,
153,MELÓN,Cucumis melo,HORTICULTURAL,
154,BRÓCOLI,Brassica oleracea,HORTICULTURAL,
155,LECHUGA,Lactuca sativa,HORTICULTURAL,
156,SANDIA,Citrullus lanatus,TREES,
157,CEBOLLA,Allium cepa,HORTICULTURAL,
158,APIO,Apium graveolens,HORTICULTURAL,
159,COLIRRÁBANO,,OTHER,
160,COLIFLOR,Brassica oleracea,HORTICULTURAL,
162,BERENJENA,Solanum melongena,HORTICULTURAL,
163,CALABACÍN,Cucurbita maxima,HORTICULTURAL,
164,ALCACHOFA,Cynara cardunculus,HORTICULTURAL,
165,PEPINO,Cucumis sativus,HORTICULTURAL,
166,ACELGA,,OTHER,
167,CEBOLLETA,,OTHER,
168,CHALOTA,,OTHER,
169,AJO,Allium porrum,HORTICULTURAL,
170,COL,Brassica oleracea var. Capitata,HORTICULTURAL,
171,CHIRIVIA,,OTHER,
172,REPOLLO,,OTHER,
173,COL ROJA O LOMBARDA,,OTHER,
174,COL MILÁN,,OTHER,
175,BERZA,,OTHER,
176,COLES DE BRUSELAS,Brassica oleracea,HORTICULTURAL,
177,ENDIVIA,Cichorium endivia,HORTICULTURAL,
178,ZANAHORIA,Daucus carota,HORTICULTURAL,
179,NABO,Brassica rapa var. rapa,FORAGE_NON_LEGUME,
180,JUDÍA,Phaseolus vulgaris,PULSES,
181,ACHICORIA,Cichorium intybus,HORTICULTURAL,
182,GUINDILLAS,,OTHER,
183,ESPINACA,Spinacia oleracea,HORTICULTURAL,
184,CARDO,,OTHER,
185,CALABAZA,Cucurbita spp.,HORTICULTURAL,
186,CALABAZA DEL PEREGRINO,,OTHER,
187,BORRAJA,,OTHER,
188,PEPINILLOS,,OTHER,
189,ESCAROLA,,OTHER,
190,RÁBANO,Raphanus sativus,HORTICULTURAL,
191,BERRO,,OTHER,
192,FRAMBUESAS,,OTHER,
193,HUERTA,,OTHER,
194,CHAMPIÑÓN,,OTHER,
197,TOMATE,Lycopersicon esculentum,HORTICULTURAL,
198,TOMATE PARA TRANSFORMACIÓN,,OTHER,
200,PAULOWNIA,,OTHER,
201,PLATERINA,,OTHER,
202,PARAGUAYO,,OTHER,
203,ENDRINO,,OTHER,
204,CLEMENTINAS,,OTHER,
205,SATSUMAS,,OTHER,
206,NARANJO,Citrus sinensis,TREES,
207,LIMONERO,Citrus limon,TREES,
208,POMELO,Citrus paradisi,TREES,
209,MANDARINO,,OTHER,
210,MANDARINO HÍBRIDO,,OTHER,
211,MEMBRILLO,Cydonia oblonga,TREES,
212,KIWI,Actinidia spp,TREES,
213,CAQUI O PALOSANTO,Dyospiros kaki,TREES,
214,NISPERO,,OTHER,
215,GROSELLA,,OTHER,
216,ARANDANO,,OTHER,
217,GRANADO,Punica granatum,TREES,
218,HIGUERA,Ficus carica,TREES,
219,FRESAS,Fragaria  spp,HORTICULTURAL,
220,CAÑA DE AZUCAR,Saccharum officinarum,INDUSTRIAL,
221,UVA PASA,,OTHER,
222,QUINOA,Chenopodium quinoa,CEREALS,
223,MISCANTHUS,,OTHER,
224,LEUCAENA,,OTHER,
225,EUCALYPTUS,,OTHER,
226,OPUNTIA,,OTHER,
227,SALIX,,OTHER,
228,ACACIA,,OTHER,
229,AILANTHUS,,OTHER,
230,ROBINIA,,OTHER,
231,GLEDITSIA,,OTHER,
232,JACARANDA,,OTHER,
233,PHYTOLACCA,,OTHER,
234,CASTAÑO (FORESTAL),,OTHER,
235,JATROPHA,,OTHER,
236,CAÑA COMUN (ARUNDO DONAX),,OTHER,
237,SUPERFICIES FORESTALES DE ROTACION CORTA,,OTHER,
238,ALTRAMUZ,,OTHER,
239,ALMORTA,,OTHER,
240,TITARROS,,OTHER,
241,MEZCLA VEZA - AVENA,,OTHER,
242,MEZCLA VEZA-TRITICALE,,OTHER,
243,MEZCLA VEZA-TRIGO,,OTHER,
244,MEZCLA VEZA-CEBADA,,OTHER,
245,MEZCLA ZULLA - AVENA,,OTHER,
246,MEZCLA ZULLA - CEBADA,,OTHER,
247,CULTIVOS MIXTOS DE ESPECIES PRATENSES,,OTHER,
248,ALGARROBA,,OTHER,
249,ALVERJA,,OTHER,
250,ALBERJON,,OTHER,
251,AJEDREA,,OTHER,
252,CILANTRO,,OTHER,
253,ANIS DULCE,,OTHER,
254,ENELDO,,OTHER,
255,MANZANILLA,,OTHER,
256,VALERIANA,,OTHER,
257,ARTEMISA,,OTHER,
258,GENCIANA,,OTHER,
259,HISOPO,,OTHER,
260,HINOJO,,OTHER,
261,PEREJIL,Petroselinum crispum,HORTICULTURAL,
262,AZAFRAN,,OTHER,
263,TOMILLO,,OTHER,
264,ALBAHACA,,OTHER,
265,MELISA O TORONJIL,,OTHER,
266,MENTA,,OTHER,
267,OREGANO,,OTHER,
268,SALVIA,,OTHER,
269,PERIFOLLO,,OTHER,
270,ESTRAGON,,OTHER,
271,MEJORANA,,OTHER,
272,CALENDULA,,OTHER,
273,COMINO,,OTHER,
274,ESTEVIA,,OTHER,
275,HIPERICO,,OTHER,
276,HIERBABUENA,,OTHER,
277,VERBENA,,OTHER,
278,FRUTOS DEL BOSQUE,,OTHER,
279,ESPÁRRAGOS,Asparagus officinalis,HORTICULTURAL,
280,TRUFA,,OTHER,
281,LAVANDA,,OTHER,
282,LAVANDIN,,OTHER,
283,ALCAPARRA,,OTHER,
284,AJENJO,,OTHER,
285,ESPLIEGO,,OTHER,
286,HELICRISO,,OTHER,
287,HIERBALUISA,,OTHER,
288,ROMERO,,OTHER,
289,SANTOLINA,,OTHER,
290,ALOE VERA,,OTHER,
291,CAFE,,OTHER,
292,GROSELLA NEGRA,,OTHER,
293,ROBLE,,OTHER,
294,HAYA,,OTHER,
295,ALCORNOQUE,,OTHER,
296,ABETO,,OTHER,
297,ENEBRO,,OTHER,
298,MEZCLA GUISANTE-CEBADA,,OTHER,
299,MEZCLA GUISANTE-AVENA,,OTHER,
300,SABINA,,OTHER,
301,PINSAPO,,OTHER,
302,MEZCLA EN MARGENES MULTIFUNCIONALES,,OTHER,
303,MEZCLA DE RESERVORIOS,,OTHER,
304,COL CHINA,,OTHER,
305,MEZCLA AVENA-TRIGO,,OTHER,
306,MEZCLA AVENA-CEBADA,,OTHER,
307,MEZCLA AVENA-TRITICALE,,OTHER,
308,AGRIMONIA,,OTHER,
309,BARDANA,,OTHER,
310,DIENTE DE LEÓN,,OTHER,
311,ENULA,,OTHER,
312,EQUINÁCEA,,OTHER,
313,GINSENG,,OTHER,
315,LLANTÉN,,OTHER,
316,MALVAVISCO,,OTHER,
317,MANZANILLA AMARGA,,OTHER,
318,MANZANILLA DULCE,,OTHER,
319,MILENRAMA,,OTHER,
320,POLEO,,OTHER,
321,RÁBANO NEGRO,,OTHER,
322,ROMPEPIEDRA,,OTHER,
323,TRAVALERA,,OTHER,
324,VARA DE ORO,,OTHER,
325,TRIGO KHORASAN,,OTHER,
326,MAÍZ DULCE,Zea mays,HORTICULTURAL,
327,REMOLACHA DE MESA,,OTHER,
328,PASTO DE SUDÁN,,OTHER,
329,AMARANTO,,OTHER,
330,ELEMENTO DEL PAISAJE,,OTHER,
331,MORINGA,,OTHER,
332,MOSTAZA,,OTHER,
333,PORTAINJERTOS DE VID,,OTHER,
334,BARBECHO CON ESPECIES MELÍFERAS,,OTHER,
335,CABECERA DE CULTIVO PERMANENTE,,OTHER,
336,MEZCLA ALGARROBAS - AVENA,,OTHER,
337,MEZCLA ALGARROBAS - CEBADA,,OTHER,
338,MEZCLA VEZA - RAYGRASS,,OTHER,
339,MEZCLA YEROS - AVENA,,OTHER,
340,MEZCLA YEROS - CEBADA,,OTHER,
341,SILPHIUM,,OTHER,
342,OTRAS MEZCLAS CON PREDOMINANCIA CFN,,OTHER,
343,AGUACATE,Persea americana,TREES,
344,MANGO,Mangifera indica,TREES,
345,CHIRIMOYO,Annona cherimola,TREES,
346,PAPAYA,,OTHER,
347,MORERA,,OTHER,
348,VIÑA- FRUTAL,,OTHER,
349,OLIVAR-FRUTAL,,OTHER,
350,RASTROJERAS ,,OTHER,
400,FORESTACIONES VINCULADAS AL REGLAMENTO Nº 2080/1992,,OTHER,
500,FORESTACIONES VINCULADAS AL REGLAMENTO 1257/1999,,OTHER,
600,FORESTACIONES VINCULADAS AL REGLAMENTO 1698/2005,,OTHER,
700,HECTAREAS DE AGROSILVICULTURA DEL REGLAMENTO Nº 1698/2005 Y/O DEL REGLAMENTO Nº 1305/2013,,OTHER,
750,SUPERFICIES VINCULADAS A LA DIRECTIVA 92/43/CEE,,OTHER,
800,FORESTACIONES VINCULADAS AL REGLAMENTO Nº 1305/2013,,OTHER,
850,OTRAS SUPERFICIES FORESTALES - VUELO,,OTHER,
900,SINAPIS ALBA,,OTHER,
901,BRASSICA CARINATA,,OTHER,
902,BRASSICA JUNCEA,,OTHER,
903,OTRAS CRUCÍFERAS,,OTHER,
904,CROTALARIA JUNCEA,,OTHER,
905,PLÁTANO,,OTHER,
906,PIÑA,,OTHER,
907,AZUFAIFO,,OTHER,
908,CARAMBOLO,,OTHER,
909,NASHI,,OTHER,
910,LITCHI,,OTHER,
911,KUMQUAT,,OTHER,
912,LIMEQUAT,,OTHER,
913,MANO DE BUDA,,OTHER,
914,CAVIAR CÍTRICO-FINGER LIME,,OTHER,
915,LIMA,,OTHER,
916,KALE o COL RIZADA ,#N/A,OTHER,
918,ARGÁN,#N/A,OTHER,
919,PITAYA,#N/A,OTHER,
920,LONGAN,#N/A,OTHER,
921,MANGOSTÁN,#N/A,OTHER,
922,RAMBUTÁN,#N/A,OTHER,
923,GUAYABO,#N/A,OTHER,
924,ZAPOTE,#N/A,OTHER,
925,ALFICOZ,#N/A,OTHER,
926,BATATA,#N/A,OTHER,
927,OKRA,#N/A,OTHER,
928,PHYSALIS ,#N/A,OTHER,
929,RÚCULA,#N/A,OTHER,
930,SALICORNIA,#N/A,OTHER,
999,PRODUCTO INDETERMINADO,,OTHER,