id,label,definition,description,parent_id
FERTILIZANTE_ORGANICO,Fertilizante organico,,,
FERTILIZANTE_MINERAL,Fertilizante mineral,,,
SIMPLE,Simple,,,FERTILIZANTE_MINERAL
BINARIO,Binario,,,FERTILIZANTE_MINERAL
TERNARIO,Ternario,,,FERTILIZANTE_MINERAL
NITROGENADO,Nitrogenado,,,SIMPLE
FOSFATADO,Fosfatado,,,SIMPLE
POTASICO,Potasico,,,SIMPLE
BINARIO_NP,Binario NP,,,BINARIO
BINARIO_NK,Binario NK,,,BINARIO
BINARIO_PK,Binario PK,,,BINARIO
TERNARIO_NPK,Ternario NPK,,,TERNARIO
ESTIERCOL,Estiercol,,,FERTILIZANTE_ORGANICO