id,fixed_nitrogen_limitation_id,plant_species_id
1,1,60
2,2,7
3,3,77
4,4,52
5,5,11
6,6,68
7,6,69
8,6,72
9,6,73
10,6,74
11,6,179
12,7,81
13,8,80
14,9,220
15,10,1
16,10,2
17,10,3
18,10,5
19,10,6
20,10,8
21,10,9
22,10,10
23,10,13
24,10,222
25,11,206
26,11,207
27,11,208
28,12,35
29,13,91
30,14,104
31,15,105
32,15,106
33,15,107
34,15,108
35,15,109
36,15,110
37,15,111
38,15,112
39,15,123
40,15,209
41,15,210
42,15,211
43,15,212
44,15,213
45,15,217
46,15,218
47,15,344
48,16,33
49,17,169
50,18,158
51,19,164
52,20,156
53,21,178
54,22,157
55,23,160
56,24,155
57,25,153
58,26,279
59,28,151
60,28,152
61,28,154
62,28,162
63,28,163
64,28,165
65,28,170
66,28,176
67,28,177
68,28,181
69,28,183
70,28,185
71,28,190
72,28,197
73,28,326
74,29,163
75,29,162
76,29,180
77,30,153
78,30,152
79,31,165
80,31,156
81,32,197
82,33,151
83,33,154
84,33,155
85,33,157
86,33,158
87,33,160
88,33,162
89,33,163
90,33,164
91,33,169
92,33,170
93,33,176
94,33,177
95,33,178
96,33,181
97,33,183
98,33,185
99,33,190
100,33,279
101,33,326
102,34,34
103,34,40
104,34,41
105,34,50
106,34,51
107,34,87
108,34,180
109,35,4
110,36,4
111,37,101
112,38,99
113,39,82
114,39,327
115,40,343
116,41,345
117,42,83
118,43,198
119,44,219
120,45,333
