id,label,base_phenomenon_id,uom_id
organic_matter_pct,Porcentaje de materia orgánica,http://inspire.ec.europa.eu/codelist/SoilProfileParameterNameValue/biologicalParameter,percentage
sand_pct,Porcentaje de arena en el suelo,http://inspire.ec.europa.eu/codelist/SoilProfileParameterNameValue/physicalParameter,percentage
silt_pct,Porcentaje de limo en suelo,http://inspire.ec.europa.eu/codelist/SoilProfileParameterNameValue/physicalParameter,percentage
clay_pct,Porcentaje de arcilla en el suelo,http://inspire.ec.europa.eu/codelist/SoilProfileParameterNameValue/physicalParameter,percentage
texture,Textura del suelo,http://inspire.ec.europa.eu/codelist/SoilProfileParameterNameValue/physicalParameter,no_unit
ph,pH,http://inspire.ec.europa.eu/codelist/SoilProfileParameterNameValue/chemicalParameter,no_unit
phosphorus,Fósforo en el suelo,http://inspire.ec.europa.eu/codelist/SoilProfileParameterNameValue/chemicalParameter,ppm
potassium,Potasio en el suelo,http://inspire.ec.europa.eu/codelist/SoilProfileParameterNameValue/chemicalParameter,ppm
calcium,Calcio en el suelo,http://inspire.ec.europa.eu/codelist/SoilProfileParameterNameValue/chemicalParameter,ppm
magnesium,Magnesio en suelo,http://inspire.ec.europa.eu/codelist/SoilProfileParameterNameValue/chemicalParameter,ppm
sodium,Sodio en el suelo,http://inspire.ec.europa.eu/codelist/SoilProfileParameterNameValue/chemicalParameter,ppm
c_n,Relación carbono-nitrógeno,http://inspire.ec.europa.eu/codelist/SoilProfileParameterNameValue/chemicalParameter,no_unit
n_in_water,Nitrato en el agua,water_chemicalParameter,ppm