id,label,definition,description,parent_id
http://inspire.ec.europa.eu/codelist/SoilProfileParameterNameValue/chemicalParameter,Keemiline parameeter,,,
http://inspire.ec.europa.eu/codelist/SoilProfileParameterNameValue/physicalParameter,Füüsikaline parameeter,,,
http://inspire.ec.europa.eu/codelist/SoilProfileParameterNameValue/biologicalParameter,Bioloogiline parameeter,,,
http://inspire.ec.europa.eu/codelist/SoilProfileParameterNameValue/potentialRootDepth,Võimalik juure sügavus,"This depth must take in account the presence of obstacle to roots. An obstacle can be:  • a toxic layer resulting from low pH values and associated high concentrations of Al and heavy metals, or a high salt content, etc.;  • a layer with few oxygen available for plant roots resulting from the presence of permanent or a perched water table, or the presence of a decomposing peat layer, etc;  • a layer forming a mechanical obstacle like a hard rock, a petrocalcic horizon, etc.;  • an impermeable layer such as a fragipan, an iron pan, clay layers in sediments or as result of pedogenesis. NOTE The potential root depth is a parameter to be taken into account for meeting the (i) Agri-environmental indicators that track the integration of environmental concerns into CAP at EU, national and regional levels","This depth must take in account the presence of obstacle to roots. An obstacle can be: • a toxic layer resulting from low pH values and associated high concentrations of Al and heavy metals, or a high salt content, etc.; • a layer with few oxygen available for plant roots resulting from the presence of permanent or a perched water table, or the presence of a decomposing peat layer, etc; • a layer forming a mechanical obstacle like a hard rock, a petrocalcic horizon, etc.; • an impermeable layer such as a fragipan, an iron pan, clay layers in sediments or as result of pedogenesis. NOTE The potential root depth is a parameter to be taken into account for meeting the (i) Agri-environmental indicators that track the integration of environmental concerns into CAP at EU, national and regional levels",
http://inspire.ec.europa.eu/codelist/SoilProfileParameterNameValue/availableWaterCapacity,Olemasolev veemahutavus,"the amount of water that a soil can store that is available for use by plants. It is the water held between field capacity and the wilting point adjusted downward for rock fragments and for salts in solution. DEFINITION Field capacity: maximum water content expressed in percent (mass fraction or volume fraction), that an unsaturated soil can retain against gravity under undisturbed soil conditions (conventionally stated as the water content 2 to 3 days after full saturation with water). DEFINITION Wilting point: water content of the soil below which the plants are not able to uptake water with their root system. SOURCE ISO 11074 NOTE The water available capacity is a parameter to be taken into account for meeting the (i) Directive 2009/28/EC of the European Parliament and of the Council (energy from renewable resources)",,
http://inspire.ec.europa.eu/codelist/SoilProfileParameterNameValue/carbonStock,Süsinikuvaru,NOTE The carbon stock is a parameter to be taken into account for meeting the (i) Directive 2009/28/EC of the European Parliament and of the Council (Energy from renewable resources),Massa totale del carbonio del suolo per una data profondità.,http://inspire.ec.europa.eu/codelist/SoilProfileParameterNameValue/chemicalParameter
http://inspire.ec.europa.eu/codelist/SoilProfileParameterNameValue/waterDrainage,Vee äravool,"The natural water drainage class refers to the frequency and duration of wet periods under conditions similar to those under which the soil developed. Alteration of the water regime by man, either through drainage or irrigation, is not a consideration unless the alterations have significantly changed the morphology of the soil. SOURCE: USDA, Soil Survey Manual. NOTE The water drainage is a parameter to be taken into account for meeting the (i) Council Directive 91/676/EEC of 12 December 1991 concerning the protection of waters against pollution caused by nitrates form agricultural sources, (ii) Directive 2009/28/EC of the European Parliament and of the Council (energy from renewable resources)",,