id,label,base_phenomenon_id,uom_id
organic_matter_pct,Orgaanilise aine protsent,http://inspire.ec.europa.eu/codelist/SoilProfileParameterNameValue/biologicalParameter,percentage
sand_pct,Liiva protsent pinnases,http://inspire.ec.europa.eu/codelist/SoilProfileParameterNameValue/physicalParameter,percentage
silt_pct,Prügi protsent mullas,http://inspire.ec.europa.eu/codelist/SoilProfileParameterNameValue/physicalParameter,percentage
clay_pct,Savi protsent mullas,http://inspire.ec.europa.eu/codelist/SoilProfileParameterNameValue/physicalParameter,percentage
texture,Pinnase tekstuur,http://inspire.ec.europa.eu/codelist/SoilProfileParameterNameValue/physicalParameter,no_unit
ph,pH,http://inspire.ec.europa.eu/codelist/SoilProfileParameterNameValue/chemicalParameter,no_unit
nitrogen,Lammastik pinnases,http://inspire.ec.europa.eu/codelist/SoilProfileParameterNameValue/chemicalParameter,ppm
phosphorus,Fosfor pinnases,http://inspire.ec.europa.eu/codelist/SoilProfileParameterNameValue/chemicalParameter,ppm
potassium,Kaalium pinnases,http://inspire.ec.europa.eu/codelist/SoilProfileParameterNameValue/chemicalParameter,ppm
calcium,Kaltsium mullas,http://inspire.ec.europa.eu/codelist/SoilProfileParameterNameValue/chemicalParameter,ppm
magnesium,Magneesium mullas,http://inspire.ec.europa.eu/codelist/SoilProfileParameterNameValue/chemicalParameter,ppm
copper,Vask mullas,http://inspire.ec.europa.eu/codelist/SoilProfileParameterNameValue/chemicalParameter,ppm
manganese,Mangaan mullas,http://inspire.ec.europa.eu/codelist/SoilProfileParameterNameValue/chemicalParameter,ppm
boron,Boor mullas,http://inspire.ec.europa.eu/codelist/SoilProfileParameterNameValue/chemicalParameter,ppm
organic_carbon,Orgaaniline susinik,http://inspire.ec.europa.eu/codelist/SoilProfileParameterNameValue/chemicalParameter,ppm
sodium,Naatrium pinnases,http://inspire.ec.europa.eu/codelist/SoilProfileParameterNameValue/chemicalParameter,ppm
c_n,Süsiniku ja lämmastiku suhe,http://inspire.ec.europa.eu/codelist/SoilProfileParameterNameValue/chemicalParameter,no_unit