ID|Keel|Nimetus|Definitsioon|Kirjeldus|Governance level ID|Governance level Label|Codelist ID|Codelist label|Reference Source|Reference Link|Status ID|Status label|Parent ID|Successor ID|Predecessor ID
http://inspire.ec.europa.eu/codelist/SoilInvestigationPurposeValue/generalSoilSurvey|et|Üldine mulla uuring|EXAMPLE Soil characterisation for soil mapping, which involves identifying different soil types.|Mulla iseloomustus koos erapooletu uurimise asukoha valikuga.|http://inspire.ec.europa.eu/registry/governance-level/eu-legal|Legal (EU)|http://inspire.ec.europa.eu/codelist/SoilInvestigationPurposeValue|Mulla uurimise eesmärk|||http://inspire.ec.europa.eu/registry/status/valid|Kehtiv|||
http://inspire.ec.europa.eu/codelist/SoilInvestigationPurposeValue/specificSoilSurvey|et|Konkreetne mulla uuring|EXAMPLE investigation on potentially contaminated location|Mulla omaduste uurimine konkreetse eesmärgiga valitud asukohtades.|http://inspire.ec.europa.eu/registry/governance-level/eu-legal|Legal (EU)|http://inspire.ec.europa.eu/codelist/SoilInvestigationPurposeValue|Mulla uurimise eesmärk|||http://inspire.ec.europa.eu/registry/status/valid|Kehtiv|||
