id,backend_leaflet_default_center_latitude,backend_leaflet_default_center_longitude,backend_leaflet_default_zoom,backend_leaflet_min_zoom,backend_leaflet_max_zoom,backend_leaflet_map_width,backend_leaflet_map_height,backend_leaflet_display_raw,backend_leaflet_map_srid,protected_site_overlay_style,hydrography_overlay_style,soil_overlay_style,management_restriction_or_regulation_zone_overlay_style,agri_plot_overlay_style,agri_building_overlay_style,plots_overlay_style
CONFIG,58.5953,25.0136,8,1,22,100%,800px,FALSE,4326,"{
  ""fill"": true,
  ""color"": ""#76fa11"",
  ""radius"": 5,
  ""weight"": 1,
  ""fillColor"": ""#76fa11"",
  ""fillOpacity"": 0.5,
  ""attribution"": ""Keskkonnaministeeriumi""
}","{
  ""fill"": true,
  ""color"": ""#5bccf5"",
  ""radius"": 5,
  ""weight"": 2,
  ""fillColor"": ""#5bccf5"",
  ""fillOpacity"": 0.5,
  ""attribution"": ""Maa-amet""
}","{
  ""fill"": true,
  ""color"": ""#f7de20"",
  ""radius"": 5,
  ""weight"": 1,
  ""fillColor"": ""#f7de20"",
  ""fillOpacity"": 0.5
}","{
  ""fill"": true,
  ""color"": ""#ab19ff"",
  ""radius"": 5,
  ""weight"": 1,
  ""fillColor"": ""#ab19ff"",
  ""fillOpacity"": 0.5,
  ""attribution"": ""Maa-amet""
}","{
  ""fill"": true,
  ""color"": ""#125382"",
  ""radius"": 5,
  ""weight"": 1,
  ""fillColor"": ""#125382"",
  ""fillOpacity"": 0.5,
  ""attribution"": ""PRIA""
}","{
  ""fill"": true,
  ""color"": ""#00108a"",
  ""radius"": 5,
  ""weight"": 1,
  ""fillColor"": ""#00108a"",
  ""fillOpacity"": 0.5
}","{
  ""fill"": true,
  ""color"": ""#1C9ACD"",
  ""radius"": 5,
  ""weight"": 1,
  ""fillColor"": ""#1C9ACD"",
  ""fillOpacity"": 0.5
}"