id,name,description,logo,website,is_active
ilmateenistus,Riigi Ilmateenistus,"Riigi Ilmateenistus töötab Keskkonnaagentuuri koosseisus, mis loodi 1. juunil 2013 Eesti Meteoroloogia ja Hüdroloogia Instituudi (EMHI) ja Keskkonnateabe Keskuse (KTK) liitmisel.",provider/logo/ilmateenistus.png,https://www.ilmateenistus.ee/,TRUE
pwc,PwC for dummy add-ons,,provider/logo/pwc.svg,https://www.pwc.com,TRUE
pmk,Põllumajandusuuringute Keskus,"Põllumajandusuuringute Keskus (PMK) on põllumajandust ja maaelu arengut toetav Maaeluministeeriumi poolt hallatav riigiasutus. PMK ühendab erinevaid laboreid, katsekeskusi ja osakondi, mis tegelevad põllumajanduskeskkonna seire, maamajanduse analüüsi ja maaelu võrgustikutööga. ",provider/logo/pmk.png,https://pmk.agri.ee/,TRUE
sobloo,Sobloo,"Alates töötlemata satelliidipiltide või andmete kogumisest kuni lisandväärtusega teabeni: pakume teile privilegeeritud juurdepääsu hulgale teabele ja tööriistadele, mis aitavad teil teha teadlikke otsuseid ja arendada uusi teenuseid.",provider/logo/sobloo.jpg,https://sobloo.eu/,TRUE