<?xml version="1.0" encoding="UTF-8"?>
<!DOCTYPE svg PUBLIC "-//W3C//DTD SVG 1.1//EN" "http://www.w3.org/Graphics/SVG/1.1/DTD/svg11.dtd">
<svg version="1.1" xmlns="http://www.w3.org/2000/svg" xmlns:xlink="http://www.w3.org/1999/xlink" x="0" y="0" width="32" height="32" viewBox="0, 0, 32, 32">
  <defs>
    <clipPath id="Clip_1">
      <path d="M0,0 L32,0 L32,32 L0,32 z"/>
    </clipPath>
  </defs>
  <g id="Layer_1">
    <g clip-path="url(#Clip_1)">
      <path d="M4.465,7.588 C6.712,4.507 10.024,2.485 13.791,1.895 C14.54,1.778 15.287,1.72 16.03,1.72 C19.029,1.72 21.942,2.664 24.412,4.465 C27.34,6.6 29.31,9.698 30.005,13.234 C29.537,13.222 29.086,13.222 28.653,13.234 L28.653,10.582 C28.653,10.107 28.268,9.722 27.793,9.722 C27.318,9.722 26.933,10.107 26.933,10.582 L26.933,13.341 C26.842,13.35 26.753,13.359 26.664,13.369 L26.664,11.012 C26.664,10.537 26.279,10.152 25.804,10.152 C25.329,10.152 24.944,10.537 24.944,11.012 L24.944,13.633 C23.084,14 21.85,14.523 21.267,14.809 L21.267,12.12 L21.271,12.122 C21.365,12.155 21.461,12.17 21.556,12.17 C21.91,12.17 22.243,11.949 22.367,11.595 C22.524,11.147 22.288,10.656 21.84,10.499 L10.766,6.611 C10.556,6.537 10.325,6.548 10.122,6.641 L4.456,9.239 C4.024,9.437 3.835,9.948 4.033,10.38 C4.188,10.717 4.534,10.906 4.884,10.878 L4.884,14.303 C3.878,14.397 2.844,14.517 1.781,14.666 C2.014,12.132 2.926,9.698 4.465,7.588 z" fill="#37B7EA"/>
      <path d="M31.804,13.525 C31.143,9.304 28.878,5.593 25.425,3.075 C21.973,0.558 17.747,-0.465 13.525,0.196 C9.304,0.857 5.593,3.122 3.075,6.575 C0.558,10.027 -0.465,14.253 0.196,18.475 C0.857,22.696 3.122,26.407 6.575,28.925 C9.342,30.943 12.606,32 15.966,32 C16.798,32 17.637,31.935 18.475,31.804 C22.696,31.143 26.407,28.878 28.925,25.425 C31.442,21.973 32.465,17.747 31.804,13.525 z M28.961,21.996 C27.892,21.432 25.639,20.381 22.249,19.473 C17.982,18.331 11.031,17.218 1.907,18.275 C1.903,18.253 1.899,18.231 1.895,18.208 C1.801,17.609 1.746,17.009 1.728,16.412 C2.81,16.254 3.862,16.129 4.884,16.03 L4.884,16.43 C4.884,16.905 5.269,17.29 5.744,17.29 L20.408,17.29 C20.753,17.29 21.051,17.086 21.187,16.791 C21.754,16.911 22.288,17.034 22.785,17.16 C26.42,18.076 28.795,19.205 29.788,19.732 C29.578,20.506 29.302,21.263 28.961,21.996 z M26.69,25.463 C25.227,24.762 22.644,23.703 19.007,22.883 C14.048,21.765 8.655,21.417 2.97,21.848 C2.698,21.24 2.468,20.61 2.283,19.963 C11.005,18.977 17.638,20.029 21.718,21.111 C24.976,21.976 27.15,22.991 28.142,23.51 C27.952,23.817 27.75,24.118 27.535,24.412 C27.268,24.778 26.986,25.128 26.69,25.463 z M22.987,28.457 C22.947,28.434 22.904,28.413 22.858,28.396 C19.181,27.022 13.165,25.41 5.338,25.5 C4.783,24.88 4.286,24.215 3.851,23.511 C14.892,22.812 22.264,25.359 25.392,26.758 C24.65,27.409 23.844,27.977 22.987,28.457 z M6.604,10.846 L14.53,10.846 L14.53,15.57 L10.868,15.57 L10.868,14.595 C10.868,14.121 10.483,13.735 10.008,13.735 C9.533,13.735 9.148,14.121 9.148,14.595 L9.148,15.57 L6.604,15.57 L6.604,10.846 z M19.548,11.517 L19.548,15.57 L16.25,15.57 L16.25,10.982 L16.25,10.359 L18.538,11.163 L19.548,11.517 z M8.829,9.126 L10.524,8.349 L12.738,9.126 L8.829,9.126 z M23.873,15.666 C25.299,15.253 27.437,14.861 30.239,14.963 C30.314,15.978 30.283,16.988 30.145,17.979 C28.976,17.393 26.874,16.475 23.873,15.666 z M4.465,7.588 C6.712,4.507 10.024,2.485 13.791,1.896 C14.54,1.778 15.287,1.721 16.03,1.721 C19.029,1.721 21.942,2.664 24.412,4.465 C27.34,6.6 29.31,9.698 30.005,13.234 C29.537,13.222 29.086,13.222 28.653,13.234 L28.653,10.582 C28.653,10.107 28.268,9.722 27.793,9.722 C27.318,9.722 26.933,10.107 26.933,10.582 L26.933,13.341 C26.842,13.35 26.753,13.359 26.664,13.369 L26.664,11.012 C26.664,10.537 26.279,10.152 25.804,10.152 C25.329,10.152 24.944,10.537 24.944,11.012 L24.944,13.633 C23.084,14 21.85,14.523 21.267,14.809 L21.267,12.121 L21.271,12.122 C21.365,12.155 21.461,12.17 21.556,12.17 C21.91,12.17 22.243,11.949 22.367,11.595 C22.524,11.147 22.288,10.656 21.84,10.499 L10.766,6.611 C10.556,6.537 10.325,6.548 10.122,6.641 L4.456,9.239 C4.024,9.438 3.835,9.948 4.033,10.38 C4.188,10.718 4.534,10.906 4.884,10.878 L4.884,14.303 C3.878,14.397 2.844,14.517 1.781,14.666 C2.014,12.132 2.926,9.698 4.465,7.588 z M18.208,30.104 C14.441,30.695 10.669,29.782 7.588,27.535 C7.452,27.436 7.319,27.334 7.187,27.231 C12.894,27.364 17.487,28.413 20.729,29.473 C19.918,29.756 19.076,29.969 18.208,30.104 z" fill="#233644"/>
      <path d="M22.987,28.457 C22.947,28.434 22.904,28.413 22.859,28.396 C19.181,27.022 13.165,25.41 5.338,25.5 C4.783,24.88 4.286,24.215 3.851,23.511 C14.892,22.812 22.264,25.359 25.392,26.758 C24.65,27.409 23.844,27.977 22.987,28.457 z" fill="#37EAAE"/>
      <path d="M6.604,10.846 L14.53,10.846 L14.53,15.57 L10.868,15.57 L10.868,14.595 C10.868,14.12 10.483,13.735 10.008,13.735 C9.533,13.735 9.148,14.12 9.148,14.595 L9.148,15.57 L6.604,15.57 L6.604,10.846 z" fill="#E6EAEE"/>
      <path d="M19.548,11.517 L19.548,15.57 L16.25,15.57 L16.25,10.982 L16.25,10.359 L18.538,11.162 L19.548,11.517 z" fill="#E6EAEE"/>
      <path d="M8.829,9.126 L10.524,8.349 L12.738,9.126 L8.829,9.126 z" fill="#E6EAEE"/>
      <path d="M23.873,15.667 C25.299,15.254 27.437,14.861 30.239,14.964 C30.314,15.978 30.283,16.988 30.145,17.979 C28.976,17.394 26.874,16.475 23.873,15.667 z" fill="#25B282"/>
      <path d="M26.69,25.463 C25.227,24.762 22.644,23.703 19.007,22.883 C14.048,21.765 8.655,21.417 2.97,21.848 C2.698,21.24 2.468,20.61 2.283,19.963 C11.005,18.977 17.638,20.029 21.718,21.112 C24.976,21.976 27.15,22.991 28.142,23.51 C27.952,23.817 27.75,24.118 27.535,24.412 C27.268,24.778 26.986,25.128 26.69,25.463 z" fill="#25B282"/>
      <path d="M18.208,30.104 C14.441,30.695 10.669,29.782 7.588,27.535 C7.452,27.436 7.319,27.334 7.187,27.231 C12.894,27.364 17.487,28.413 20.729,29.473 C19.918,29.756 19.076,29.969 18.208,30.104 z" fill="#25B282"/>
      <path d="M28.961,21.996 C27.892,21.432 25.639,20.381 22.249,19.473 C17.982,18.331 11.031,17.218 1.907,18.275 C1.903,18.253 1.899,18.231 1.895,18.209 C1.801,17.609 1.746,17.009 1.728,16.412 C2.81,16.255 3.862,16.129 4.884,16.031 L4.884,16.43 C4.884,16.905 5.269,17.29 5.744,17.29 L20.408,17.29 C20.753,17.29 21.051,17.086 21.187,16.791 C21.754,16.911 22.288,17.035 22.785,17.16 C26.42,18.077 28.795,19.205 29.788,19.732 C29.578,20.506 29.302,21.263 28.961,21.996 z" fill="#37EAAE"/>
      <g>
        <path d="M24.884,30.018 C27.926,30.018 30.393,27.551 30.393,24.509 C30.393,21.466 27.926,19 24.884,19 C21.841,19 19.375,21.466 19.375,24.509 C19.375,27.551 21.841,30.018 24.884,30.018 z" fill="#0052B4"/>
        <path d="M24.884,30.018 C27.926,30.018 30.393,27.551 30.393,24.509 C30.393,21.466 27.926,19 24.884,19 C21.841,19 19.375,21.466 19.375,24.509 C19.375,27.551 21.841,30.018 24.884,30.018 z" fill-opacity="0" stroke="#233644" stroke-width="1.25"/>
      </g>
      <path d="M24.927,21.234 L25.104,21.777 L25.675,21.777 L25.213,22.113 L25.389,22.656 L24.927,22.32 L24.465,22.656 L24.642,22.113 L24.18,21.777 L24.751,21.777 L24.927,21.234 z" fill="#FFDA44"/>
      <path d="M22.581,22.206 L23.09,22.465 L23.493,22.061 L23.404,22.625 L23.913,22.885 L23.349,22.974 L23.26,23.538 L23,23.029 L22.436,23.118 L22.84,22.715 L22.581,22.206 z" fill="#FFDA44"/>
      <path d="M21.609,24.552 L22.152,24.376 L22.152,23.805 L22.488,24.267 L23.031,24.09 L22.695,24.552 L23.031,25.014 L22.488,24.838 L22.152,25.3 L22.152,24.729 L21.609,24.552 z" fill="#FFDA44"/>
      <path d="M22.581,26.899 L22.84,26.39 L22.436,25.986 L23,26.075 L23.26,25.566 L23.349,26.13 L23.913,26.22 L23.404,26.479 L23.493,27.043 L23.09,26.639 L22.581,26.899 z" fill="#FFDA44"/>
      <path d="M24.927,27.871 L24.751,27.327 L24.18,27.327 L24.642,26.992 L24.465,26.448 L24.927,26.784 L25.389,26.448 L25.213,26.992 L25.675,27.327 L25.104,27.327 L24.927,27.871 z" fill="#FFDA44"/>
      <path d="M27.274,26.899 L26.765,26.639 L26.361,27.043 L26.45,26.479 L25.941,26.22 L26.505,26.13 L26.595,25.566 L26.854,26.075 L27.418,25.986 L27.014,26.39 L27.274,26.899 z" fill="#FFDA44"/>
      <path d="M28.246,24.552 L27.702,24.729 L27.702,25.3 L27.367,24.838 L26.823,25.014 L27.159,24.552 L26.823,24.09 L27.367,24.267 L27.702,23.805 L27.702,24.376 L28.246,24.552 z" fill="#FFDA44"/>
      <path d="M27.274,22.206 L27.014,22.715 L27.418,23.118 L26.854,23.029 L26.595,23.538 L26.505,22.974 L25.941,22.884 L26.45,22.625 L26.361,22.061 L26.765,22.465 L27.274,22.206 z" fill="#FFDA44"/>
    </g>
  </g>
</svg>
