id,fixed_nitrogen_limitation_id,plant_species_id
1,1,24
2,2,23
3,3,370
4,4,137
5,5,17
6,5,18
7,5,26
8,5,70
9,5,305
10,5,306
11,5,329
12,5,330
13,5,331
14,5,332
15,5,344
16,5,368
17,6,243
18,6,703
19,7,604
20,8,369
