region,rapport_c_n,temp_air,densite,argile,calcaire,carbone,nnh4_profil,nno3_profil
Ardenne,10.3,9.1,1.03,16.3,0.8,0.8,3.1,25.8
Campine Hennuyère,10.2,,,10.8,,,5.2,24.4
Condroz,10.5,10.9,1.39,18.0,4.8,4.8,2.7,27.6
Famenne,10.1,10.7,1.27,25.0,,,4.4,32.2
Haute Ardenne,9.9,8.5,0.98,24.8,,,,12.4
Région herbagère,10.9,10.1,1.41,22.7,3.0,3.0,2.4,28.0
Rég. herbagère (Fagne),10.2,10.2,,19.6,,,0.9,27.0
Région Jurassique,10.5,10.0,1.29,22.8,,,5.6,8.8
Région Limoneuse,10.3,11.2,1.40,15.5,7.2,7.2,2.4,29.3
Région Sablo-Limoneuse,10.3,11.2,1.48,13.3,3.4,3.4,1.8,27.9