{
  "data": {
    "young_trees__get_fertilization": {
      "id": "f35d9029fe213138d2deeb022d60359c",
      "nitrogen_per_ha_min": null,
      "nitrogen_per_ha": null,
      "nitrogen_per_ha_max": 220,
      "phosphorus_per_ha_min": null,
      "phosphorus_per_ha": null,
      "phosphorus_per_ha_max": 110,
      "potassium_per_ha_min": null,
      "potassium_per_ha": null,
      "potassium_per_ha_max": 110,
      "nitrogen_per_tree_min": 0.4,
      "nitrogen_per_tree": null,
      "nitrogen_per_tree_max": 0.6,
      "phosphorus_per_tree_min": 0.2,
      "phosphorus_per_tree": null,
      "phosphorus_per_tree_max": 0.3,
      "potassium_per_tree_min": 0.2,
      "potassium_per_tree": null,
      "potassium_per_tree_max": 0.3
    }
  }
}