id,name,is_active,is_organic,volatilization_coefficient,nitrogen_urea_content,nitrogen_no3_content,nitrogen_nh4_content,nitrogen_cn2_content,nitrogen_total_content,nitrogen_organic_dry_matter_content,phosphorus_total_content,phosphorus_p2o5_content,potassium_total_content,potassium_k2o_content,dry_matter,sulphur_total_content,sulphur_so4_content,sulphur_so3_content,calcium_total_content,calcium_cao_content,magnesium_total_content,magnesium_mgo_content,sodium_total_content,chlorine_total_content,incorporation_method
NaN,Натриев нитрат,TRUE,FALSE,-0.43,,15,,,15,,0,,0,,,0,,,0,,0,,26,0,topdressing
CaN,Калциев нитрат,TRUE,FALSE,-0.35,,15,,,15,,0,,0,,,0,,,20,28,0,,0,0,topdressing
MgN,Магнезиев нитрат,TRUE,FALSE,-0.35,,11,,,11,,0,,0,,,0,,,0,,9.6,16,0,0,topdressing
AumS,Амониев сулфат,TRUE,FALSE,0.429,,,21,,21,,0,,0,,,24,,,0,,0,,0,0,topdressing
U,Карбамид,TRUE,FALSE,-0.35,46,,,,46,,0,,0,,,0,,,0,,0,,0,0,topdressing
AumN,Амониев нитрат,TRUE,FALSE,-0.35,,16.8,16.7,,33.5,,0,,0,,,0,,,0,,0,,0,0,topdressing
CaAumN,Калциев амониев нитрат,TRUE,FALSE,-0.35,,13,13,,26,,0,,0,,,0,,,6,8,2.1,3.5,0,0,topdressing
NSAum,Амониев нитросулфат,TRUE,FALSE,0.429,,6.5,19.5,,26,,0,,0,,,14.8,,37,0,,0,,0,0,topdressing
N32,Азотни разтвори (32%),TRUE,FALSE,-0.748,16,8,8,,32,,0,,0,,,0,,,0,,0,,0,0,topdressing
Uf,Карбамидформалдехид (UF),TRUE,FALSE,0.666,38,,,,38,,0,,0,,,0,,,0,,0,,0,0,topdressing
Ibdu,Изобутилиден диурея (IBDU),TRUE,FALSE,0.666,32.2,,,,32.2,,0,,0,,,0,,,0,,0,,0,0,topdressing
Cdu,Кротонилиден диурея (CDU),TRUE,FALSE,0.666,29.3,3.3,,,32.5,,0,,0,,,0,,,0,,0,,0,0,topdressing
sPsi,Прост суперфосфат,TRUE,FALSE,0,,,,,0,,9,20,0,,,3.9,12,,20,28,0,,0,0,incorporated
sPco,Суперфосфат концентрат,TRUE,FALSE,0,,,,,0,,18,42,0,,,0,,,0,,0,,0,0,incorporated
TSP,Троен суперфосфат (TSP),TRUE,FALSE,0,,,,,0,,20,46,0,,,0,,,0,,0,,0,0,incorporated
Pac,Фосфорна киселина,TRUE,FALSE,0,,,,,0,,23,52,0,,,0,,,0,,0,,0,0,incorporated
sPac,Суперфосфорна киселина,TRUE,FALSE,0,,,,,0,,30,68,0,,,0,,,0,,0,,0,0,incorporated
DCaP,Дикалциев фосфат,TRUE,FALSE,0,,,,,0,,8,18,0,,,0,,,21,29,0,,0,0,incorporated
CameP,Калциев метафосфат,TRUE,FALSE,0,,,,,0,,26,60,0,,,0,,,0,,0,,0,0,incorporated
caP,Калциниран фосфат,TRUE,FALSE,0,,,,,0,,0,,0,,,0,,,0,,0,,0,0,incorporated
bs,Основни шлаки,TRUE,FALSE,0,,,,,0,,4,9,0,,,0,,,0,,0,,0,0,incorporated
gPr,Смлени фосфатни скали,TRUE,FALSE,0,,,,,0,,1,3,0,,,0,,,0,,0,,0,0,incorporated
KCl,Калиев хлорид,TRUE,FALSE,0,,,,,0,,0,,50,60,,0,,,0,,0,,0,46,incorporated
PS,Калиев сулфат,TRUE,FALSE,0,,,,,0,,0,,44,53,,16,,40,0,,0,,0,0,incorporated
MAP,Моноамониев фосфат (MAP),TRUE,FALSE,-0.622,,12,,,12,,27,52,0,,,15,,4,0,,0,,0,0,topdressing
DAP,Ди-амониев фосфат (DAP),TRUE,FALSE,0.182,,,18,,18,,20,46,0,0,,0,,,0,,0,,0,0,topdressing
APP,Амониеви полифосфати (APP),TRUE,FALSE,-0.622,,,11,,11,,16,37,0,,,0,,,0,,0,,0,0,topdressing
NP,Нитрофосфати,TRUE,FALSE,-0.35,,8,,,8,,7,16,0,,,0,,,0,,0,,0,0,topdressing
KP,Калиеви фосфати,TRUE,FALSE,0,,,,,0,,23,52,28,34,,0,,,0,,0,,0,0,incorporated
KN,Калиев нитрат,TRUE,FALSE,-0.43,,13,,,13,,0,,38,46,,0,,,0,,0,,0,0,topdressing
x8-15-15,Комплекс 8-15-15,TRUE,FALSE,-0.35,,2,6,,8,,7,15,12,15,,0,,,0,,0,,0,0,topdressing
x12-12-24,Комплекс 12-12-24,TRUE,FALSE,-0.35,,5,7,,12,,5,12,20,24,,0,,,0,,0,,0,0,topdressing
x15-15-15,Комплекс 15-15-15,TRUE,FALSE,-0.35,2,,13,,15,,7,15,12,15,,0,,,0,,0,,0,0,topdressing
x9-18-27,Комплекс 9-18-27,TRUE,FALSE,-0.35,,,9,,9,,8,18,22,27,,0,,,0,,0,,0,0,topdressing
x8-24-8,Комплекс 8-24-8,TRUE,FALSE,-0.35,,1.5,6.5,,8,,10,24,7,8,,0,,,0,,0,,0,0,topdressing
x8-24-16,Комплекс 8-24-16,TRUE,FALSE,-0.35,,1.5,6.5,,8,,10,24,13,16,,0,,,0,,0,,0,0,topdressing
x12-24-8,Комплекс 12-24-8,TRUE,FALSE,-0.35,5.3,,7,,12,,10,24,7,8,,0,,,0,,0,,0,0,topdressing
x12-24-12,Комплекс 12-24-12,TRUE,FALSE,-0.35,,,12,,12,,10,24,10,12,,0,,,0,,0,,0,0,topdressing
x9-12-24,Комплекс 9-12-24,TRUE,FALSE,-0.35,,,9,,9,,5,12,20,24,,0,,,0,,0,,0,0,topdressing
x10-20-10,Комплекс 10-20-10,TRUE,FALSE,-0.35,,,10,,10,,9,20,8,10,,0,,,0,,0,,0,0,topdressing
x8-16-8,Комплекс 8-16-8,TRUE,FALSE,-0.35,,,8,,8,,7,16,7,8,,0,,,0,,0,,0,0,topdressing
x18-46-0,Комплекс 18-46-0,TRUE,FALSE,-0.35,,,18,,18,,20,46,0,,,0,,,0,,0,,0,0,topdressing
x10-10-17,Комплекс 10-10-17,TRUE,FALSE,-0.35,6,,4,,10,,4,10,14,17,,0,,,0,,0,,0,0,topdressing
x12-36-12,Комплекс 12-36-12,TRUE,FALSE,-0.35,1.6,3.4,7,,12,,16,36,10,12,,0,,,0,,0,,0,0,topdressing
s4-16-10,Суспензия 4-16-10,TRUE,FALSE,0,,,,,4,,7,16,8,10,,0,,,0,,0,,0,0,incorporated
s5-10-10,Преустановяване 5-10-10,TRUE,FALSE,0.666,5,,,,5,,4,10,8,10,,0,,,0,,0,,0,0,topdressing
s5-20-5,Преустановяване 5-20-5,TRUE,FALSE,0,,,,,5,,9,20,4,5,,0,,,0,,0,,0,0,incorporated
s6-12-16,Преустановяване 6-12-16,TRUE,FALSE,0,,,,,6,,5,12,8,10,,0,,,0,,0,,0,0,incorporated
s6-16-10,Суспензия 6-16-10,TRUE,FALSE,0,,,,,6,,7,16,8,10,,0,,,0,,0,,0,0,incorporated
s10-20-0,Временно отстраняване 10-20-0,TRUE,FALSE,0,,,,,10,,9,20,0,0,,0,,,0,,0,,0,0,incorporated
P7-15-6,Fosfoplus 7-15-6 + 5%S + 9% PHC,TRUE,FALSE,0,,,,,7,,7,15,5,6,,5,,,0,,0,,0,0,incorporated
P8-8-10,Fosfoplus 8-8-10 + 5%S + 9% PHC,TRUE,FALSE,0,,,,,8,,3,8,8,10,,5,,,0,,0,,0,0,incorporated
sP18,Суперфосфат 18%,TRUE,FALSE,0,,,,,0,,8,18,0,0,,0,,,0,,0,,0,0,incorporated
sP45,Суперфосфат 45%,TRUE,FALSE,0,,,,,0,,20,45,0,0,,0,,,0,,0,,0,0,incorporated
acP,Фосфорна киселина,TRUE,FALSE,0,,,,,0,,24,54,0,,,0,,,0,,0,,0,0,incorporated
U46,Карбамид 46%,TRUE,FALSE,0.666,46,,,,46,,0,,0,,,0,,,0,,0,,0,0,topdressing
U46i,Карбамид 46%+ Инхибидор,TRUE,FALSE,0.666,46,,,,46,,0,,0,,,0,,,0,,0,,0,0,topdressing
U40S,Карбамид 40%+ Azufre (YARA Sulfamid),TRUE,FALSE,0.666,40,,,,40,,0,,0,,,5,14,,0,,0,,0,0,topdressing
AumNS26,Амониев нитрофосфат 26%,TRUE,FALSE,0.429,,6.5,19.5,,26,,0,,0,,,12,37,,0,,0,,0,0,topdressing
AumNS21,Амониев нитрофосфат 21%,TRUE,FALSE,0.429,,,21,,21,,0,,0,,,0,,,0,,0,,0,0,topdressing
soN32,Solución N-32,TRUE,FALSE,-0.748,16,8,8,,32,,0,,0,,,0,,,0,,0,,0,0,topdressing
soN20,Solución N-20,TRUE,FALSE,-0.748,,10,10,,20,,0,,0,,,0,,,0,,0,,0,0,topdressing
soN26,Solución N-26,TRUE,FALSE,-0.748,14,5,7,,26,,0,,0,,,2,,6,0,,0,,0,0,topdressing
CaNso,Разтвор на калциев нитрат,TRUE,FALSE,-0.748,,9,,,9,,0,,0,,,0,,,11,16,0,,0,0,topdressing
MgNso,Разтвор на магнезиев нитрат,TRUE,FALSE,-0.748,,7,,,7,,0,,0,,,0,,,0,,5.7,9.5,0,0,topdressing
N33,Нитро33,TRUE,FALSE,0.666,23,,10,,33,,0,,0,,,12,,30,0,,0,,0,0,topdressing
Nplus,Nitroplus,TRUE,FALSE,0.666,15,,3,,18,,0,,0,,,2,,5,0,,0,,0,0,topdressing
Nac,Азотна киселина,TRUE,FALSE,-0.35,,13,,,13,,0,,0,,,0,,,0,,0,,0,0,topdressing
AumN33,Амониев нитрат 33%,TRUE,FALSE,-0.35,,0,50,,33.3,,0,,0,,,0,,,0,,0,,0,0,topdressing
AumN27,Амониев нитрат 27% (NAC),TRUE,FALSE,-0.35,,16.6,16.6,,27,,0,,0,,,0,,,0,,0,,0,0,topdressing
AumN20,Амониев нитрат 20%,TRUE,FALSE,-0.35,,10,10,,20,,0,,0,,,0,,,0,,0,,0,0,topdressing
MgS,Магнезиев сулфат,TRUE,FALSE,0.429,,,,,0,,0,,0,,,13,,32,0,,9.6,16,0,0,topdressing
AumS21,Амониев сулфат 21%,TRUE,FALSE,0.429,,,21,,21,,0,,0,,,24,,60,0,,0,,0,0,topdressing
cm,Кравешки тор,TRUE,TRUE,0.995,,,,,0,0.5,0.35,,0.6,,20,0,,,0,,0,,0,0,incorporated
dc,Млечна крава,TRUE,TRUE,0.995,,,,,0,0.48,0.11,,0.4,,20,0,,,0,,0,,0,0,incorporated
dh,Млечна юница,TRUE,TRUE,0.995,,,,,0,0.53,0.17,,0.51,,20,0,,,0,,0,,0,0,incorporated
bc,Крава за говеда,TRUE,TRUE,0.995,,,,,0,0.6,0.16,,0.33,,25,0,,,0,,0,,0,0,incorporated
bf,Хранилка за говеда,TRUE,TRUE,0.995,,,,,0,0.55,0.19,,0.45,,25,0,,,0,,0,,0,0,incorporated
bes,Говеждо стадо,TRUE,TRUE,0.995,,,,,0,0.51,0.14,,0.41,,25,0,,,0,,0,,0,0,incorporated
sm,Свински тор,TRUE,TRUE,0.995,,,,,0,0.6,0.6,,0.4,,4.2,0,,,0,,0,,0,0,incorporated
sf,Свине за довършителни работи,TRUE,TRUE,0.995,,,,,0,0.76,0.31,,0.46,,4.2,0,,,0,,0,,0,0,incorporated
sg,Отглеждане на свине,TRUE,TRUE,0.995,,,,,0,0.55,0.18,,0.35,,4.2,0,,,0,,0,,0,0,incorporated
sn,Разсадник за свине,TRUE,TRUE,0.995,,,,,0,0.55,0.2,,0.32,,4.2,0,,,0,,0,,0,0,incorporated
sgs,Свине за бременни свине,TRUE,TRUE,0.995,,,,,0,0.78,0.37,,0.43,,4.2,0,,,0,,0,,0,0,incorporated
ss,Свине Свиня и приплод,TRUE,TRUE,0.995,,,,,0,0.45,0.2,,0.32,,4.2,0,,,0,,0,,0,0,incorporated
pm,Птичи тор,TRUE,TRUE,0.995,,,,,0,2.4,2.5,,2,,65,0,,,0,,0,,0,0,incorporated
pl,Птици носачки,TRUE,TRUE,0.995,,,,,0,1.32,0.47,,0.53,,65,0,,,0,,0,,0,0,incorporated
pb,Птици бройлери,TRUE,TRUE,0.995,,,,,0,1.98,0.66,,0.87,,65,0,,,0,,0,,0,0,incorporated
pt,Птици Пуйки,TRUE,TRUE,0.995,,,,,0,1.89,0.78,,0.91,,65,0,,,0,,0,,0,0,incorporated
pd,Птици Патици,TRUE,TRUE,0.995,,,,,0,1.01,0.45,,0.56,,65,0,,,0,,0,,0,0,incorporated
pg,Птицеферма за гъски,TRUE,TRUE,0.995,,,,,0,1.1,0.26,,0.41,,65,0,,,0,,0,,0,0,incorporated
oh,Други Коне,TRUE,TRUE,0.995,,,,,0,0.57,0.11,,0.45,,20,0,,,0,,0,,0,0,incorporated
os,Други Овце,TRUE,TRUE,0.995,,,,,0,0.65,0.4,,1,,20,0,,,0,,0,,0,0,incorporated
og,Други Коза,TRUE,TRUE,0.995,,,,,0,0.99,0.24,,0.89,,20,0,,,0,,0,,0,0,incorporated
or,Други Зайци,TRUE,TRUE,0.995,,,,,0,1.56,0.53,,0.71,,66,0,,,0,,0,,0,0,incorporated
d,ферментационен продукт,TRUE,TRUE,0.995,,,,,0,0.36,0.26,,0.6,,50,0,,,0,,0,,0,0,incorporated
se,Утайка EDAR,TRUE,TRUE,0.995,,,,,0,1,1.2,,0.1,,50,0,,,0,,0,,0,0,incorporated
ps,Птича суспензия,TRUE,TRUE,0.995,,,,,0,1,1,,0.7,,65,0,,,0,,0,,0,0,incorporated
rs,Заешка каша,TRUE,TRUE,0.995,,,,,0,0.85,1.3,,0.75,,66,0,,,0,,0,,0,0,incorporated
pigs,Свинска каша,TRUE,TRUE,0.995,,,,,0,0.6,0.4,,0.35,,4.2,0,,,0,,0,,0,0,incorporated
cs,Кал от едър рогат добитък,TRUE,TRUE,0.995,,,,,0,0.5,0.25,,0.5,,8,0,,,0,,0,,0,0,incorporated