{
  "data": {
    "navigator_f3__compute_balance": {
      "id": "12d758836d0eb3e3dd6256f7ae0a2210",
      "inputs": {
        "id": "19cc722ee2299b56d053648a418bc2a2",
        "nitrogen_mineralization": 50.0,
        "nitrogen_fixation": 2740.14,
        "nitrogen_irrigation": 11.39,
        "nitrogen_in_soil_initial": 30.0,
        "nitrogen_fertilizers": 170.0,
        "phosphorus_fertilizers": 0.0,
        "potassium_fertilizers": 0.0,
        "nitrogen_total": 3001.53,
        "phosphorus_total": 0.0,
        "potassium_total": 0.0
      },
      "outputs": {
        "id": "faed55598fafa2cf0324c7c583204623",
        "nitrogen_leaching": 30.0,
        "nitrogen_denitrification": 768.86,
        "nitrogen_in_soil_final": 20.0,
        "nitrogen_volatilization": 13.25,
        "nitrogen_uptake": 3425.17,
        "phosphorus_uptake": 75.02,
        "potassium_uptake": 222.96,
        "nitrogen_total": 4257.28,
        "phosphorus_total": 75.02,
        "potassium_total": 222.96
      },
      "fertilizations": [
        {
          "id": "ac1b3d8e55aaec5169bfc83d9322b8ac",
          "quantity": 17000.0,
          "fertilizer": {
            "id": "custom",
            "name": "My custom fertilizer",
            "is_organic": true
          }
        }
      ],
      "additional_fertilizations": [
        {
          "id": "66b1a3568e3754841e8b1e6c3826a426",
          "quantity": 937.75,
          "fertilizer": {
            "id": "DCaP",
            "name": "Dycalcium phosphate",
            "is_organic": false
          }
        },
        {
          "id": "967d6add6651d0bd12f23a6d74989b07",
          "quantity": 0.0,
          "fertilizer": {
            "id": "s4-16-10",
            "name": "Suspension 4-16-10",
            "is_organic": false
          }
        },
        {
          "id": "9a58d722876085e7c8489d9e81766f31",
          "quantity": 0.0,
          "fertilizer": {
            "id": "NSAum",
            "name": "Ammonium nitrosulphate",
            "is_organic": false
          }
        }
      ]
    }
  }
}