id,name
SUGAR_OIL_FIBER_CROPS,"Захарни, маслодайни и влакнодайни култури"
LEGUMES,Бобови култури
FORAGES,Фуражи
HORTICULTURAL_CROPS,Градински култури
FRUIT_TREES_VINES_AND_SHRUBS,"Овощни дървета, лозя и храсти"
ROOTS_TUBERS_BULBS,"Корени, грудки и луковици"
CEREALS_PSEUDO_CEREALS,Зърнени култури и псевдозърнени култури