{
    "warnings": {
        "warning": [
            {
                "timestamp": "1595956882",
                "area_est": "Peipsi j\u00e4rv",
                "area_eng": "Lake Peipus",
                "content_est": "edela- ja l\u00e4\u00e4netuul 8, puhanguti 11 m/s.",
                "content_eng": "Southwest, west wind 8, in gusts 11 m/s."
            },
            {
                "timestamp": "1595984057",
                "area_est": "L\u00e4\u00e4nemere p\u00f5hjaosa",
                "area_eng": "Northern Baltic Sea",
                "content_est": "edela- ja l\u00e4\u00e4netuul, p\u00e4rast kesk\u00f6\u00f6d p\u00f6\u00f6rdub loodesse ja p\u00f5hja puhanguti 15 m/s.",
                "content_eng": "southwest, west wind, after midnight veering northwest, north in gusts 15 m/s."
            },
            {
                "timestamp": "1595984101",
                "area_est": "Liivi lahe p\u00f5hjaosa",
                "area_eng": "Northern Gulf of Riga",
                "content_est": "Edela- ja l\u00e4\u00e4netuul puhanguti 15 m/s.",
                "content_eng": "Southwest, west wind in gusts 15 m/s."
            }
        ]
    }
}