<?xml version="1.0" encoding="utf-8"?>
<!-- Generator: Adobe Illustrator 16.0.0, SVG Export Plug-In . SVG Version: 6.00 Build 0)  -->
<!DOCTYPE svg PUBLIC "-//W3C//DTD SVG 1.1//EN" "http://www.w3.org/Graphics/SVG/1.1/DTD/svg11.dtd">
<svg version="1.1" id="Layer_1" xmlns="http://www.w3.org/2000/svg" xmlns:xlink="http://www.w3.org/1999/xlink" x="0px" y="0px"
	 width="595.443px" height="55.766px" viewBox="0 0 595.443 55.766" enable-background="new 0 0 595.443 55.766"
	 xml:space="preserve">
<g>
	<polygon fill-rule="evenodd" clip-rule="evenodd" fill="#282828" points="0,14.12 29.724,14.12 27.702,19.17 6.034,19.17 
		6.034,33.178 22.718,33.178 20.695,38.307 5.951,38.307 5.951,55.812 0,55.812 0,14.12 	"/>
	<path fill-rule="evenodd" clip-rule="evenodd" fill="#282828" d="M58.188,43.882h5.708c0,0-0.013,2.48,0.003,3.698
		c0.029,2.336,0.989,3.348,3.35,3.38l9.861-0.001c2.351-0.035,3.313-1.073,3.32-3.392v-5.376c-0.004-2.03-0.476-2.858-2.416-3.37
		l-13.619-3.582c-4.139-1.094-5.845-3.245-5.923-7.521v-5.739c0.067-4.707,2.824-7.661,7.556-7.82h12.437
		c4.488,0.145,7.244,3.046,7.374,7.509l0.007,4.764h-5.786l-0.002-3.999c-0.023-2.364-0.975-3.351-3.327-3.371l-9.077,0.001
		c-2.396,0.022-3.361,1.037-3.369,3.447l0.004,4.619c0.016,1.84,0.5,2.469,2.264,2.938l13.5,3.598
		c1.167,0.324,2.325,0.815,3.368,1.433c1.63,0.967,2.673,2.529,2.75,4.392v10.044c-0.354,3.781-2.791,5.998-7.042,6.24H64.475
		c-3.789-0.249-6.016-3.005-6.267-6.8C58.098,47.309,58.188,43.882,58.188,43.882z"/>
	<polygon fill-rule="evenodd" clip-rule="evenodd" fill="#282828" points="100.25,19.247 89.385,19.247 89.385,14.188 
		116.851,14.188 116.851,19.234 106.154,19.234 106.154,55.745 100.25,55.745 100.25,19.247 	"/>
	<path fill-rule="evenodd" clip-rule="evenodd" fill="#282828" d="M54.614,46.375c-0.035-1.207-0.288-2.459-0.691-3.598
		c-1.369-3.862-10.641-28.611-10.641-28.611h-6.667c0,0-9.272,24.749-10.64,28.611c-0.403,1.139-0.658,2.391-0.691,3.598v9.391
		h5.725v-9.723H48.89v9.723h5.724V46.375z M32.518,40.976l7.431-20.795l7.432,20.795H32.518z"/>
	<polygon fill-rule="evenodd" clip-rule="evenodd" fill="#282828" points="136.851,14.121 166.575,14.121 164.553,19.17 
		142.885,19.17 142.885,33.179 159.568,33.179 157.546,38.307 142.801,38.307 142.801,55.812 136.851,55.812 136.851,14.121 	"/>
	<path fill-rule="evenodd" clip-rule="evenodd" fill="#282828" d="M344.836,55.796V14.137h18.541c1.15,0.007,2.449,0.094,3.562,0.36
		c3.932,0.94,6.211,3.834,6.268,8.311v24.43c-0.084,5.236-3.371,8.467-8.564,8.559H344.836z M350.82,19.347v31.282h12.365
		c2.973-0.011,4.105-1.056,4.117-4.011l0.004-23.304c-0.01-2.885-1.158-3.958-4.033-3.968H350.82z"/>
	<path fill-rule="evenodd" clip-rule="evenodd" fill="#282828" d="M229.777,55.773c0.204,0,0.204,0-6.339,0l-5.232-15.637
		c-0.208-0.664-0.583-0.926-1.333-0.913l-8.412-0.005c0,16.314,0,16.314,0,16.527h-5.892c0-13.843,0-41.588,0-41.588l18.121,0.004
		c1.109,0,2.248,0.052,3.32,0.316c3.163,0.778,5.211,2.901,5.444,6.07l-0.029,12.284c-0.204,2.938-2.092,4.939-4.946,5.899
		c-0.167,0.056-0.325,0.139-0.587,0.253C225.851,44.57,227.792,50.11,229.777,55.773z M208.473,34.104h11.93
		c2.354-0.021,3.381-1.078,3.381-3.473c0-7.72,0.005,0,0.005-7.72c0-2.738-0.955-3.702-3.703-3.717h-11.613V34.104z"/>
	<path fill-rule="evenodd" clip-rule="evenodd" fill="#282828" d="M338.723,55.773c0.203,0,0.203,0-6.34,0l-5.232-15.637
		c-0.207-0.664-0.582-0.926-1.332-0.913l-8.412-0.005c0,16.314,0,16.314,0,16.527h-5.893c0-13.843,0-41.588,0-41.588l18.121,0.004
		c1.109,0,2.248,0.052,3.32,0.316c3.164,0.778,5.213,2.901,5.445,6.07l-0.029,12.284c-0.203,2.938-2.092,4.939-4.945,5.899
		c-0.166,0.056-0.324,0.139-0.588,0.253C334.795,44.57,336.738,50.11,338.723,55.773z M317.418,34.104h11.93
		c2.354-0.021,3.383-1.078,3.383-3.473c0-7.72,0.004,0,0.004-7.72c0-2.738-0.955-3.702-3.703-3.717h-11.613V34.104z"/>
	<path fill-rule="evenodd" clip-rule="evenodd" fill="#282828" d="M305.963,46.376c-0.033-1.208-0.287-2.46-0.69-3.599
		c-1.368-3.862-10.641-28.61-10.641-28.61h-6.667c0,0-9.272,24.748-10.64,28.61c-0.403,1.139-0.658,2.391-0.691,3.599v9.39h5.725
		v-9.722h17.882v9.722h5.723V46.376z M283.868,40.976l7.431-20.795l7.432,20.795H283.868z"/>
	<path fill-rule="evenodd" clip-rule="evenodd" fill="#282828" d="M197.015,23.416c-0.002-0.967-0.044-1.951-0.228-2.896
		c-0.762-3.938-3.425-6.268-7.5-6.368h-12.955c-4.074,0.101-6.736,2.431-7.499,6.368c-0.184,0.945-0.226,1.93-0.227,2.896
		c-0.018,7.877-0.004,23.423-0.004,23.423c0.001,0.782,0.06,1.567,0.147,2.345c0.403,3.585,2.792,6.368,6.363,6.598h15.396
		c3.571-0.229,5.96-3.013,6.363-6.598c0.088-0.777,0.146-1.562,0.147-2.345L197.015,23.416z M191.061,47.447
		c-0.006,2.374-1.137,3.447-3.548,3.458h-9.404c-2.411-0.011-3.542-1.084-3.547-3.458l-0.003-24.876
		c0.004-2.211,1.089-3.288,3.315-3.31h9.874c2.227,0.021,3.312,1.099,3.316,3.31L191.061,47.447z"/>
	<path fill-rule="evenodd" clip-rule="evenodd" fill="#282828" d="M276.072,14.354c0.003-0.056-0.081-0.116-0.138-0.193h-5.602
		c0,0,0.042,5.572-0.019,8.293c-0.026,1.22-0.124,2.467-0.413,3.646l-5.768,21.727l-5.712-21.983
		c-0.682-3.156-0.497-11.655-0.497-11.655H252.6c0,0,0.185,8.499-0.497,11.655l-5.712,21.983l-5.767-21.727
		c-0.29-1.18-0.387-2.427-0.414-3.646l-0.019-8.293h-5.601c-0.058,0.077-0.141,0.138-0.139,0.193
		c0.178,4.491-0.641,9.03,0.762,13.462l8.003,27.954h5.884c0,0,6.206-21.03,6.228-21.029l6.095,21.029h5.884
		c0.065-0.227,0.065-0.227,8.003-27.954C276.713,23.385,275.895,18.846,276.072,14.354z"/>
	<path fill-rule="evenodd" clip-rule="evenodd" fill="#282828" d="M464.545,55.795V14.137h18.543
		c1.148,0.007,2.449,0.094,3.562,0.36c3.932,0.939,6.211,3.833,6.266,8.31v24.431c-0.082,5.235-3.369,8.466-8.562,8.558H464.545z
		 M470.531,19.346v31.282h12.365c2.973-0.01,4.105-1.056,4.117-4.01l0.004-23.305c-0.01-2.884-1.158-3.957-4.033-3.968H470.531z"/>
	<rect x="498.467" y="14.188" fill-rule="evenodd" clip-rule="evenodd" fill="#282828" width="5.904" height="41.558"/>
	<path fill-rule="evenodd" clip-rule="evenodd" fill="#282828" d="M538.758,46.376c-0.035-1.208-0.287-2.46-0.691-3.598
		c-1.367-3.862-10.641-28.611-10.641-28.611h-6.666c0,0-9.273,24.749-10.641,28.611c-0.402,1.138-0.658,2.39-0.691,3.598v9.39h5.725
		v-9.722h17.881v9.722h5.725V46.376z M516.662,40.976l7.432-20.794l7.432,20.794H516.662z"/>
	<path fill-rule="evenodd" clip-rule="evenodd" fill="#282828" d="M422.434,14.152c-0.836-0.04-1.242,0.267-1.619,0.994
		l-10.717,20.449l-10.717-20.449c-0.377-0.728-0.783-1.034-1.619-0.994h-4.555v41.63c5.428,0,0,0,5.428,0V25.063l8.191,14.875
		c0.701,1.163,1.328,2.133,2.34,2.481c0.352,0.123,1.531,0.104,1.863,0c1.012-0.349,1.639-1.318,2.34-2.481l8.193-14.875
		c0.039,0.013,0.02,0.007,0,0v30.719h5.428v-41.63H422.434z"/>
	<polygon fill-rule="evenodd" clip-rule="evenodd" fill="#282828" points="458.49,19.346 458.49,14.137 433.045,14.137 
		433.045,31.009 433.045,36.068 433.045,55.795 458.49,55.795 458.49,50.628 439.031,50.628 439.031,36.065 456.467,36.056 
		458.49,31.009 439.031,31.009 439.031,19.346 	"/>
	<g>
		<g opacity="0.6">
			
				<linearGradient id="SVGID_1_" gradientUnits="userSpaceOnUse" x1="575.1104" y1="1438.3994" x2="593.3115" y2="1456.6006" gradientTransform="matrix(1 0 0 -1 0 1470.0391)">
				<stop  offset="0" style="stop-color:#2DC2E3"/>
				<stop  offset="1" style="stop-color:#6CC49C"/>
			</linearGradient>
			<polygon fill="url(#SVGID_1_)" points="569.691,32.825 589.074,9.16 595.443,16.943 582.439,32.825 			"/>
		</g>
		<g>
			
				<linearGradient id="SVGID_2_" gradientUnits="userSpaceOnUse" x1="575.665" y1="1467.2998" x2="593.178" y2="1449.7869" gradientTransform="matrix(1 0 0 -1 0 1470.0391)">
				<stop  offset="0" style="stop-color:#2DC2E3"/>
				<stop  offset="1" style="stop-color:#6CC49C"/>
			</linearGradient>
			<polygon fill="url(#SVGID_2_)" points="569.691,1 589.074,24.663 595.443,16.882 582.439,1 			"/>
		</g>
		<g opacity="0.6">
			
				<linearGradient id="SVGID_3_" gradientUnits="userSpaceOnUse" x1="554.1758" y1="1438.4004" x2="572.3764" y2="1456.601" gradientTransform="matrix(1 0 0 -1 0 1470.0391)">
				<stop  offset="0" style="stop-color:#2DC2E3"/>
				<stop  offset="1" style="stop-color:#6CC49C"/>
			</linearGradient>
			<polygon fill="url(#SVGID_3_)" points="548.758,32.825 568.139,9.16 574.51,16.943 561.506,32.825 			"/>
		</g>
		<g>
			
				<linearGradient id="SVGID_4_" gradientUnits="userSpaceOnUse" x1="554.7314" y1="1467.2998" x2="572.2433" y2="1449.788" gradientTransform="matrix(1 0 0 -1 0 1470.0391)">
				<stop  offset="0" style="stop-color:#2DC2E3"/>
				<stop  offset="1" style="stop-color:#6CC49C"/>
			</linearGradient>
			<polygon fill="url(#SVGID_4_)" points="548.758,1 568.139,24.663 574.51,16.882 561.506,1 			"/>
		</g>
	</g>
</g>
</svg>
