<?xml version="1.0" encoding="utf-8"?>
<!-- Generator: Adobe Illustrator 16.0.0, SVG Export Plug-In . SVG Version: 6.00 Build 0)  -->
<!DOCTYPE svg PUBLIC "-//W3C//DTD SVG 1.1//EN" "http://www.w3.org/Graphics/SVG/1.1/DTD/svg11.dtd">
<svg version="1.1" id="Layer_1" xmlns="http://www.w3.org/2000/svg" xmlns:xlink="http://www.w3.org/1999/xlink" x="0px" y="0px"
	 width="202px" height="30px" viewBox="0 0 202 30" enable-background="new 0 0 202 30" xml:space="preserve">
<g>
	<polygon fill="#ABABAB" points="0,4.442 10.065,4.442 9.379,6.152 2.043,6.152 2.043,10.895 7.692,10.895 7.008,12.631 
		2.015,12.631 2.015,18.559 0,18.559 	"/>
	<path fill="#ABABAB" d="M19.703,14.519h1.933c0,0-0.005,0.841,0.001,1.252c0.01,0.791,0.334,1.133,1.134,1.146l3.339-0.001
		c0.795-0.012,1.122-0.363,1.124-1.148v-1.819c-0.001-0.688-0.161-0.967-0.817-1.141l-4.611-1.213
		c-1.402-0.37-1.979-1.099-2.006-2.546V7.103c0.023-1.594,0.957-2.594,2.559-2.647h4.211c1.52,0.049,2.452,1.031,2.497,2.542
		l0.002,1.613H27.11V7.256c-0.008-0.8-0.331-1.133-1.127-1.141l-3.074,0.001c-0.811,0.007-1.138,0.351-1.14,1.167l0.001,1.563
		c0.005,0.624,0.169,0.836,0.766,0.995l4.572,1.218c0.395,0.11,0.786,0.276,1.14,0.485c0.552,0.327,0.905,0.856,0.932,1.487v3.4
		c-0.12,1.279-0.945,2.03-2.384,2.112h-4.962c-1.283-0.084-2.037-1.019-2.122-2.302C19.671,15.68,19.703,14.519,19.703,14.519z"/>
	<polygon fill="#ABABAB" points="33.944,6.178 30.265,6.178 30.265,4.465 39.564,4.465 39.564,6.174 35.943,6.174 35.943,18.535 
		33.944,18.535 	"/>
	<path fill="#ABABAB" d="M18.492,15.363c-0.012-0.409-0.097-0.833-0.234-1.219c-0.463-1.308-3.603-9.688-3.603-9.688h-2.257
		c0,0-3.14,8.38-3.603,9.688c-0.136,0.386-0.223,0.81-0.234,1.219v3.18H10.5v-3.292h6.055v3.292h1.938L18.492,15.363L18.492,15.363z
		 M11.01,13.535l2.516-7.041l2.516,7.041H11.01z"/>
	<polygon fill="#ABABAB" points="46.336,4.442 56.401,4.442 55.715,6.152 48.379,6.152 48.379,10.895 54.028,10.895 53.343,12.631 
		48.351,12.631 48.351,18.559 46.336,18.559 	"/>
	<path fill="#ABABAB" d="M116.757,18.553V4.447h6.278c0.39,0.002,0.828,0.032,1.206,0.123c1.331,0.318,2.104,1.298,2.12,2.813v8.271
		c-0.026,1.772-1.139,2.867-2.898,2.897L116.757,18.553L116.757,18.553z M118.784,6.211v10.591h4.187
		c1.006-0.003,1.391-0.356,1.395-1.357l0.001-7.89c-0.003-0.978-0.392-1.341-1.365-1.344H118.784z"/>
	<path fill="#ABABAB" d="M77.8,18.546c0.069,0,0.069,0-2.146,0l-1.772-5.295c-0.071-0.225-0.197-0.312-0.451-0.309l-2.849-0.001
		c0,5.523,0,5.523,0,5.596h-1.995c0-4.688,0-14.082,0-14.082l6.136,0.002c0.375,0,0.761,0.018,1.124,0.106
		c1.071,0.264,1.765,0.982,1.843,2.056l-0.009,4.16c-0.069,0.994-0.708,1.672-1.674,1.997c-0.057,0.019-0.11,0.047-0.199,0.086
		C76.47,14.752,77.128,16.628,77.8,18.546z M70.587,11.208h4.039c0.796-0.007,1.145-0.365,1.145-1.175c0-2.614,0.002,0,0.002-2.614
		c0-0.928-0.323-1.254-1.254-1.259h-3.932V11.208z"/>
	<path fill="#ABABAB" d="M114.688,18.546c0.068,0,0.068,0-2.146,0l-1.771-5.295c-0.071-0.225-0.197-0.312-0.451-0.309l-2.85-0.001
		c0,5.523,0,5.523,0,5.596h-1.994c0-4.688,0-14.082,0-14.082l6.135,0.002c0.377,0,0.762,0.018,1.125,0.106
		c1.07,0.264,1.766,0.982,1.845,2.056l-0.011,4.16c-0.068,0.994-0.709,1.672-1.674,1.997c-0.059,0.019-0.11,0.047-0.199,0.086
		C113.357,14.752,114.016,16.628,114.688,18.546z M107.475,11.208h4.039c0.797-0.007,1.146-0.365,1.146-1.175
		c0-2.614,0.002,0,0.002-2.614c0-0.928-0.323-1.254-1.254-1.259h-3.933V11.208z"/>
	<path fill="#ABABAB" d="M103.596,15.363c-0.011-0.409-0.098-0.833-0.234-1.219c-0.463-1.308-3.603-9.687-3.603-9.687h-2.257
		c0,0-3.139,8.379-3.603,9.687c-0.136,0.386-0.223,0.81-0.234,1.219v3.18h1.938v-3.292h6.055v3.292h1.938V15.363z M96.114,13.535
		l2.516-7.041l2.516,7.041H96.114z"/>
	<path fill="#ABABAB" d="M66.707,7.589c0-0.327-0.015-0.66-0.077-0.98c-0.258-1.333-1.16-2.122-2.539-2.156h-4.387
		c-1.379,0.035-2.281,0.823-2.539,2.156c-0.062,0.32-0.077,0.653-0.077,0.98c-0.007,2.668-0.002,7.933-0.002,7.933
		c0,0.264,0.021,0.529,0.05,0.793c0.136,1.215,0.945,2.156,2.155,2.233h5.212c1.209-0.077,2.018-1.021,2.154-2.233
		c0.03-0.264,0.05-0.529,0.05-0.793V7.589z M64.69,15.727c-0.001,0.803-0.384,1.166-1.201,1.172h-3.184
		c-0.816-0.006-1.199-0.369-1.201-1.172l-0.001-8.422c0.001-0.749,0.369-1.113,1.123-1.12h3.343c0.754,0.007,1.122,0.372,1.124,1.12
		L64.69,15.727z"/>
	<path fill="#ABABAB" d="M93.475,4.521c0.001-0.019-0.028-0.04-0.047-0.065h-1.896c0,0,0.014,1.887-0.007,2.808
		c-0.008,0.413-0.042,0.835-0.14,1.234l-1.953,7.355l-1.935-7.442c-0.23-1.069-0.168-3.947-0.168-3.947h-1.803
		c0,0,0.063,2.878-0.168,3.947l-1.934,7.442l-1.953-7.355c-0.099-0.399-0.131-0.821-0.14-1.234l-0.007-2.808H79.43
		c-0.02,0.026-0.048,0.047-0.047,0.065c0.061,1.521-0.217,3.058,0.258,4.558l2.71,9.465h1.992c0,0,2.101-7.12,2.108-7.12l2.064,7.12
		h1.992c0.022-0.077,0.022-0.077,2.709-9.465C93.692,7.579,93.415,6.042,93.475,4.521z"/>
	<path fill="#ABABAB" d="M157.289,18.552V4.447h6.277c0.391,0.002,0.83,0.032,1.207,0.123c1.33,0.318,2.104,1.298,2.121,2.813v8.271
		c-0.027,1.772-1.142,2.867-2.898,2.896L157.289,18.552L157.289,18.552z M159.316,6.211v10.591h4.187
		c1.006-0.003,1.39-0.356,1.394-1.357l0.002-7.891c-0.004-0.977-0.393-1.34-1.364-1.343H159.316z"/>
	<rect x="168.773" y="4.465" fill="#ABABAB" width="2" height="14.07"/>
	<path fill="#ABABAB" d="M182.417,15.363c-0.013-0.409-0.099-0.833-0.233-1.218c-0.463-1.308-3.604-9.688-3.604-9.688h-2.258
		c0,0-3.139,8.38-3.604,9.688c-0.137,0.385-0.223,0.809-0.232,1.218v3.18h1.938v-3.292h6.055v3.292h1.938L182.417,15.363
		L182.417,15.363z M174.936,13.535l2.518-7.041l2.516,7.041H174.936z"/>
	<path fill="#ABABAB" d="M143.031,4.453c-0.283-0.014-0.422,0.09-0.549,0.336l-3.629,6.924l-3.629-6.924
		c-0.127-0.247-0.266-0.35-0.548-0.336h-1.543v14.095c1.839,0,0,0,1.839,0v-10.4l2.772,5.036c0.237,0.395,0.45,0.723,0.793,0.84
		c0.119,0.042,0.519,0.035,0.63,0c0.344-0.118,0.557-0.446,0.793-0.84l2.773-5.036c0.014,0.004,0.008,0.002,0,0v10.4h1.838V4.453
		H143.031z"/>
	<polygon fill="#ABABAB" points="155.238,6.211 155.238,4.447 146.624,4.447 146.624,10.16 146.624,11.873 146.624,18.552 
		155.238,18.552 155.238,16.803 148.65,16.803 148.65,11.872 154.555,11.869 155.238,10.16 148.65,10.16 148.65,6.211 	"/>
	<g>
		<g opacity="0.6">
			
				<linearGradient id="SVGID_1_" gradientUnits="userSpaceOnUse" x1="308.2256" y1="-352.665" x2="314.3887" y2="-358.8281" gradientTransform="matrix(1 0 0 1 -113.5 363.0391)">
				<stop  offset="0" style="stop-color:#0DC7E7"/>
				<stop  offset="1" style="stop-color:#2CEEAB"/>
			</linearGradient>
			<polygon fill="url(#SVGID_1_)" points="192.891,10.775 199.453,2.763 201.609,5.397 197.207,10.775 			"/>
		</g>
		<g>
			
				<linearGradient id="SVGID_2_" gradientUnits="userSpaceOnUse" x1="308.4131" y1="-362.4507" x2="314.3419" y2="-356.5219" gradientTransform="matrix(1 0 0 1 -113.5 363.0391)">
				<stop  offset="0" style="stop-color:#0DC7E7"/>
				<stop  offset="1" style="stop-color:#2CEEAB"/>
			</linearGradient>
			<polygon fill="url(#SVGID_2_)" points="192.891,0 199.453,8.011 201.609,5.377 197.207,0 			"/>
		</g>
		<g opacity="0.6">
			
				<linearGradient id="SVGID_3_" gradientUnits="userSpaceOnUse" x1="301.1387" y1="-352.666" x2="307.2997" y2="-358.8271" gradientTransform="matrix(1 0 0 1 -113.5 363.0391)">
				<stop  offset="0" style="stop-color:#0DC7E7"/>
				<stop  offset="1" style="stop-color:#2CEEAB"/>
			</linearGradient>
			<polygon fill="url(#SVGID_3_)" points="185.803,10.775 192.363,2.763 194.521,5.397 190.119,10.775 			"/>
		</g>
		<g>
			
				<linearGradient id="SVGID_4_" gradientUnits="userSpaceOnUse" x1="301.3252" y1="-362.4502" x2="307.2547" y2="-356.5209" gradientTransform="matrix(1 0 0 1 -113.5 363.0391)">
				<stop  offset="0" style="stop-color:#0DC7E7"/>
				<stop  offset="1" style="stop-color:#2CEEAB"/>
			</linearGradient>
			<polygon fill="url(#SVGID_4_)" points="185.803,0 192.363,8.011 194.521,5.377 190.119,0 			"/>
		</g>
	</g>
</g>
</svg>
