module infrastructure

go 1.19

require (
	cloud.google.com/go/pubsub v1.26.0
	github.com/joho/godotenv v1.4.0
	github.com/rs/zerolog v1.28.0
	google.golang.org/api v0.99.0
)

require (
	cloud.google.com/go v0.104.0 // indirect
	cloud.google.com/go/compute v1.10.0 // indirect
	cloud.google.com/go/iam v0.5.0 // indirect
	github.com/golang/groupcache v0.0.0-20200121045136-8c9f03a8e57e // indirect
	github.com/golang/protobuf v1.5.2 // indirect
	github.com/google/go-cmp v0.5.9 // indirect
	github.com/googleapis/enterprise-certificate-proxy v0.2.0 // indirect
	github.com/googleapis/gax-go/v2 v2.6.0 // indirect
	github.com/mattn/go-colorable v0.1.12 // indirect
	github.com/mattn/go-isatty v0.0.14 // indirect
	go.opencensus.io v0.23.0 // indirect
	golang.org/x/net v0.0.0-20221012135044-0b7e1fb9d458 // indirect
	golang.org/x/oauth2 v0.0.0-20221014153046-6fdb5e3db783 // indirect
	golang.org/x/sync v0.0.0-20220929204114-8fcdb60fdcc0 // indirect
	golang.org/x/sys v0.0.0-20220728004956-3c1f35247d10 // indirect
	golang.org/x/text v0.3.7 // indirect
	google.golang.org/appengine v1.6.7 // indirect
	google.golang.org/genproto v0.0.0-20221010155953-15ba04fc1c0e // indirect
	google.golang.org/grpc v1.50.1 // indirect
	google.golang.org/protobuf v1.28.1 // indirect
)
