%YAML 1.1
%TAG !u! tag:unity3d.com,2011:
--- !u!1001 &228531619516625161
PrefabInstance:
  m_ObjectHideFlags: 0
  serializedVersion: 2
  m_Modification:
    m_TransformParent: {fileID: 0}
    m_Modifications:
    - target: {fileID: 6451458187397300129, guid: bf9b28290931afa4a92dc4c292d3adea,
        type: 3}
      propertyPath: m_RootOrder
      value: 0
      objectReference: {fileID: 0}
    - target: {fileID: 6451458187397300129, guid: bf9b28290931afa4a92dc4c292d3adea,
        type: 3}
      propertyPath: m_LocalPosition.x
      value: -7.86
      objectReference: {fileID: 0}
    - target: {fileID: 6451458187397300129, guid: bf9b28290931afa4a92dc4c292d3adea,
        type: 3}
      propertyPath: m_LocalPosition.y
      value: 5.76
      objectReference: {fileID: 0}
    - target: {fileID: 6451458187397300129, guid: bf9b28290931afa4a92dc4c292d3adea,
        type: 3}
      propertyPath: m_LocalPosition.z
      value: -5.3500004
      objectReference: {fileID: 0}
    - target: {fileID: 6451458187397300129, guid: bf9b28290931afa4a92dc4c292d3adea,
        type: 3}
      propertyPath: m_LocalRotation.w
      value: 1
      objectReference: {fileID: 0}
    - target: {fileID: 6451458187397300129, guid: bf9b28290931afa4a92dc4c292d3adea,
        type: 3}
      propertyPath: m_LocalRotation.x
      value: 0
      objectReference: {fileID: 0}
    - target: {fileID: 6451458187397300129, guid: bf9b28290931afa4a92dc4c292d3adea,
        type: 3}
      propertyPath: m_LocalRotation.y
      value: 0
      objectReference: {fileID: 0}
    - target: {fileID: 6451458187397300129, guid: bf9b28290931afa4a92dc4c292d3adea,
        type: 3}
      propertyPath: m_LocalRotation.z
      value: 0
      objectReference: {fileID: 0}
    - target: {fileID: 6451458187397300129, guid: bf9b28290931afa4a92dc4c292d3adea,
        type: 3}
      propertyPath: m_LocalEulerAnglesHint.x
      value: 0
      objectReference: {fileID: 0}
    - target: {fileID: 6451458187397300129, guid: bf9b28290931afa4a92dc4c292d3adea,
        type: 3}
      propertyPath: m_LocalEulerAnglesHint.y
      value: 0
      objectReference: {fileID: 0}
    - target: {fileID: 6451458187397300129, guid: bf9b28290931afa4a92dc4c292d3adea,
        type: 3}
      propertyPath: m_LocalEulerAnglesHint.z
      value: 0
      objectReference: {fileID: 0}
    - target: {fileID: 6451458187397300130, guid: bf9b28290931afa4a92dc4c292d3adea,
        type: 3}
      propertyPath: m_Name
      value: Sci-Fi Commercial Display 45 Degree Mount
      objectReference: {fileID: 0}
    m_RemovedComponents: []
  m_SourcePrefab: {fileID: 100100000, guid: bf9b28290931afa4a92dc4c292d3adea, type: 3}
