<svg width="51" height="51" viewBox="0 0 51 51" fill="none" xmlns="http://www.w3.org/2000/svg">
<path fill-rule="evenodd" clip-rule="evenodd" d="M25.5 0.916664C11.9054 0.916664 0.916626 11.9054 0.916626 25.5C0.916626 39.0946 11.9054 50.0833 25.5 50.0833C39.0945 50.0833 50.0833 39.0946 50.0833 25.5C50.0833 11.9054 39.0945 0.916664 25.5 0.916664ZM25.5 45.1667C14.6587 45.1667 5.83329 36.3412 5.83329 25.5C5.83329 14.6587 14.6587 5.83333 25.5 5.83333C36.3412 5.83333 45.1666 14.6587 45.1666 25.5C45.1666 36.3412 36.3412 45.1667 25.5 45.1667ZM25.5 22.0337L34.3254 13.2083L37.7916 16.6746L28.9662 25.5L37.7916 34.3254L34.3254 37.7917L25.5 28.9662L16.6745 37.7917L13.2083 34.3254L22.0337 25.5L13.2083 16.6746L16.6745 13.2083L25.5 22.0337Z" fill="#EB5757"/>
</svg>
