<?xml version="1.0" standalone="no"?>
<!DOCTYPE svg PUBLIC "-//W3C//DTD SVG 20010904//EN"
        "http://www.w3.org/TR/2001/REC-SVG-20010904/DTD/svg10.dtd">
<svg version="1.0" xmlns="http://www.w3.org/2000/svg"
     width="1024.000000pt" height="1024.000000pt" viewBox="0 0 1024.000000 1024.000000"
     preserveAspectRatio="xMidYMid meet">
    <metadata>
        Created by potrace 1.10, written by Peter Selinger 2001-2011
    </metadata>
    <g id="Page-1" stroke="none" stroke-width="1" fill="none" fill-rule="evenodd">
        <g id="vector-Kopie" transform="translate(153.000000, 0.000000)" fill="#000000">
            <path d="M604.278562,549.516848 L603.658,610.489 C603.884,610.612 604.05,610.575 604.174,610.488 C604.297,610.401 604.362,610.282 604.431,610.187 C604.692,609.824 605.143,609.49 605.364,609.183 C605.543,608.935 605.658,608.73 605.815,608.514 C605.983,608.28 606.03,607.965 606.136,607.744 C606.208,607.594 606.772,607.547 606.909,607.476 C607.056,607.399 607.343,606.996 607.488,606.806 C607.6,606.661 607.889,606.178 607.938,605.97 C607.989,605.76 608.143,605.444 608.259,605.201 C608.405,604.897 608.593,604.72 608.774,604.532 C608.992,604.305 609.889,604.803 609.968,604.864 C610.31,605.129 610.571,605.42 610.872,605.731 C611.130935,606.001648 611.368638,606.29184 611.583,606.599 C611.805,606.903 611.873,607.285 612.101,607.6 C612.3,607.874 612.747,608.034 612.973,608.267 C613.088,608.385 613.237,609.078 613.33,609.268 C613.564,609.752 614.322,610.028 614.718,610.335 C614.972,610.532 615.357,610.825 615.654,610.901 C616.078,611.01 616.366,611.602 616.752,611.801 C617.034,611.947 617.295,612.317 617.592,612.502 C617.629,612.524 617.659,612.57 617.689,612.602 C618.02,612.943 618.399,613.061 618.787,613.301 C619.149,613.526 619.437,613.67 619.82,613.867 C620.096,614.01 620.392,614.28 620.691,614.434 C620.966,614.576 621.416,614.767 621.724,614.766 C622.185,614.765 622.196,614.643 622.433,614.397 C622.627,614.195 622.679,614.016 622.786,613.895 C622.894,613.775 623.035,613.693 623.367,613.761 C623.457,613.779 623.566,613.811 623.657,613.827 C624.030176,613.889262 624.407677,613.92203 624.786,613.925 C625.232,613.924 625.666,613.957 626.108,613.956 C626.498,613.955 626.604,613.581 626.978,613.387 C627.016,613.367 627.044,613.318 627.074,613.286 C627.314,613.036 627.752,612.833 627.976,612.716 C628.24,612.579 628.547,612.548 628.879,612.548 C629.339,612.547 629.443,612.313 629.846,612.312 C630.324,612.311 630.533,612.242 630.812,612.01 C631.062,611.802 631.402,611.72 631.682,611.574 C631.876,611.473 632.063,611.017 632.133,610.871 C632.198,610.734 632.773,610.402 632.906,610.402 C633.039,610.402 633.409,610.025 633.453,609.933 C633.582,609.665 634.376,609.731 634.71,609.73 C635.067,609.73 635.238,609.874 635.516,609.729 C635.7,609.633 635.895,609.301 636.031,609.16 C636.258,608.924 636.666,608.968 636.869,608.757 C637.01,608.61 637.083,608.557 637.288,608.556 C637.661,608.168 638.141,608.377 638.77,607.651 C639.256,607.089 642.695,604.99 643.375,604.636 C643.596,604.521 643.882,604.654 644.149,604.735 C644.417,604.815 644.657,604.819 644.826,604.466 C644.959,604.189 645.255,604.23 645.535,604.331 C645.816,604.432 646.099,604.605 646.213,604.664 C646.779,604.956 647.145,605.498 647.763,605.497 C648.138,605.496 648.34,605.432 648.536,605.228 C648.808,604.945 648.926,604.753 649.212,604.358 C649.404,604.092 649.324,603.953 649.727,604.056 C650.116,604.156 650.564,604.889 650.954,605.09 C651.238,605.236 651.602,605.155 651.922,605.155 C652.216,605.154 652.765,604.562 652.823,604.318 C652.882,604.074 652.966,604.009 653.081,604.05 C653.195,604.091 653.345,604.223 653.468,604.35 C653.974,604.873 654.07,605.24 654.599,605.718 C654.931,606.018 655.33,606.478 655.73,606.685 C656.121,606.887 656.393,607.492 656.603,607.853 C656.831,608.245 657.192,608.319 657.603,608.319 C658.009,608.318 658.025,608.178 658.151,607.917 C658.211,607.932 658.283,607.934 658.344,607.95 C658.573,608.009 658.766,607.611 658.859,607.514 C658.881,607.492 658.893,607.514 658.924,607.514 C658.926,607.514 659.527,607.089 659.632,607.045 C659.831,606.962 660.269,607.042 660.406,607.077 C660.766,607.17 660.942,606.999 661.115,606.909 C661.363,606.78 661.533,606.491 661.727,606.34 C661.972,606.149 662.224,606.308 662.533,606.372 C662.856,606.438 663.182,606.588 663.501,606.671 C663.728,606.729 664.04,606.67 664.275,606.669 L665.178,606.668 C665.284,606.667 665.378,606.55 665.436,606.433 C667.778,610.697 670.17,615.004 673.491,620.619 C677.915,628.099 682.994,636.606 688.242,645.718 C693.489,654.83 698.909,664.556 703.934,674.424 C706.436064,679.32366 708.831957,684.276816 711.12,689.28 C713.381,694.239 715.492,699.195 717.371,704.07 C717.494,704.363 717.253,704.513 717.049,704.672 C716.863,704.817 716.743,704.886 716.534,704.94 C716.341,704.991 716.151,705.19 715.986,705.275 C715.628,705.462 715.392,705.806 715.085,706.046 C714.879,706.206 714.628,706.511 714.506,706.681 C714.317,706.943 714.152,707.105 713.991,707.384 C713.881,707.575 713.801,707.779 713.702,707.986 C713.601,708.196 713.272,708.433 713.09,708.622 C712.863,708.858 712.689,709.121 712.576,709.358 C712.398,709.727 711.83,709.891 711.545,710.128 C711.35,710.291 711.217,710.369 711.062,710.53 C710.896,710.703 710.721,710.785 710.547,710.965 C710.415,711.103 710.521,711.253 710.677,711.366 C710.803478,711.457364 710.945425,711.525119 711.096,711.566 C711.285,711.593 711.54,711.791 711.645,711.899 C711.915,712.178 712.179,712.216 712.517,712.332 C712.742,712.409 712.939,712.45 713.162,712.565 C713.574,712.777 713.538,712.996 713.68,713.432 C713.775,713.728 713.777,713.984 713.778,714.301 C713.778,714.536 713.445,714.848 713.295,715.003 C713.102,715.204 712.826,715.277 712.684,715.573 C712.526,715.901 712.21,716.278 711.944,716.476 C711.675,716.676 711.388,716.865 711.106,717.012 C710.756,717.195 710.454,717.304 710.107,717.448 C709.879,717.543 709.578,717.65 709.334,717.65 C709.206,717.65 708.959,717.001 708.849,716.916 C708.557,716.69 708.089,716.925 707.785,717.052 C707.547,717.151 707.359,717.241 707.205,717.454 C707.072,717.639 707.016,717.896 706.787,717.956 C706.57,718.012 706.36,718.199 706.207,718.358 C706.104,718.465 705.873,718.498 705.756,718.559 C705.563,718.76 705.348,718.938 705.145,719.128 C704.743,719.502 704.476,719.985 704.179,720.433 C703.882,720.881 703.555,721.293 703.085,721.538 C702.182,722.007 701.668,722.609 701.283,723.412 C700.873,724.264 699.988,724.823 699.223,725.42 C698.864,725.7 698.708,725.992 698.611,726.324 C698.515,726.655 698.477,727.026 698.323,727.427 C697.986,728.306 697.903,729.328 697.554,730.235 C697.262,730.996 697.041,731.687 697.043,732.642 C697.044,733.142 697.181,733.457 697.4,733.71 C697.618,733.963 697.918,734.153 698.207,734.377 C698.808,734.842 698.984,735.024 699.274,735.711 L693.992045,738.259233 C694.080011,739.790981 694.15168,741.460468 694.2,743.2 C694.5,755.8 694.4,756.7 692.3,759.3 C689.7,762.5 689.8,762.1 690.9,771.3 C691.6,776 692.6,779.1 694.3,781.3 C696.6,784.3 700.4,792.1 699.8,792.4 C699.6,792.5 697.8,793.3 695.8,794.3 C692.5,795.8 692,796.4 692,799.4 C692,802.2 691.3,803.4 688,806 C685.8,807.7 683.7,810.2 683.4,811.5 C683.1,812.8 681.8,814.6 680.5,815.4 C678.8,816.5 678,818.1 677.8,820.7 C677.6,823.8 677.1,824.6 675.3,824.8 C673.8,825 672.8,826 672.4,827.8 C672.1,829.3 671.4,832 670.9,833.9 C670.2,836.9 670.5,837.8 673.1,841.2 C674.8,843.3 677.5,845.7 679.1,846.6 C683.4,848.8 683.1,852.9 678.4,856.5 C673.4,860.4 668.9,870 669.6,875.5 C670.6,882.6 677.2,902.4 679.3,904.2 C680.5,905.4 682.8,906 685.7,906 C689.1,906 691.2,906.7 694.7,909.2 L699.2,912.5 L696.8,914.3 C689.1,920.4 687.8,922.1 688.5,926 C689.1,929.5 689,929.7 684.6,932.1 C682.1,933.4 680,935.1 680,935.9 C680,936.7 677.8,939.9 675.2,942.9 C672.5,946 669.5,949.7 668.5,951.3 C667.6,952.8 664.5,955.3 661.9,956.8 C658.3,958.7 656.7,960.4 656.1,962.5 C655.2,965.6 655.5,966 660.3,969.5 C661.9,970.6 662.1,971.6 661.5,976.4 C660.9,981.2 660.3,982.3 657.2,984.7 C654.6,986.7 652.7,987.3 649.9,987.1 C646.9,987 645.8,987.4 644.6,989.3 C643.2,991.4 643.2,992.3 645.1,999.3 L647.2,1007.1 L644.9,1011.6 C642,1017.2 639.3,1019.2 631,1022 C626.1,1023.6 622.8,1024.1 618,1023.8 C612.3,1023.4 610.6,1022.8 604.5,1018.8 C600.7,1016.3 594.3,1011.1 590.4,1007.2 C584.2,1001.1 582.7,1000.1 578.6,999.5 C574.8,998.9 573.5,998.1 571.3,995.1 C569.8,993 566.9,990.1 564.8,988.6 C561.7,986.4 561,985.2 561,982.6 C561,980.8 559.6,976.6 558,973.3 C555.3,967.9 554.3,967 548.7,964.2 C545.3,962.4 541.1,960.7 539.3,960.4 C537.3,960 535,958.4 533,955.9 C531.3,953.8 529.1,952 528,952 C527,952 523.9,950.2 521.2,948 C518.4,945.9 515,943.8 513.6,943.4 C511.9,943 510.9,941.9 510.5,939.9 C510.1,938 508.7,936.4 506.8,935.4 C502.9,933.4 495.1,931 492.3,931 C491.1,931 486.5,929.4 482,927.5 C477.5,925.6 473,924 472.1,924 C471.1,924 469.3,922.9 468,921.5 C466.7,920.1 465,919 464.1,919 C463.3,919 460.1,917.2 457,915.1 C451,910.9 447.5,909.7 436,907.9 L428.5,906.8 L419,898 C410.8,890.4 409,889.3 406.7,889.7 C403,890.4 398.2,888.4 393.5,884 C391.3,881.9 388.3,880 386.8,879.6 C385.3,879.3 381.5,877.3 378.3,875.1 C375.1,873 370.1,870.1 367.3,868.6 C364.4,867.2 359.5,863.5 356.4,860.5 C353.2,857.5 350.3,855 349.7,855 C349.2,855 349,854.1 349.3,853 C349.7,851.5 349.1,850.6 346.9,849.5 C345.3,848.6 343,845.9 341.6,843.2 C338.7,837.5 334.8,833.7 329.7,831.6 C327.5,830.7 323.6,828.2 320.8,826 C318,823.8 315.1,822 314.4,822 C313.6,822 313,821 313,819.7 C312.9,815.7 309.4,809.5 304.9,805.6 C301.7,802.9 300.5,801.1 300.5,799.2 C300.5,797.2 299.5,795.9 296.9,794.2 C293.6,792.1 293.1,791.2 292.5,786.4 C292.1,782.6 291.2,780.6 289.8,779.6 C286.7,777.4 288,773.1 291.5,773.8 C293.7,774.2 294,773.9 294,771.5 C294,770 294.7,766.4 295.6,763.4 C297,758.4 297,757.5 295.6,753.3 C294.7,750.8 292,746.6 289.5,743.9 C287,741.3 285,738.5 285,737.7 C285,736.9 283.7,734.6 282.1,732.6 C280.2,730.2 278.9,727.2 278.5,724 C278,720.6 277.2,718.6 276,718 C275,717.4 271.6,713.4 268.6,708.9 C264.2,702.6 263,700 263,697.1 C263,693.5 262.6,693.1 254.6,687.7 L246.2,682 L244.4,675.2 C243.4,671.5 240,663.2 236.9,656.6 C230.9,644.2 229,642 219.8,636.7 C217.1,635.1 215,633.8 214.9,633.7 C214.9,633.6 214.5,630.1 214.1,625.9 C213.2,617 207.9,605.1 202.1,598.6 C195,590.8 189.4,582.5 188.1,578 C187.4,575.5 185.2,571 183.3,567.9 C180.6,563.4 179.8,560.9 179.3,555.2 C178.8,548.6 178.5,547.8 175.4,545.5 C172.6,543.3 171.9,541.9 170,533.5 C168.4,526.7 167.1,523.2 165.4,521.5 C164.1,520.2 163,518.7 163,518.2 C163,517.7 161.7,516.7 160,516 C157.9,515.1 157,514.1 157,512.5 C157,509 154.9,503.9 151.2,498.3 C148.4,494.1 148,492.8 148.9,491.2 C150.7,487.8 149.1,483.2 144.8,479.7 C142.6,477.9 140,474.6 139,472.3 C136.3,466.3 123.7,447.1 122.4,447 C120.2,446.9 110.2,433 109.5,429 C109.1,426.6 107.4,423.5 105.1,420.8 C103,418.4 100.7,414.7 100,412.5 C98.6,408 88.8,394 84,389.5 C82.2,387.8 80,384.6 79,382.4 C76.2,376 71.4,372 58.4,365.5 C51.9,362.2 45.2,358.5 43.5,357.4 C41.8,356.2 38,354.9 35,354.6 C32,354.2 27.9,352.9 26,351.6 C14,343.9 11.9,342.3 11,339.9 C9.1,335.4 11.9,324.5 14.3,326.9 C15.5,328.1 22.9,328.4 24.6,327.2 C29.5,324 29.9,311.4 25.1,308.4 C23.7,307.4 19.4,303.7 15.7,300.1 C8.1,292.8 7.9,291.8 12.3,283.3 L14.5,279.1 L10.9,275.3 C4.1,268.1 5.68434189e-14,262.3 5.68434189e-14,259.9 C5.68434189e-14,258.6 0.7,255 1.5,252 C2.3,249 3,244.4 3,241.8 C3,237.2 3.1,237 10.5,231 C16,226.5 18,224.2 18,222.5 C18,220.5 18.7,220 21.5,219.4 C24.6,218.8 25.1,218.4 25.6,215 C26.5,209.2 35.4,202 47.3,197.5 C49.9,196.5 53.3,194.2 54.9,192.4 L57.8,189.2 L59.9,191.4 C61.1,192.6 62,194.5 62,195.6 C62,196.7 62.6,198.4 63.4,199.5 C64.1,200.6 65,205.4 65.3,210.2 L65.9,218.9 L62.4,220 C60.5,220.7 59,221.8 59,222.7 C59,223.7 58.4,224 57.4,223.6 C50.7,221 48.4,222.6 49.5,228.9 C49.9,231.6 50.7,233 52.1,233.3 C55.4,234.2 55.5,236.8 52.2,241.3 C48.3,246.8 49.2,249 55.3,249 C58.9,249 60.1,248.4 64.5,244 L69.6,238.9 L74.1,242.5 C76.5,244.4 79.3,246 80.4,246 C81.4,246 83.9,246.9 86,248.1 C89,249.8 90.3,250 93.1,249.2 C96.2,248.4 96.9,248.6 100.2,251.4 C102.9,253.7 104.5,256.4 106.5,262.1 C110.2,272.8 114.1,276.4 123.9,278.4 C128,279.3 131.4,279.9 131.5,279.7 C133.9,273.9 135.3,272 137.5,271.4 C139.9,270.8 140.1,270.4 139.5,267 C138.8,263 139.6,262 148,256.7 C151.3,254.6 151.6,254 152.3,247.5 C152.8,243.6 154.1,238.2 155.2,235.5 C156.4,232.7 157.6,227.6 157.9,224 C158.4,218.1 158.9,217.2 162.3,214 C165.9,210.7 166.1,210.1 166.7,202.5 C167,198.1 167.7,193.5 168.1,192.2 C169.3,189.1 172.2,189.5 174.9,193.1 C177.2,196.2 177.2,196.2 179.2,194.2 C180.9,192.6 181,191.9 180,190 C179,188.1 179.3,187.3 182.5,183.2 C184.5,180.6 188.5,175.5 191.3,171.8 L196.5,165.1 L232.6,152.9 L268.7,140.8 L278.6,132.9 C284.6,128.2 296.1,116.9 307.5,104.6 L326.5,84.2 L330.3,69.9 C335.1,52 335.7,51 340.9,51.7 C346,52.4 346.6,50.6 344.1,42.4 C342.5,36.9 342.4,35.9 343.7,32.9 C345.1,29.6 345.1,29.5 341.5,26.6 C339.5,25 337,21.9 335.8,19.6 C333.1,14.2 330.2,11.1 326.2,9.4 C318.3,6.1 326.2,2.4 335.6,5 C339.1,6 340.2,5.9 342.9,4.5 C344.7,3.6 346.4,2.2 346.7,1.4 C347.3,-0.3 348,-0.2 356.5,3.4 C359.7,4.7 363.3,7 364.3,8.4 C365.7,10.4 367,11 369.9,11 C373.4,11 373.9,11.4 376.1,15.4 C377.9,18.8 379.3,20.1 382.2,21.1 C384.6,21.8 386.8,23.5 387.8,25.2 C388.7,26.7 390.2,28.2 391,28.5 C392.8,29.1 397,35.9 397,38.2 C397,39 398.1,41.1 399.4,42.8 C400.9,44.9 401.6,46.9 401.3,48.4 C400.9,50.1 401.7,52.1 403.5,54.4 C405.7,57.3 406.9,58 409.7,58 C412.4,58 414.3,58.9 417.1,61.5 C419.3,63.4 421.7,65 422.5,65 C423.3,65 424.4,65.9 425,66.9 C425.5,68 427.4,69.2 429.2,69.5 C433.2,70.4 440.4,75.4 442.7,78.9 C443.8,80.7 444.5,83.8 444.5,88.4 C444.7,94.7 444.9,95.5 447.5,97.6 C450.8,100.2 455.9,101.4 459.9,100.5 C462.5,99.9 462.8,100.2 464.8,105.5 C467.2,111.8 467.6,119.5 465.8,123.6 C464.6,126.1 464.8,126.5 471,132.1 C474.6,135.3 478.2,137.9 479,137.9 C479.8,137.9 482.3,137.3 484.5,136.5 C487.4,135.5 488.8,135.4 489.7,136.2 C490.7,137 491.7,137 493.6,136.1 C496.5,134.8 506.8,134.6 510.2,135.8 C511.5,136.3 514.6,136.5 517.2,136.2 C521.1,135.9 523.2,134.7 530.7,128.9 C543.1,119.2 542.9,119.3 549.2,122 C552.1,123.2 555.6,125.1 556.9,126.1 C558.2,127.2 560.1,128 561.1,128 C562.1,128 563.3,128.7 563.8,129.6 C564.6,131.1 565.6,131.1 575.6,129.1 C581.6,127.9 587.9,126 589.7,124.8 C593.6,122.5 594.3,122.8 602.9,130.4 C606.5,133.6 610.7,135.9 617.9,138.7 C623.5,140.8 628,143 628,143.6 C628,144.9 631.7,148.2 634.8,149.5 C637,150.5 636.4,151.4 618.5,179.3 L599.9,208.1 L602.2,210 C606,213.1 611.7,213.2 616.2,210.3 L620.2,207.8 L621.8,210.2 C622.7,211.5 624.9,214.1 626.7,216 C628.4,218 630.2,220.9 630.6,222.5 C631.5,226.6 632.4,227.5 638.6,231.1 L644.1,234.2 L641.9,237.8 C640.6,239.9 639.5,241.7 639.4,241.9 C639.2,242.1 637.9,241.5 636.5,240.6 C634.9,239.6 633.1,239.2 631.8,239.5 C629,240.4 622,237.2 622,235 C622,233.3 618.1,231.9 613.5,231.9 C612.4,232 608.1,232 603.9,231.9 C595.4,231.9 594.8,232.3 590.5,240.3 C589.1,242.9 587.9,244 586.2,244 C584.9,244 582.7,244.6 581.2,245.4 C579,246.5 577.4,246.6 573.2,245.7 C568.4,244.7 567.7,244.8 566.9,246.3 C566.3,247.3 564.7,248 563.1,248 C561.6,248 558.1,248.7 555.4,249.5 C552.7,250.3 547.1,251 543,251 C536.2,251 535,251.3 529.5,254.7 C526.2,256.7 522.9,259.2 522.2,260.1 C520.9,262 511.2,266 508,266 C506.8,266 505.9,267 505.5,268.9 C504.8,272.3 503.8,273.2 499,275 C497.1,275.7 494.6,277.2 493.5,278.4 C492.4,279.6 488.8,281.6 485.5,282.9 C477.2,286.2 477,286.5 477,292.7 C477,297.1 476.5,298.8 474.6,301.1 C472.2,304 472.1,304.1 473.7,308.3 C476.1,314.8 474.3,319.7 467.5,325.6 C464.5,328.1 462,331 462,331.9 C462,332.8 461.2,335.3 460.2,337.4 L458.4,341.4 L461.2,343.9 C463.6,346.1 464,347.3 464.1,352.5 C464.2,355.8 463.8,359.5 463.2,360.7 C461.4,364 457,367 454.1,367 C451.1,367 444,371.2 436.9,377.2 C432.8,380.6 431.7,382.4 429.6,388.8 C427.4,395.2 427.2,396.6 428.4,397.9 C432.1,402.4 430.9,407.2 425.6,409 C420.9,410.5 419,412.5 419,415.9 C419,417.4 418.5,419.1 417.8,419.8 C416.9,420.7 417.7,422.1 421.5,426 C424.3,428.9 427.3,431 428.6,431 C429.8,431 431.1,432 431.8,433.4 C432.6,435.3 432.5,436.1 430.9,437.7 C428.1,440.4 429.3,444.2 433.9,447.9 C436.9,450.3 438,452.2 439.5,457.2 C441,462.5 442.2,464.4 447.1,469.1 C451.7,473.5 453,475.4 453,477.7 C453,480.9 457.4,486 460.2,486 C461.1,486 464.1,489.3 466.9,493.2 C471.2,499.3 472,501.2 472,505 C472,509.5 471.3,510.9 465.1,519.5 C463.5,521.7 462.4,523.8 462.8,524.2 C463.2,524.5 470.8,525.3 479.8,525.9 C493.3,526.7 496.6,527.2 499.4,528.9 C501.2,530.1 503.7,531 504.9,531 C508,531 510.8,534.3 512.1,539.4 C512.7,541.9 514.1,544.6 515.1,545.6 C516.6,546.9 517,548.7 517,553.3 L517,559.3 L537.3,558.7 C548.4,558.4 559.4,557.7 561.6,557.2 C563.9,556.7 568.6,554.4 572,552.2 C575.4,549.9 578.7,548 579.3,548 C579.8,548 581.9,546.2 583.8,543.9 C587.9,539.1 604.1,528 606.9,528 C609.8,528 610.2,529.5 607.9,531.6 C606.3,533 606,534.2 606.5,536.7 C606.8,538.7 606.3,542.7 604.9,547.5 C604.68189,548.230667 604.476863,548.899492 604.278562,549.516848 Z" id="Combined-Shape"></path>
        </g>
    </g>
</svg>