<svg width="56" height="57" viewBox="0 0 56 57" fill="none" xmlns="http://www.w3.org/2000/svg">
<path d="M16.9762 43.3914H6.11719C5.36505 43.3914 4.75394 44.0035 4.75394 44.7569V55.6342C4.75394 56.3876 5.36505 56.9998 6.11719 56.9998H16.9762C17.7283 56.9998 18.3394 56.3876 18.3394 55.6342V44.7569C18.3394 44.0035 17.7283 43.3914 16.9762 43.3914ZM12.7454 55.9168H10.3715V50.2427C10.724 50.431 11.1236 50.5252 11.5702 50.5252C11.9933 50.5252 12.3928 50.4075 12.7454 50.2427V55.9168ZM11.5467 49.6305C10.0659 49.6305 8.86719 48.4298 8.86719 46.9465C8.86719 45.8164 9.57232 44.8511 10.5595 44.4744V46.3814C10.5595 46.7111 10.818 46.9465 11.1471 46.9465H11.9227C12.2518 46.9465 12.5103 46.6875 12.5103 46.3814V44.4744C13.4975 44.8511 14.2027 45.8164 14.2027 46.9465C14.2262 48.4298 13.0274 49.6305 11.5467 49.6305Z" fill="white"/>
<path d="M33.6407 43.3914H22.7817C22.0296 43.3914 21.4185 44.0035 21.4185 44.7569V55.6342C21.4185 56.3876 22.0296 56.9998 22.7817 56.9998H33.6407C34.3928 56.9998 35.0039 56.3876 35.0039 55.6342V44.7569C35.0039 44.0035 34.3928 43.3914 33.6407 43.3914ZM32.5125 49.4893C32.5125 49.5834 32.442 49.6541 32.348 49.6541H26.2604C26.1663 49.6541 26.0958 49.5834 26.0958 49.4893C26.0958 49.3951 26.1663 49.3244 26.2604 49.3244H32.348C32.442 49.348 32.5125 49.4186 32.5125 49.4893ZM31.4313 47.6293C31.4783 47.6764 31.9484 48.1002 31.9484 48.5239C31.9484 48.8771 31.9484 49.0184 31.9484 49.0184C31.9484 49.089 31.8779 49.1596 31.7839 49.1596H26.8245C26.7304 49.1596 26.6599 49.089 26.6599 48.9948C26.6599 48.8536 26.6599 48.4298 26.7539 48.2414C26.801 48.1472 27.1065 47.6293 27.271 47.5822C27.2945 47.5822 27.2945 47.5822 27.318 47.5822H31.3373C31.3843 47.5822 31.4078 47.6057 31.4313 47.6293ZM31.1963 47.2526C31.1963 47.3468 31.1257 47.4174 31.0317 47.4174H27.5766C27.4826 47.4174 27.4121 47.3468 27.4121 47.2526C27.4121 47.1584 27.4826 47.0878 27.5766 47.0878H31.0317C31.1257 47.0878 31.1963 47.1584 31.1963 47.2526ZM28.5638 45.2513C28.5638 45.2042 28.5873 45.1572 28.6108 45.1336C28.6343 45.1101 28.6813 45.0865 28.7283 45.1101L29.9505 45.322C30.021 45.3455 30.0916 45.3926 30.0916 45.4868V46.7581C30.0916 46.8523 30.021 46.923 29.927 46.923H28.7283C28.6343 46.923 28.5638 46.8523 28.5638 46.7581L28.5403 46.0283C28.5403 45.9577 28.5873 45.9106 28.6343 45.887C28.6813 45.8635 28.7518 45.8164 28.7518 45.7928C28.7518 45.7693 28.6813 45.7222 28.6343 45.6987C28.5638 45.6751 28.5168 45.6045 28.5168 45.5339L28.5638 45.2513ZM23.9099 46.8288C23.8394 46.8288 23.7689 46.7817 23.7689 46.7111C23.7454 46.6169 23.7924 46.5463 23.8864 46.5227L27.4356 45.6516L23.7924 45.1101C23.6984 45.0865 23.6514 45.0159 23.6514 44.9217C23.6749 44.8275 23.7454 44.7805 23.8394 44.7805L27.9997 45.3926C28.0702 45.3926 28.1407 45.4632 28.1407 45.5574C28.1407 45.5809 28.1642 45.581 28.1642 45.6045C28.1877 45.6987 28.1407 45.7693 28.0467 45.7928L23.9569 46.8052C23.9334 46.8288 23.9334 46.8288 23.9099 46.8288ZM32.771 50.0072V55.799C32.771 55.8461 32.7475 55.8697 32.724 55.9168C32.7005 55.9403 32.6535 55.9639 32.6065 55.9639L26.0253 55.9403C25.9313 55.9403 25.8608 55.8697 25.8608 55.7755V49.9837C25.8608 49.8895 25.9313 49.8189 26.0253 49.8189H32.583C32.7005 49.8424 32.771 49.913 32.771 50.0072Z" fill="white"/>
<path d="M40.645 51.7965L40.9975 51.8436C41.021 51.8436 41.021 51.8436 41.0445 51.8671L42.7604 52.8795C42.8074 52.4086 42.8544 51.9848 42.9484 51.6081L41.3971 50.2661C41.1386 50.8076 40.786 51.4904 40.645 51.7965Z" fill="white"/>
<path d="M44.5467 53.7743C44.5467 53.7508 44.5467 53.7273 44.5467 53.7037C44.5467 53.6566 44.5467 53.6331 44.5232 53.586C44.5232 53.5624 44.4997 53.5389 44.4997 53.5154C44.4997 53.4918 44.4762 53.4447 44.4762 53.4212C44.4762 53.3976 44.4527 53.3741 44.4527 53.3506C44.4527 53.327 44.4291 53.3035 44.4291 53.3035C44.2881 53.6566 44.3116 54.2923 44.4291 54.6926C44.4291 54.669 44.4527 54.6455 44.4527 54.6219C44.4527 54.5984 44.4762 54.5748 44.4762 54.5513C44.4997 54.5278 44.4997 54.4807 44.4997 54.4571C44.4997 54.4336 44.5232 54.41 44.5232 54.3865C44.5232 54.3394 44.5467 54.2923 44.5467 54.2452C44.5467 54.2217 44.5467 54.1981 44.5467 54.1746C44.5467 54.104 44.5467 54.0333 44.5467 53.9627C44.5467 53.9392 44.5467 53.9392 44.5467 53.9156C44.5467 53.8685 44.5467 53.8214 44.5467 53.7743Z" fill="white"/>
<path d="M42.7603 54.716C42.4783 54.6689 41.6556 54.5041 40.9035 54.3628L40.739 55.8461H42.9484C42.9249 55.7283 42.9014 55.6342 42.8779 55.5635C42.8074 55.281 42.7603 55.1162 42.7603 54.716Z" fill="white"/>
<path d="M42.1257 48.312C41.7497 48.8535 41.2796 49.5363 41.068 49.8659L41.3736 49.913C41.3971 49.913 41.3971 49.913 41.4206 49.9365H41.4441L43.0189 51.2786C43.1129 50.8312 43.2539 50.4781 43.3715 50.172C43.3715 50.172 43.3715 50.172 43.348 50.172L42.1257 48.312Z" fill="white"/>
<path d="M44.7112 53.2327C44.6877 53.2327 44.6877 53.2327 44.7112 53.2327C44.6877 53.2327 44.6877 53.2327 44.7112 53.2327C44.7347 53.2798 44.7582 53.3268 44.7582 53.3739V53.3975C44.7817 53.4446 44.7817 53.4916 44.8052 53.5623V53.5858C44.8052 53.6329 44.8287 53.7035 44.8287 53.7742C44.8287 53.7977 44.8287 53.7977 44.8287 53.8213C44.8287 53.8919 44.8287 53.939 44.8287 54.0096V54.0332C44.8287 54.1038 44.8287 54.1509 44.8287 54.2215V54.2451C44.8287 54.3157 44.8052 54.3628 44.8052 54.4334V54.457C44.8052 54.504 44.7817 54.5747 44.7582 54.6218C44.7347 54.6689 44.7112 54.7159 44.7112 54.763C44.7112 54.763 44.7112 54.763 44.7112 54.7866C44.7347 54.8101 44.7582 54.8101 44.7817 54.8101C44.8287 54.7866 44.9227 54.6453 44.9462 54.3392C44.9697 53.8448 44.8522 53.3268 44.7112 53.2327Z" fill="white"/>
<path d="M42.7604 53.1622L41.0915 52.1733C40.9035 52.8326 40.645 53.6802 40.5509 54.0098C41.8907 54.2688 42.4783 54.3629 42.7368 54.41C42.7133 53.9862 42.7368 53.5624 42.7604 53.1622Z" fill="white"/>
<path d="M45.7454 45.11C43.9591 44.7803 42.5018 45.7456 42.0082 46.1224L42.1962 46.1694C42.2433 46.1694 42.2903 46.2165 42.2903 46.2636C42.3138 46.3107 42.2903 46.3578 42.2668 46.4049C42.2668 46.4049 41.3501 47.3937 40.9505 47.8646C41.068 47.8646 41.1856 47.8882 41.2091 47.8882C41.2561 47.8882 41.3031 47.9117 41.3266 47.9588C41.3501 48.0059 41.3501 48.053 41.3031 48.1C41.1151 48.3355 40.4804 49.2772 40.1984 49.7481H40.4804C40.5274 49.7481 40.5745 49.7717 40.598 49.8423C40.6215 49.8894 40.6215 49.9365 40.598 49.96C40.5509 50.0307 40.1044 50.996 39.7753 51.7023C39.9163 51.7023 40.1044 51.7258 40.1279 51.7494C40.1514 51.7729 40.1749 51.7965 40.1749 51.8435C40.1749 51.8671 40.1749 51.8906 40.1749 51.9142C40.0574 52.3144 39.7988 53.2562 39.6813 53.6329H39.9868C40.0339 53.6329 40.0809 53.6564 40.1044 53.68C40.1279 53.7035 40.1514 53.7506 40.1279 53.7977L39.7048 55.5164H39.9868C40.0339 55.5164 40.0574 55.54 40.0809 55.5635C40.1044 55.587 40.1279 55.6341 40.1279 55.6577V55.8696H40.4569L40.6215 54.3392C40.5274 54.3157 40.4334 54.3157 40.3394 54.2921C40.2924 54.2921 40.2689 54.245 40.2454 54.2215C40.2219 54.1744 40.2219 54.1744 40.8095 52.1261L40.4099 52.079C40.3629 52.079 40.3159 52.0319 40.2924 51.9848C40.2689 51.9377 40.2689 51.9377 41.1386 50.219L40.8095 50.1719C40.739 50.1719 40.692 50.1013 40.692 50.0307C40.692 49.9836 40.692 49.9836 41.8907 48.2413L41.7262 48.2178C41.6792 48.2178 41.6556 48.1942 41.6321 48.1471C41.6086 48.1 41.6086 48.053 41.6321 48.0294C41.6556 48.0059 41.6556 48.0059 42.6898 47.017C42.7603 46.9464 42.8544 46.8758 42.9014 46.8051C42.6663 46.7345 42.4783 46.6168 42.5018 46.4991C42.5018 46.452 42.5253 46.4284 42.5488 46.4049C42.7839 46.2401 43.724 45.6279 44.0531 45.4631C44.1001 45.4396 44.1471 45.4396 44.1706 45.4631C44.2176 45.4867 44.2411 45.5337 44.2411 45.5573C44.2411 45.5808 44.4527 47.4173 44.5937 48.618C44.9462 48.359 45.5809 48.0059 46.286 48.2649C47.7668 48.7828 48.5424 51.2785 48.6834 53.5152C48.7304 54.3392 48.6129 55.1397 48.4484 55.8931H50.0702C50.2112 49.5833 48.6364 45.6515 45.7454 45.11Z" fill="white"/>
<path d="M50.2817 43.3914H39.4227C38.6706 43.3914 38.0595 44.0035 38.0595 44.7569V55.6342C38.0595 56.3876 38.6706 56.9998 39.4227 56.9998H50.2817C51.0338 56.9998 51.645 56.3876 51.645 55.6342V44.7569C51.645 44.0035 51.0338 43.3914 50.2817 43.3914ZM44.9697 55.0692C44.8522 55.1634 44.7347 55.2104 44.6172 55.2104C44.5702 55.2104 44.5467 55.2104 44.4997 55.1869C44.2881 55.1163 44.1941 54.9279 44.1941 54.8808C43.9826 54.3629 43.9121 53.1621 44.4292 52.809C44.4527 52.7854 44.4762 52.7854 44.4997 52.7854C44.8522 52.7383 45.1343 52.9267 45.2753 53.3034C45.4868 53.892 45.3458 54.8102 44.9697 55.0692ZM50.3757 55.9874C50.3757 56.058 50.3052 56.1287 50.2347 56.1287H48.3074C48.2603 56.1287 48.2368 56.1051 48.2133 56.0816C48.1898 56.058 48.1663 56.0109 48.1898 55.9639C48.3544 55.1869 48.4954 54.3393 48.4484 53.4917C48.3309 51.3492 47.6022 48.9713 46.239 48.4769C45.7454 48.2885 45.2048 48.4533 44.6172 48.9477C44.4762 49.0419 43.3009 49.9837 43.0659 53.115C43.0424 53.5388 43.0189 53.9862 43.0189 54.5041V54.5277C43.0424 54.5512 43.0424 54.5748 43.0424 54.5983C43.0659 55.0692 43.0894 55.2104 43.1599 55.493C43.1834 55.6107 43.2069 55.752 43.2539 55.9639C43.2539 56.0109 43.2539 56.0345 43.2304 56.0816C43.2069 56.1287 43.1599 56.1287 43.1364 56.1287H40.0103C39.9633 56.1287 39.9398 56.1051 39.9163 56.0816C39.8928 56.058 39.8693 56.0109 39.8693 55.9874V55.7755H39.5403C39.4933 55.7755 39.4697 55.752 39.4227 55.7284C39.3757 55.7049 39.3992 55.6578 39.3992 55.6107L39.8223 53.892H39.5168C39.4697 53.892 39.4462 53.8684 39.4227 53.8449C39.3992 53.8213 39.3757 53.7743 39.3992 53.7272C39.3992 53.7272 39.3992 53.7036 39.8928 51.9614C39.7753 51.9614 39.6108 51.9614 39.5873 51.9614C39.5403 51.9614 39.4933 51.9614 39.4697 51.9143C39.4462 51.8672 39.4462 51.8201 39.4697 51.773C39.9633 50.7371 40.1984 50.2427 40.2924 50.0072H39.9868C39.9398 50.0072 39.8928 49.9837 39.8693 49.9366C39.8458 49.8895 39.8458 49.8424 39.8693 49.7953C40.0103 49.5128 40.6215 48.5946 40.9505 48.1237C40.7155 48.1002 40.598 48.0766 40.5744 48.0295C40.5509 47.9824 40.5509 47.9118 40.5744 47.8647C40.7625 47.6293 41.5851 46.7346 41.9142 46.3579L41.7027 46.3108C41.6321 46.2873 41.5851 46.2166 41.6086 46.146C41.6321 46.0518 43.4655 44.3567 45.8159 44.8275C48.848 45.4161 50.5168 49.4893 50.3757 55.9874Z" fill="white"/>
<path d="M43.0894 46.9229C43.0424 46.9699 42.9719 47.0406 42.8544 47.1347C42.6193 47.3702 42.2433 47.7233 42.0317 47.9352L42.1492 47.9588C42.1962 47.9588 42.2433 48.0059 42.2433 48.0294L43.489 49.8894C43.583 49.6775 43.7005 49.5127 43.7945 49.3479V49.3243L43.0894 46.9229Z" fill="white"/>
<path d="M42.9014 46.4285C43.0189 46.4756 43.1364 46.5227 43.1834 46.5227C43.2069 46.5227 43.2069 46.5462 43.2304 46.5462C43.2304 46.5462 43.2304 46.5462 43.2539 46.5462C43.2774 46.5698 43.2774 46.5698 43.2774 46.5933L44.0296 49.0654C44.1706 48.9006 44.2881 48.8064 44.3586 48.7358C44.2411 47.7705 44.0766 46.2637 44.0061 45.7222C43.7005 45.9105 43.2069 46.2401 42.9014 46.4285Z" fill="white"/>
<path d="M50.0232 0.141113H6.02317C2.99112 0.141113 0.523169 2.44842 0.523169 5.29725V46.5699C0.523169 48.7359 1.95693 50.5959 3.9783 51.3728V44.1448C3.9783 43.2972 4.65992 42.638 5.48257 42.638H17.5873C18.4334 42.638 19.0915 43.3208 19.0915 44.1448V51.7495H20.6193V44.1448C20.6193 43.2972 21.3009 42.638 22.1236 42.638H34.2283C35.0745 42.638 35.7326 43.3208 35.7326 44.1448V51.7495H37.2604V44.1448C37.2604 43.2972 37.942 42.638 38.7646 42.638H50.8693C51.7155 42.638 52.3736 43.3208 52.3736 44.1448V51.2316C54.2069 50.384 55.4762 48.6182 55.4762 46.5934V5.29725C55.5232 2.44842 53.0787 0.141113 50.0232 0.141113ZM20.6898 18.788L12.8394 28.7235H16.271V25.757H20.4078V32.4435H3.9783V30.7483L12.2518 20.8363H8.63214V23.7793H4.5189V17.1163H20.7133V18.788H20.6898ZM36.9078 32.4199H21.4185V28.5116H23.0873V21.0482H21.4185V17.1163H30.8202V21.0482H29.1514V28.4881H32.1599V25.2861H36.9078V32.4199ZM52.068 24.2502H47.8843V21.0482H46.5445V28.4881H48.1898V32.3964H38.8116V28.4881H40.4569V21.0482H39.1172V24.2502H34.9804V17.1163H52.068V24.2502Z" fill="white"/>
</svg>
