<svg width="23" height="24" viewBox="0 0 23 24" fill="none" xmlns="http://www.w3.org/2000/svg">
<path d="M9.80469 9.58594L12.1094 12.625V12.7734L9.80469 15.8125H8.69531L10.7109 12.7031L8.69531 9.58594H9.80469Z" fill="black" fill-opacity="0.54"/>
</svg>
