<svg width="33" height="32" viewBox="0 0 33 32" fill="none" xmlns="http://www.w3.org/2000/svg">
<rect width="33" height="32" rx="10" fill="#E6384D"/>
<rect width="1.17851" height="12.9636" transform="matrix(0.707107 0.707106 -0.707107 0.707106 21.166 11)" fill="white"/>
<rect width="1.17851" height="12.9636" transform="matrix(0.707107 0.707106 -0.707107 0.707106 21.166 11)" fill="white"/>
<rect width="1.17851" height="12.9636" transform="matrix(0.707107 0.707106 -0.707107 0.707106 21.166 11)" fill="white"/>
<rect width="1.17851" height="12.9636" transform="matrix(0.707107 0.707106 -0.707107 0.707106 21.166 11)" fill="white"/>
<rect width="1.17851" height="12.9636" transform="matrix(-0.707107 0.707106 -0.707107 -0.707106 22 20.168)" fill="white"/>
<rect width="1.17851" height="12.9636" transform="matrix(-0.707107 0.707106 -0.707107 -0.707106 22 20.168)" fill="white"/>
<rect width="1.17851" height="12.9636" transform="matrix(-0.707107 0.707106 -0.707107 -0.707106 22 20.168)" fill="white"/>
<rect width="1.17851" height="12.9636" transform="matrix(-0.707107 0.707106 -0.707107 -0.707106 22 20.168)" fill="white"/>
</svg>
