<svg width="36" height="50" viewBox="0 0 36 50" fill="none" xmlns="http://www.w3.org/2000/svg">
<mask id="mask0" mask-type="alpha" maskUnits="userSpaceOnUse" x="0" y="0" width="36" height="50">
<path d="M28.7238 10.9568C28.7238 16.7146 24.115 21.3823 18.4297 21.3823C12.7444 21.3823 8.13557 16.7146 8.13557 10.9568C8.13557 5.19892 12.7444 0.53125 18.4297 0.53125C24.115 0.53125 28.7238 5.19892 28.7238 10.9568Z" fill="#1C5B95"/>
<path d="M0.929688 35.9781C0.929688 28.4928 6.92117 22.4249 14.312 22.4249H22.5473C29.9382 22.4249 35.9297 28.4928 35.9297 35.9781C35.9297 43.4633 29.9382 49.5312 22.5473 49.5312H14.312C6.92117 49.5312 0.929688 43.4633 0.929688 35.9781Z" fill="#1C5B95"/>
</mask>
<g mask="url(#mask0)">
<ellipse cx="18.4297" cy="17.5312" rx="26.5" ry="27" fill="#1C5B95"/>
</g>
</svg>
